You are viewing a plain text version of this content. The canonical link for it is here.
Posted to builds@beam.apache.org by Apache Jenkins Server <je...@builds.apache.org> on 2020/02/12 17:57:12 UTC
Build failed in Jenkins: beam_PostCommit_Py_VR_Dataflow #5745
See <https://builds.apache.org/job/beam_PostCommit_Py_VR_Dataflow/5745/display/redirect?page=changes>
Changes:
[github] [BEAM-8201] Add other endpoint fields to provision API. (#10839)
[github] [BEAM-9269] Add commit deadline for Spanner writes. (#10752)
------------------------------------------
[...truncated 42.69 KB...]
at org.gradle.execution.plan.DefaultPlanExecutor$ExecutorWorker.run(DefaultPlanExecutor.java:129)
at org.gradle.internal.concurrent.ExecutorPolicy$CatchAndRecordFailures.onExecute(ExecutorPolicy.java:63)
at org.gradle.internal.concurrent.ManagedExecutorImpl$1.run(ManagedExecutorImpl.java:46)
at java.util.concurrent.ThreadPoolExecutor.runWorker(ThreadPoolExecutor.java:1149)
at java.util.concurrent.ThreadPoolExecutor$Worker.run(ThreadPoolExecutor.java:624)
at org.gradle.internal.concurrent.ThreadFactoryImpl$ManagedThreadRunnable.run(ThreadFactoryImpl.java:55)
at java.lang.Thread.run(Thread.java:748)
> Task :sdks:python:setupVirtualenv
Processing /home/jenkins/.cache/pip/wheels/bf/c9/a3/c538d90ef17cf7823fa51fc701a7a7a910a80f6a405bf15b1a/future-0.16.0-cp27-none-any.whl
> Task :sdks:java:extensions:protobuf:extractIncludeProto FAILED
> Task :sdks:python:test-suites:dataflow:py2:setupVirtualenv
Processing /home/jenkins/.cache/pip/wheels/bf/c9/a3/c538d90ef17cf7823fa51fc701a7a7a910a80f6a405bf15b1a/future-0.16.0-cp27-none-any.whl
> Task :runners:core-construction-java:compileJava FAILED
error: error reading <https://builds.apache.org/job/beam_PostCommit_Py_VR_Dataflow/ws/src/sdks/java/core/build/libs/beam-sdks-java-core-2.20.0-SNAPSHOT.jar;> invalid LOC header (bad signature)
<https://builds.apache.org/job/beam_PostCommit_Py_VR_Dataflow/ws/src/runners/core-construction-java/src/main/java/org/apache/beam/runners/core/construction/PTransformReplacements.java>:24: error: cannot access AppliedPTransform
import org.apache.beam.sdk.runners.AppliedPTransform;
^
bad class file: <https://builds.apache.org/job/beam_PostCommit_Py_VR_Dataflow/ws/src/sdks/java/core/build/libs/beam-sdks-java-core-2.20.0-SNAPSHOT.jar(/org/apache/beam/sdk/runners/AppliedPTransform.class)>
unable to access file: java.util.zip.ZipException: invalid block type
Please remove or make sure it appears in the correct subdirectory of the classpath.
1 error
> Task :sdks:python:test-suites:dataflow:py36:setupVirtualenv
done.
Running virtualenv with interpreter /usr/bin/python3.6
> Task :vendor:sdks-java-extensions-protobuf:compileJava FAILED
error: error reading <https://builds.apache.org/job/beam_PostCommit_Py_VR_Dataflow/ws/src/sdks/java/core/build/libs/beam-sdks-java-core-2.20.0-SNAPSHOT.jar;> invalid LOC header (bad signature)
<https://builds.apache.org/job/beam_PostCommit_Py_VR_Dataflow/ws/src/sdks/java/extensions/protobuf/src/main/java/org/apache/beam/sdk/extensions/protobuf/ProtoSchemaTranslator.java>:30: error: cannot access Experimental
import org.apache.beam.sdk.annotations.Experimental;
^
bad class file: <https://builds.apache.org/job/beam_PostCommit_Py_VR_Dataflow/ws/src/sdks/java/core/build/libs/beam-sdks-java-core-2.20.0-SNAPSHOT.jar(/org/apache/beam/sdk/annotations/Experimental.class)>
unable to access file: java.util.zip.ZipException: invalid stored block lengths
Please remove or make sure it appears in the correct subdirectory of the classpath.
1 error
> Task :sdks:java:extensions:google-cloud-platform-core:compileJava FAILED
error: error reading <https://builds.apache.org/job/beam_PostCommit_Py_VR_Dataflow/ws/src/sdks/java/core/build/libs/beam-sdks-java-core-2.20.0-SNAPSHOT.jar;> invalid LOC header (bad signature)
<https://builds.apache.org/job/beam_PostCommit_Py_VR_Dataflow/ws/src/sdks/java/extensions/google-cloud-platform-core/src/main/java/org/apache/beam/sdk/extensions/gcp/auth/GcpCredentialFactory.java>:25: error: cannot access PipelineOptions
import org.apache.beam.sdk.options.PipelineOptions;
^
bad class file: <https://builds.apache.org/job/beam_PostCommit_Py_VR_Dataflow/ws/src/sdks/java/core/build/libs/beam-sdks-java-core-2.20.0-SNAPSHOT.jar(/org/apache/beam/sdk/options/PipelineOptions.class)>
unable to access file: java.util.zip.ZipException: invalid distance too far back
Please remove or make sure it appears in the correct subdirectory of the classpath.
1 error
> Task :sdks:python:test-suites:dataflow:py37:setupVirtualenv
Collecting tox==3.11.1
Using cached tox-3.11.1-py2.py3-none-any.whl (76 kB)
Collecting grpcio-tools<=1.14.2,>=1.3.5
Using cached grpcio_tools-1.14.2-cp37-cp37m-manylinux1_x86_64.whl (22.2 MB)
> Task :sdks:java:fn-execution:compileJava FAILED
error: error reading <https://builds.apache.org/job/beam_PostCommit_Py_VR_Dataflow/ws/src/sdks/java/core/build/libs/beam-sdks-java-core-2.20.0-SNAPSHOT.jar;> invalid LOC header (bad signature)
<https://builds.apache.org/job/beam_PostCommit_Py_VR_Dataflow/ws/src/sdks/java/fn-execution/src/main/java/org/apache/beam/sdk/fn/stream/DataStreams.java>:29: error: cannot access Coder
import org.apache.beam.sdk.coders.Coder;
^
bad class file: <https://builds.apache.org/job/beam_PostCommit_Py_VR_Dataflow/ws/src/sdks/java/core/build/libs/beam-sdks-java-core-2.20.0-SNAPSHOT.jar(/org/apache/beam/sdk/coders/Coder.class)>
unable to access file: java.util.zip.ZipException: invalid block type
Please remove or make sure it appears in the correct subdirectory of the classpath.
1 error
> Task :sdks:python:test-suites:dataflow:py37:setupVirtualenv
ERROR: Could not install packages due to an EnvironmentError: [Errno 28] No space left on device
Daemon will be stopped at the end of the build after the daemon was no longer found in the daemon registry
> Task :sdks:python:setupVirtualenv
Collecting six<2,>=1.0.0
Using cached six-1.14.0-py2.py3-none-any.whl (10 kB)
ERROR: Could not install packages due to an EnvironmentError: [Errno 28] No space left on device: '/tmp/pip-install-vNsAtl/six'
> Task :sdks:python:setupVirtualenv FAILED
> Task :sdks:python:test-suites:dataflow:py2:setupVirtualenv
Collecting six<2,>=1.0.0
Using cached six-1.14.0-py2.py3-none-any.whl (10 kB)
Processing /home/jenkins/.cache/pip/wheels/66/13/60/ef107438d90e4aad6320e3424e50cfce5e16d1e9aad6d38294/filelock-3.0.12-cp27-none-any.whl
Collecting virtualenv>=14.0.0
Using cached virtualenv-20.0.3-py2.py3-none-any.whl (4.6 MB)
Collecting pluggy<1,>=0.3.0
Using cached pluggy-0.13.1-py2.py3-none-any.whl (18 kB)
Collecting py<2,>=1.4.17
Using cached py-1.8.1-py2.py3-none-any.whl (83 kB)
Collecting toml>=0.9.4
Using cached toml-0.10.0-py2.py3-none-any.whl (25 kB)
Requirement already satisfied, skipping upgrade: setuptools>=30.0.0 in <https://builds.apache.org/job/beam_PostCommit_Py_VR_Dataflow/ws/src/build/gradleenv/-194514014/lib/python2.7/site-packages> (from tox==3.11.1) (44.0.0)
Collecting grpcio>=1.14.2
Using cached grpcio-1.27.1-cp27-cp27mu-manylinux2010_x86_64.whl (21.1 MB)
ERROR: Could not install packages due to an EnvironmentError: [Errno 28] No space left on device
> Task :sdks:python:test-suites:dataflow:py2:setupVirtualenv FAILED
> Task :sdks:python:test-suites:dataflow:py36:setupVirtualenv
Collecting tox==3.11.1
Using cached tox-3.11.1-py2.py3-none-any.whl (76 kB)
Collecting grpcio-tools<=1.14.2,>=1.3.5
Using cached grpcio_tools-1.14.2-cp36-cp36m-manylinux1_x86_64.whl (22.2 MB)
Processing /home/jenkins/.cache/pip/wheels/bf/c9/a3/c538d90ef17cf7823fa51fc701a7a7a910a80f6a405bf15b1a/future-0.16.0-cp36-none-any.whl
Collecting toml>=0.9.4
Using cached toml-0.10.0-py2.py3-none-any.whl (25 kB)
Requirement already satisfied, skipping upgrade: setuptools>=30.0.0 in <https://builds.apache.org/job/beam_PostCommit_Py_VR_Dataflow/ws/src/build/gradleenv/-1734967053/lib/python3.6/site-packages> (from tox==3.11.1) (45.2.0)
> Task :sdks:python:test-suites:dataflow:py37:setupVirtualenv FAILED
> Task :sdks:python:test-suites:dataflow:py35:setupVirtualenv FAILED
> Task :sdks:python:test-suites:dataflow:py36:setupVirtualenv
Collecting pluggy<1,>=0.3.0
Using cached pluggy-0.13.1-py2.py3-none-any.whl (18 kB)
Collecting py<2,>=1.4.17
Using cached py-1.8.1-py2.py3-none-any.whl (83 kB)
Collecting six<2,>=1.0.0
Using cached six-1.14.0-py2.py3-none-any.whl (10 kB)
Collecting virtualenv>=14.0.0
Using cached virtualenv-20.0.3-py2.py3-none-any.whl (4.6 MB)
Collecting filelock<4,>=3.0.0
Using cached filelock-3.0.12-py3-none-any.whl (7.6 kB)
Collecting protobuf>=3.5.0.post1
Using cached protobuf-3.11.3-cp36-cp36m-manylinux1_x86_64.whl (1.3 MB)
Collecting grpcio>=1.14.2
Using cached grpcio-1.27.1-cp36-cp36m-manylinux2010_x86_64.whl (2.7 MB)
ERROR: Could not install packages due to an EnvironmentError: [Errno 28] No space left on device
> Task :sdks:python:test-suites:dataflow:py36:setupVirtualenv FAILED
FAILURE: Build completed with 10 failures.
1: Task failed with an exception.
-----------
* What went wrong:
Execution failed for task ':sdks:java:extensions:protobuf:extractIncludeProto'.
> Could not expand ZIP '<https://builds.apache.org/job/beam_PostCommit_Py_VR_Dataflow/ws/src/sdks/java/core/build/libs/beam-sdks-java-core-2.20.0-SNAPSHOT.jar'.>
* Try:
Run with --stacktrace option to get the stack trace. Run with --info or --debug option to get more log output. Run with --scan to get full insights.
==============================================================================
2: Task failed with an exception.
-----------
* What went wrong:
Execution failed for task ':runners:core-construction-java:compileJava'.
> Compilation failed with exit code 1; see the compiler error output for details.
* Try:
Run with --stacktrace option to get the stack trace. Run with --info or --debug option to get more log output. Run with --scan to get full insights.
==============================================================================
3: Task failed with an exception.
-----------
* What went wrong:
Execution failed for task ':vendor:sdks-java-extensions-protobuf:compileJava'.
> Compilation failed with exit code 1; see the compiler error output for details.
* Try:
Run with --stacktrace option to get the stack trace. Run with --info or --debug option to get more log output. Run with --scan to get full insights.
==============================================================================
4: Task failed with an exception.
-----------
* What went wrong:
Execution failed for task ':sdks:java:extensions:google-cloud-platform-core:compileJava'.
> Compilation failed with exit code 1; see the compiler error output for details.
* Try:
Run with --stacktrace option to get the stack trace. Run with --info or --debug option to get more log output. Run with --scan to get full insights.
==============================================================================
5: Task failed with an exception.
-----------
* What went wrong:
Execution failed for task ':sdks:java:fn-execution:compileJava'.
> Compilation failed with exit code 1; see the compiler error output for details.
* Try:
Run with --stacktrace option to get the stack trace. Run with --info or --debug option to get more log output. Run with --scan to get full insights.
==============================================================================
6: Task failed with an exception.
-----------
* What went wrong:
Execution failed for task ':sdks:python:setupVirtualenv'.
> Process 'command 'sh'' finished with non-zero exit value 1
* Try:
Run with --stacktrace option to get the stack trace. Run with --info or --debug option to get more log output. Run with --scan to get full insights.
==============================================================================
7: Task failed with an exception.
-----------
* What went wrong:
Execution failed for task ':sdks:python:test-suites:dataflow:py2:setupVirtualenv'.
> Process 'command 'sh'' finished with non-zero exit value 1
* Try:
Run with --stacktrace option to get the stack trace. Run with --info or --debug option to get more log output. Run with --scan to get full insights.
==============================================================================
8: Task failed with an exception.
-----------
* What went wrong:
Execution failed for task ':sdks:python:test-suites:dataflow:py37:setupVirtualenv'.
> Process 'command 'sh'' finished with non-zero exit value 1
* Try:
Run with --stacktrace option to get the stack trace. Run with --info or --debug option to get more log output. Run with --scan to get full insights.
==============================================================================
9: Task failed with an exception.
-----------
* What went wrong:
Execution failed for task ':sdks:python:test-suites:dataflow:py35:setupVirtualenv'.
> Process 'command 'sh'' finished with non-zero exit value 1
* Try:
Run with --stacktrace option to get the stack trace. Run with --info or --debug option to get more log output. Run with --scan to get full insights.
==============================================================================
10: Task failed with an exception.
-----------
* What went wrong:
Execution failed for task ':sdks:python:test-suites:dataflow:py36:setupVirtualenv'.
> Process 'command 'sh'' finished with non-zero exit value 1
* Try:
Run with --stacktrace option to get the stack trace. Run with --info or --debug option to get more log output. Run with --scan to get full insights.
==============================================================================
* Get more help at https://help.gradle.org
Deprecated Gradle features were used in this build, making it incompatible with Gradle 6.0.
Use '--warning-mode all' to show the individual deprecation warnings.
See https://docs.gradle.org/5.2.1/userguide/command_line_interface.html#sec:command_line_warnings
BUILD FAILED in 57s
42 actionable tasks: 36 executed, 6 from cache
Publishing build scan...
https://gradle.com/s/q4th7ypty23vq
Build step 'Invoke Gradle script' changed build result to FAILURE
Build step 'Invoke Gradle script' marked build as failure
---------------------------------------------------------------------
To unsubscribe, e-mail: builds-unsubscribe@beam.apache.org
For additional commands, e-mail: builds-help@beam.apache.org
Jenkins build is back to normal : beam_PostCommit_Py_VR_Dataflow
#5748
Posted by Apache Jenkins Server <je...@builds.apache.org>.
See <https://builds.apache.org/job/beam_PostCommit_Py_VR_Dataflow/5748/display/redirect>
---------------------------------------------------------------------
To unsubscribe, e-mail: builds-unsubscribe@beam.apache.org
For additional commands, e-mail: builds-help@beam.apache.org
Build failed in Jenkins: beam_PostCommit_Py_VR_Dataflow #5747
Posted by Apache Jenkins Server <je...@builds.apache.org>.
See <https://builds.apache.org/job/beam_PostCommit_Py_VR_Dataflow/5747/display/redirect?page=changes>
Changes:
[github] [AVRO-2737] Exclude a buggy avro version from requirements spec.
------------------------------------------
[...truncated 355.88 KB...]
XML: nosetests-validatesRunnerStreamingTests-df.xml
----------------------------------------------------------------------
XML: <https://builds.apache.org/job/beam_PostCommit_Py_VR_Dataflow/ws/src/sdks/python/nosetests.xml>
----------------------------------------------------------------------
Ran 26 tests in 1651.622s
OK
Worker logs: https://console.cloud.google.com/dataflow/jobsDetail/locations/us-central1/jobs/2020-02-12_12_30_26-7089027946752354060?project=apache-beam-testing
Worker logs: https://console.cloud.google.com/dataflow/jobsDetail/locations/us-central1/jobs/2020-02-12_12_37_05-12864431516211057881?project=apache-beam-testing
Worker logs: https://console.cloud.google.com/dataflow/jobsDetail/locations/us-central1/jobs/2020-02-12_12_44_09-1648520563377901530?project=apache-beam-testing
Worker logs: https://console.cloud.google.com/dataflow/jobsDetail/locations/us-central1/jobs/2020-02-12_12_50_56-542683840103194011?project=apache-beam-testing
Worker logs: https://console.cloud.google.com/dataflow/jobsDetail/locations/us-central1/jobs/2020-02-12_12_30_26-13659975896687651848?project=apache-beam-testing
Worker logs: https://console.cloud.google.com/dataflow/jobsDetail/locations/us-central1/jobs/2020-02-12_12_36_52-17220524925656262222?project=apache-beam-testing
Worker logs: https://console.cloud.google.com/dataflow/jobsDetail/locations/us-central1/jobs/2020-02-12_12_43_46-6966633217918518701?project=apache-beam-testing
Worker logs: https://console.cloud.google.com/dataflow/jobsDetail/locations/us-central1/jobs/2020-02-12_12_30_24-6911183959346347283?project=apache-beam-testing
Worker logs: https://console.cloud.google.com/dataflow/jobsDetail/locations/us-central1/jobs/2020-02-12_12_37_18-11803115783999781530?project=apache-beam-testing
Worker logs: https://console.cloud.google.com/dataflow/jobsDetail/locations/us-central1/jobs/2020-02-12_12_30_28-6573714117159508053?project=apache-beam-testing
Worker logs: https://console.cloud.google.com/dataflow/jobsDetail/locations/us-central1/jobs/2020-02-12_12_37_25-16871272468010073426?project=apache-beam-testing
Worker logs: https://console.cloud.google.com/dataflow/jobsDetail/locations/us-central1/jobs/2020-02-12_12_44_09-15196080140363443039?project=apache-beam-testing
Worker logs: https://console.cloud.google.com/dataflow/jobsDetail/locations/us-central1/jobs/2020-02-12_12_30_24-13809453955417852387?project=apache-beam-testing
Worker logs: https://console.cloud.google.com/dataflow/jobsDetail/locations/us-central1/jobs/2020-02-12_12_36_56-5395695080814209176?project=apache-beam-testing
Worker logs: https://console.cloud.google.com/dataflow/jobsDetail/locations/us-central1/jobs/2020-02-12_12_43_34-7640063169809428967?project=apache-beam-testing
Worker logs: https://console.cloud.google.com/dataflow/jobsDetail/locations/us-central1/jobs/2020-02-12_12_30_26-17971512262819098669?project=apache-beam-testing
Worker logs: https://console.cloud.google.com/dataflow/jobsDetail/locations/us-central1/jobs/2020-02-12_12_37_00-8388898329676910217?project=apache-beam-testing
Worker logs: https://console.cloud.google.com/dataflow/jobsDetail/locations/us-central1/jobs/2020-02-12_12_44_04-13951785314226290762?project=apache-beam-testing
Worker logs: https://console.cloud.google.com/dataflow/jobsDetail/locations/us-central1/jobs/2020-02-12_12_30_27-211261294042275944?project=apache-beam-testing
Worker logs: https://console.cloud.google.com/dataflow/jobsDetail/locations/us-central1/jobs/2020-02-12_12_37_20-14712698503349068518?project=apache-beam-testing
Worker logs: https://console.cloud.google.com/dataflow/jobsDetail/locations/us-central1/jobs/2020-02-12_12_30_25-7379048698820683249?project=apache-beam-testing
Worker logs: https://console.cloud.google.com/dataflow/jobsDetail/locations/us-central1/jobs/2020-02-12_12_37_01-7483689518973792885?project=apache-beam-testing
> Task :sdks:python:test-suites:dataflow:py35:validatesRunnerStreamingTests
Worker logs: https://console.cloud.google.com/dataflow/jobsDetail/locations/us-central1/jobs/2020-02-12_12_36_40-18305092465190240971?project=apache-beam-testing
Worker logs: https://console.cloud.google.com/dataflow/jobsDetail/locations/us-central1/jobs/2020-02-12_12_43_12-8796964617917065947?project=apache-beam-testing
Worker logs: https://console.cloud.google.com/dataflow/jobsDetail/locations/us-central1/jobs/2020-02-12_12_50_45-17701305010714451537?project=apache-beam-testing
Worker logs: https://console.cloud.google.com/dataflow/jobsDetail/locations/us-central1/jobs/2020-02-12_12_36_39-15011257977979762024?project=apache-beam-testing
Worker logs: https://console.cloud.google.com/dataflow/jobsDetail/locations/us-central1/jobs/2020-02-12_12_44_08-13525046954592724520?project=apache-beam-testing
Worker logs: https://console.cloud.google.com/dataflow/jobsDetail/locations/us-central1/jobs/2020-02-12_12_50_57-9907865817971660560?project=apache-beam-testing
Worker logs: https://console.cloud.google.com/dataflow/jobsDetail/locations/us-central1/jobs/2020-02-12_12_36_41-7329812958687353929?project=apache-beam-testing
Worker logs: https://console.cloud.google.com/dataflow/jobsDetail/locations/us-central1/jobs/2020-02-12_12_44_00-13397620643413235850?project=apache-beam-testing
Worker logs: https://console.cloud.google.com/dataflow/jobsDetail/locations/us-central1/jobs/2020-02-12_12_51_04-1915821160691862722?project=apache-beam-testing
Worker logs: https://console.cloud.google.com/dataflow/jobsDetail/locations/us-central1/jobs/2020-02-12_12_58_02-11346013149915387426?project=apache-beam-testing
Worker logs: https://console.cloud.google.com/dataflow/jobsDetail/locations/us-central1/jobs/2020-02-12_12_36_38-8860524385765422622?project=apache-beam-testing
Worker logs: https://console.cloud.google.com/dataflow/jobsDetail/locations/us-central1/jobs/2020-02-12_12_43_13-6889312443064299899?project=apache-beam-testing
Worker logs: https://console.cloud.google.com/dataflow/jobsDetail/locations/us-central1/jobs/2020-02-12_12_50_41-1524257907315824636?project=apache-beam-testing
Worker logs: https://console.cloud.google.com/dataflow/jobsDetail/locations/us-central1/jobs/2020-02-12_12_36_39-6006021803687020986?project=apache-beam-testing
Worker logs: https://console.cloud.google.com/dataflow/jobsDetail/locations/us-central1/jobs/2020-02-12_12_43_46-2118011694081033137?project=apache-beam-testing
Worker logs: https://console.cloud.google.com/dataflow/jobsDetail/locations/us-central1/jobs/2020-02-12_12_50_49-15504982717758450182?project=apache-beam-testing
Worker logs: https://console.cloud.google.com/dataflow/jobsDetail/locations/us-central1/jobs/2020-02-12_12_36_40-291405909052676111?project=apache-beam-testing
Worker logs: https://console.cloud.google.com/dataflow/jobsDetail/locations/us-central1/jobs/2020-02-12_12_44_04-14495581091631087166?project=apache-beam-testing
Worker logs: https://console.cloud.google.com/dataflow/jobsDetail/locations/us-central1/jobs/2020-02-12_12_36_38-17714399446126374378?project=apache-beam-testing
Worker logs: https://console.cloud.google.com/dataflow/jobsDetail/locations/us-central1/jobs/2020-02-12_12_44_16-14343413759416552691?project=apache-beam-testing
Worker logs: https://console.cloud.google.com/dataflow/jobsDetail/locations/us-central1/jobs/2020-02-12_12_36_39-17359515832252340336?project=apache-beam-testing
Worker logs: https://console.cloud.google.com/dataflow/jobsDetail/locations/us-central1/jobs/2020-02-12_12_44_03-94912742076583854?project=apache-beam-testing
test_gbk_many_values (apache_beam.runners.portability.fn_api_runner_test.FnApiBasedStateBackedCoderTest) ... ok
Test TimestampCombiner with EARLIEST. ... ok
Test TimestampCombiner with LATEST. ... ok
Runs streaming Dataflow job and verifies that user metrics are reported ... ok
test_dofn_lifecycle (apache_beam.transforms.dofn_lifecycle_test.DoFnLifecycleTest) ... ok
test_flatten_a_flattened_pcollection (apache_beam.transforms.ptransform_test.PTransformTest) ... ok
test_multiple_empty_outputs (apache_beam.transforms.ptransform_test.PTransformTest) ... ok
test_flatten_pcollections (apache_beam.transforms.ptransform_test.PTransformTest) ... ok
test_flatten_multiple_pcollections_having_multiple_consumers (apache_beam.transforms.ptransform_test.PTransformTest) ... ok
test_impulse (apache_beam.transforms.ptransform_test.PTransformTest) ... ok
test_flatten_one_single_pcollection (apache_beam.transforms.ptransform_test.PTransformTest) ... ok
test_par_do_with_multiple_outputs_and_using_yield (apache_beam.transforms.ptransform_test.PTransformTest) ... ok
test_par_do_with_multiple_outputs_and_using_return (apache_beam.transforms.ptransform_test.PTransformTest) ... ok
test_undeclared_outputs (apache_beam.transforms.ptransform_test.PTransformTest) ... ok
test_as_singleton_with_different_defaults (apache_beam.transforms.sideinputs_test.SideInputsTest) ... ok
test_as_dict_twice (apache_beam.transforms.sideinputs_test.SideInputsTest) ... ok
Test a GBK sideinput, with multiple triggering. ... ok
test_as_list_and_as_dict_side_inputs (apache_beam.transforms.sideinputs_test.SideInputsTest) ... ok
test_as_list_twice (apache_beam.transforms.sideinputs_test.SideInputsTest) ... ok
test_as_singleton_without_unique_labels (apache_beam.transforms.sideinputs_test.SideInputsTest) ... ok
test_default_value_singleton_side_input (apache_beam.transforms.sideinputs_test.SideInputsTest) ... ok
test_iterable_side_input (apache_beam.transforms.sideinputs_test.SideInputsTest) ... ok
test_empty_singleton_side_input (apache_beam.transforms.sideinputs_test.SideInputsTest) ... ok
test_flattened_side_input (apache_beam.transforms.sideinputs_test.SideInputsTest) ... ok
test_element_param (apache_beam.pipeline_test.DoFnTest) ... ok
test_key_param (apache_beam.pipeline_test.DoFnTest) ... ok
----------------------------------------------------------------------
XML: nosetests-validatesRunnerStreamingTests-df-py35.xml
----------------------------------------------------------------------
XML: <https://builds.apache.org/job/beam_PostCommit_Py_VR_Dataflow/ws/src/sdks/python/nosetests.xml>
----------------------------------------------------------------------
Ran 26 tests in 1732.412s
OK
> Task :sdks:python:test-suites:dataflow:py37:validatesRunnerStreamingTests
Worker logs: https://console.cloud.google.com/dataflow/jobsDetail/locations/us-central1/jobs/2020-02-12_12_42_16-16534141090587040887?project=apache-beam-testing
Worker logs: https://console.cloud.google.com/dataflow/jobsDetail/locations/us-central1/jobs/2020-02-12_12_49_10-17124594588683284970?project=apache-beam-testing
Worker logs: https://console.cloud.google.com/dataflow/jobsDetail/locations/us-central1/jobs/2020-02-12_12_56_21-12381476126144724329?project=apache-beam-testing
Worker logs: https://console.cloud.google.com/dataflow/jobsDetail/locations/us-central1/jobs/2020-02-12_12_42_15-1327601232180433989?project=apache-beam-testing
Worker logs: https://console.cloud.google.com/dataflow/jobsDetail/locations/us-central1/jobs/2020-02-12_12_49_52-5122917376536338160?project=apache-beam-testing
Worker logs: https://console.cloud.google.com/dataflow/jobsDetail/locations/us-central1/jobs/2020-02-12_12_56_59-11772922919551336947?project=apache-beam-testing
Worker logs: https://console.cloud.google.com/dataflow/jobsDetail/locations/us-central1/jobs/2020-02-12_13_04_17-8517482762404268808?project=apache-beam-testing
Worker logs: https://console.cloud.google.com/dataflow/jobsDetail/locations/us-central1/jobs/2020-02-12_12_42_13-9407413581431846750?project=apache-beam-testing
Worker logs: https://console.cloud.google.com/dataflow/jobsDetail/locations/us-central1/jobs/2020-02-12_12_49_38-7599237650923621393?project=apache-beam-testing
Worker logs: https://console.cloud.google.com/dataflow/jobsDetail/locations/us-central1/jobs/2020-02-12_12_42_17-18392406583935333459?project=apache-beam-testing
Worker logs: https://console.cloud.google.com/dataflow/jobsDetail/locations/us-central1/jobs/2020-02-12_12_49_38-3676471454163453475?project=apache-beam-testing
Worker logs: https://console.cloud.google.com/dataflow/jobsDetail/locations/us-central1/jobs/2020-02-12_12_42_14-4803461241216774530?project=apache-beam-testing
Worker logs: https://console.cloud.google.com/dataflow/jobsDetail/locations/us-central1/jobs/2020-02-12_12_49_26-3891502124780242402?project=apache-beam-testing
Worker logs: https://console.cloud.google.com/dataflow/jobsDetail/locations/us-central1/jobs/2020-02-12_12_56_58-6818033651238845653?project=apache-beam-testing
Worker logs: https://console.cloud.google.com/dataflow/jobsDetail/locations/us-central1/jobs/2020-02-12_12_42_15-1418224818104984554?project=apache-beam-testing
Worker logs: https://console.cloud.google.com/dataflow/jobsDetail/locations/us-central1/jobs/2020-02-12_12_49_19-2311497315903442608?project=apache-beam-testing
Worker logs: https://console.cloud.google.com/dataflow/jobsDetail/locations/us-central1/jobs/2020-02-12_12_56_24-4298773808875428506?project=apache-beam-testing
Worker logs: https://console.cloud.google.com/dataflow/jobsDetail/locations/us-central1/jobs/2020-02-12_12_42_14-12534844194275194825?project=apache-beam-testing
Worker logs: https://console.cloud.google.com/dataflow/jobsDetail/locations/us-central1/jobs/2020-02-12_12_50_00-17736821795587642541?project=apache-beam-testing
Worker logs: https://console.cloud.google.com/dataflow/jobsDetail/locations/us-central1/jobs/2020-02-12_12_56_57-275340739449825297?project=apache-beam-testing
Worker logs: https://console.cloud.google.com/dataflow/jobsDetail/locations/us-central1/jobs/2020-02-12_12_42_16-10410445813686650692?project=apache-beam-testing
Worker logs: https://console.cloud.google.com/dataflow/jobsDetail/locations/us-central1/jobs/2020-02-12_12_49_27-14642331365349635075?project=apache-beam-testing
test_gbk_many_values (apache_beam.runners.portability.fn_api_runner_test.FnApiBasedStateBackedCoderTest) ... ok
Test TimestampCombiner with EARLIEST. ... ok
Test TimestampCombiner with LATEST. ... ok
Runs streaming Dataflow job and verifies that user metrics are reported ... ok
test_flatten_multiple_pcollections_having_multiple_consumers (apache_beam.transforms.ptransform_test.PTransformTest) ... ok
test_flatten_a_flattened_pcollection (apache_beam.transforms.ptransform_test.PTransformTest) ... ok
test_flatten_pcollections (apache_beam.transforms.ptransform_test.PTransformTest) ... ok
test_multiple_empty_outputs (apache_beam.transforms.ptransform_test.PTransformTest) ... ok
test_dofn_lifecycle (apache_beam.transforms.dofn_lifecycle_test.DoFnLifecycleTest) ... ok
test_impulse (apache_beam.transforms.ptransform_test.PTransformTest) ... ok
test_flatten_one_single_pcollection (apache_beam.transforms.ptransform_test.PTransformTest) ... ok
test_par_do_with_multiple_outputs_and_using_return (apache_beam.transforms.ptransform_test.PTransformTest) ... ok
test_par_do_with_multiple_outputs_and_using_yield (apache_beam.transforms.ptransform_test.PTransformTest) ... ok
test_as_singleton_without_unique_labels (apache_beam.transforms.sideinputs_test.SideInputsTest) ... ok
test_undeclared_outputs (apache_beam.transforms.ptransform_test.PTransformTest) ... ok
test_as_singleton_with_different_defaults (apache_beam.transforms.sideinputs_test.SideInputsTest) ... ok
Test a GBK sideinput, with multiple triggering. ... ok
test_as_list_and_as_dict_side_inputs (apache_beam.transforms.sideinputs_test.SideInputsTest) ... ok
test_as_list_twice (apache_beam.transforms.sideinputs_test.SideInputsTest) ... ok
test_as_dict_twice (apache_beam.transforms.sideinputs_test.SideInputsTest) ... ok
test_default_value_singleton_side_input (apache_beam.transforms.sideinputs_test.SideInputsTest) ... ok
test_flattened_side_input (apache_beam.transforms.sideinputs_test.SideInputsTest) ... ok
test_empty_singleton_side_input (apache_beam.transforms.sideinputs_test.SideInputsTest) ... ok
test_iterable_side_input (apache_beam.transforms.sideinputs_test.SideInputsTest) ... ok
test_element_param (apache_beam.pipeline_test.DoFnTest) ... ok
test_key_param (apache_beam.pipeline_test.DoFnTest) ... ok
----------------------------------------------------------------------
XML: nosetests-validatesRunnerStreamingTests-df-py37.xml
----------------------------------------------------------------------
XML: <https://builds.apache.org/job/beam_PostCommit_Py_VR_Dataflow/ws/src/sdks/python/nosetests.xml>
----------------------------------------------------------------------
Ran 26 tests in 1778.765s
OK
> Task :sdks:python:test-suites:dataflow:py36:validatesRunnerStreamingTests
Worker logs: https://console.cloud.google.com/dataflow/jobsDetail/locations/us-central1/jobs/2020-02-12_12_43_31-3919422187517218360?project=apache-beam-testing
Worker logs: https://console.cloud.google.com/dataflow/jobsDetail/locations/us-central1/jobs/2020-02-12_12_50_28-8249200997500770390?project=apache-beam-testing
Worker logs: https://console.cloud.google.com/dataflow/jobsDetail/locations/us-central1/jobs/2020-02-12_12_57_25-1678047975789509952?project=apache-beam-testing
Worker logs: https://console.cloud.google.com/dataflow/jobsDetail/locations/us-central1/jobs/2020-02-12_12_43_30-1385694758473680035?project=apache-beam-testing
Worker logs: https://console.cloud.google.com/dataflow/jobsDetail/locations/us-central1/jobs/2020-02-12_12_50_57-17573594665801464398?project=apache-beam-testing
Worker logs: https://console.cloud.google.com/dataflow/jobsDetail/locations/us-central1/jobs/2020-02-12_12_58_34-7786691677898201787?project=apache-beam-testing
Worker logs: https://console.cloud.google.com/dataflow/jobsDetail/locations/us-central1/jobs/2020-02-12_13_06_01-13208005500441727929?project=apache-beam-testing
Worker logs: https://console.cloud.google.com/dataflow/jobsDetail/locations/us-central1/jobs/2020-02-12_12_43_31-2382685110787790290?project=apache-beam-testing
Worker logs: https://console.cloud.google.com/dataflow/jobsDetail/locations/us-central1/jobs/2020-02-12_12_50_35-40352117375770464?project=apache-beam-testing
Worker logs: https://console.cloud.google.com/dataflow/jobsDetail/locations/us-central1/jobs/2020-02-12_12_43_29-13787234296044807279?project=apache-beam-testing
Worker logs: https://console.cloud.google.com/dataflow/jobsDetail/locations/us-central1/jobs/2020-02-12_12_51_15-17226409821817051486?project=apache-beam-testing
Worker logs: https://console.cloud.google.com/dataflow/jobsDetail/locations/us-central1/jobs/2020-02-12_12_58_31-13870900123293053854?project=apache-beam-testing
Worker logs: https://console.cloud.google.com/dataflow/jobsDetail/locations/us-central1/jobs/2020-02-12_12_43_31-4270031626652188962?project=apache-beam-testing
Worker logs: https://console.cloud.google.com/dataflow/jobsDetail/locations/us-central1/jobs/2020-02-12_12_51_03-7389930521082628937?project=apache-beam-testing
Worker logs: https://console.cloud.google.com/dataflow/jobsDetail/locations/us-central1/jobs/2020-02-12_12_43_31-8590210889065910717?project=apache-beam-testing
Worker logs: https://console.cloud.google.com/dataflow/jobsDetail/locations/us-central1/jobs/2020-02-12_12_51_07-17599313500882811239?project=apache-beam-testing
Worker logs: https://console.cloud.google.com/dataflow/jobsDetail/locations/us-central1/jobs/2020-02-12_12_58_04-11427702087343160552?project=apache-beam-testing
Worker logs: https://console.cloud.google.com/dataflow/jobsDetail/locations/us-central1/jobs/2020-02-12_12_43_29-918443740288427470?project=apache-beam-testing
Worker logs: https://console.cloud.google.com/dataflow/jobsDetail/locations/us-central1/jobs/2020-02-12_12_50_32-834805655996684480?project=apache-beam-testing
Worker logs: https://console.cloud.google.com/dataflow/jobsDetail/locations/us-central1/jobs/2020-02-12_12_58_30-17917917068836688540?project=apache-beam-testing
Worker logs: https://console.cloud.google.com/dataflow/jobsDetail/locations/us-central1/jobs/2020-02-12_12_43_30-3970267194068982715?project=apache-beam-testing
Worker logs: https://console.cloud.google.com/dataflow/jobsDetail/locations/us-central1/jobs/2020-02-12_12_51_08-13195095551690003903?project=apache-beam-testing
test_gbk_many_values (apache_beam.runners.portability.fn_api_runner_test.FnApiBasedStateBackedCoderTest) ... ok
Test TimestampCombiner with EARLIEST. ... ok
Test TimestampCombiner with LATEST. ... ok
Runs streaming Dataflow job and verifies that user metrics are reported ... ok
test_flatten_one_single_pcollection (apache_beam.transforms.ptransform_test.PTransformTest) ... ok
test_multiple_empty_outputs (apache_beam.transforms.ptransform_test.PTransformTest) ... ok
test_impulse (apache_beam.transforms.ptransform_test.PTransformTest) ... ok
test_flatten_a_flattened_pcollection (apache_beam.transforms.ptransform_test.PTransformTest) ... ok
test_flatten_pcollections (apache_beam.transforms.ptransform_test.PTransformTest) ... ok
test_flatten_multiple_pcollections_having_multiple_consumers (apache_beam.transforms.ptransform_test.PTransformTest) ... ok
test_dofn_lifecycle (apache_beam.transforms.dofn_lifecycle_test.DoFnLifecycleTest) ... ok
test_par_do_with_multiple_outputs_and_using_return (apache_beam.transforms.ptransform_test.PTransformTest) ... ok
test_as_singleton_with_different_defaults (apache_beam.transforms.sideinputs_test.SideInputsTest) ... ok
test_par_do_with_multiple_outputs_and_using_yield (apache_beam.transforms.ptransform_test.PTransformTest) ... ok
test_as_singleton_without_unique_labels (apache_beam.transforms.sideinputs_test.SideInputsTest) ... ok
test_as_dict_twice (apache_beam.transforms.sideinputs_test.SideInputsTest) ... ok
Test a GBK sideinput, with multiple triggering. ... ok
test_as_list_and_as_dict_side_inputs (apache_beam.transforms.sideinputs_test.SideInputsTest) ... ok
test_undeclared_outputs (apache_beam.transforms.ptransform_test.PTransformTest) ... ok
test_as_list_twice (apache_beam.transforms.sideinputs_test.SideInputsTest) ... ok
test_default_value_singleton_side_input (apache_beam.transforms.sideinputs_test.SideInputsTest) ... ok
test_empty_singleton_side_input (apache_beam.transforms.sideinputs_test.SideInputsTest) ... ok
test_iterable_side_input (apache_beam.transforms.sideinputs_test.SideInputsTest) ... ok
test_flattened_side_input (apache_beam.transforms.sideinputs_test.SideInputsTest) ... ok
test_element_param (apache_beam.pipeline_test.DoFnTest) ... ok
test_key_param (apache_beam.pipeline_test.DoFnTest) ... ok
----------------------------------------------------------------------
XML: nosetests-validatesRunnerStreamingTests-df-py36.xml
----------------------------------------------------------------------
XML: <https://builds.apache.org/job/beam_PostCommit_Py_VR_Dataflow/ws/src/sdks/python/nosetests.xml>
----------------------------------------------------------------------
Ran 26 tests in 1792.444s
OK
FAILURE: Build completed with 2 failures.
1: Task failed with an exception.
-----------
* Where:
Build file '<https://builds.apache.org/job/beam_PostCommit_Py_VR_Dataflow/ws/src/sdks/python/test-suites/dataflow/py2/build.gradle'> line: 107
* What went wrong:
Execution failed for task ':sdks:python:test-suites:dataflow:py2:validatesRunnerBatchTests'.
> Process 'command 'sh'' finished with non-zero exit value 1
* Try:
Run with --stacktrace option to get the stack trace. Run with --info or --debug option to get more log output. Run with --scan to get full insights.
==============================================================================
2: Task failed with an exception.
-----------
* Where:
Build file '<https://builds.apache.org/job/beam_PostCommit_Py_VR_Dataflow/ws/src/sdks/python/test-suites/dataflow/py35/build.gradle'> line: 78
* What went wrong:
Execution failed for task ':sdks:python:test-suites:dataflow:py35:validatesRunnerBatchTests'.
> Process 'command 'sh'' finished with non-zero exit value 1
* Try:
Run with --stacktrace option to get the stack trace. Run with --info or --debug option to get more log output. Run with --scan to get full insights.
==============================================================================
* Get more help at https://help.gradle.org
Deprecated Gradle features were used in this build, making it incompatible with Gradle 6.0.
Use '--warning-mode all' to show the individual deprecation warnings.
See https://docs.gradle.org/5.2.1/userguide/command_line_interface.html#sec:command_line_warnings
BUILD FAILED in 1h 10m 29s
74 actionable tasks: 57 executed, 17 from cache
Publishing build scan...
https://gradle.com/s/kbwbuhwauwvsy
Build step 'Invoke Gradle script' changed build result to FAILURE
Build step 'Invoke Gradle script' marked build as failure
---------------------------------------------------------------------
To unsubscribe, e-mail: builds-unsubscribe@beam.apache.org
For additional commands, e-mail: builds-help@beam.apache.org
Build failed in Jenkins: beam_PostCommit_Py_VR_Dataflow #5746
Posted by Apache Jenkins Server <je...@builds.apache.org>.
See <https://builds.apache.org/job/beam_PostCommit_Py_VR_Dataflow/5746/display/redirect>
Changes:
------------------------------------------
[...truncated 81.88 KB...]
Collecting certifi>=2017.4.17
Using cached certifi-2019.11.28-py2.py3-none-any.whl (156 kB)
Collecting chardet<3.1.0,>=3.0.2
Using cached chardet-3.0.4-py2.py3-none-any.whl (133 kB)
Collecting idna<2.9,>=2.5
Using cached idna-2.8-py2.py3-none-any.whl (58 kB)
Collecting urllib3!=1.25.0,!=1.25.1,<1.26,>=1.21.1
Using cached urllib3-1.25.8-py2.py3-none-any.whl (125 kB)
Collecting google-auth<2.0dev,>=0.4.0
Using cached google_auth-1.11.0-py2.py3-none-any.whl (76 kB)
Requirement already satisfied: contextlib2; python_version < "3" in <https://builds.apache.org/job/beam_PostCommit_Py_VR_Dataflow/ws/src/build/gradleenv/-194514014/lib/python2.7/site-packages> (from importlib-metadata>=0.12; python_version < "3.8"->pytest<5.0,>=4.4.0->apache-beam==2.20.0.dev0) (0.6.0.post1)
Requirement already satisfied: zipp>=0.5 in <https://builds.apache.org/job/beam_PostCommit_Py_VR_Dataflow/ws/src/build/gradleenv/-194514014/lib/python2.7/site-packages> (from importlib-metadata>=0.12; python_version < "3.8"->pytest<5.0,>=4.4.0->apache-beam==2.20.0.dev0) (1.1.0)
Requirement already satisfied: configparser>=3.5; python_version < "3" in <https://builds.apache.org/job/beam_PostCommit_Py_VR_Dataflow/ws/src/build/gradleenv/-194514014/lib/python2.7/site-packages> (from importlib-metadata>=0.12; python_version < "3.8"->pytest<5.0,>=4.4.0->apache-beam==2.20.0.dev0) (4.0.2)
Requirement already satisfied: scandir; python_version < "3.5" in <https://builds.apache.org/job/beam_PostCommit_Py_VR_Dataflow/ws/src/build/gradleenv/-194514014/lib/python2.7/site-packages> (from pathlib2>=2.2.0; python_version < "3.6"->pytest<5.0,>=4.4.0->apache-beam==2.20.0.dev0) (1.10.0)
Collecting apipkg>=1.4
Using cached apipkg-1.5-py2.py3-none-any.whl (4.9 kB)
Building wheels for collected packages: apache-beam
Building wheel for apache-beam (setup.py): started
Building wheel for apache-beam (setup.py): finished with status 'done'
Created wheel for apache-beam: filename=apache_beam-2.20.0.dev0-py2-none-any.whl size=1890975 sha256=03c3720643b8729115d372ad86d6d68874107cb84270e7f4896e55c338cae07e
Stored in directory: /home/jenkins/.cache/pip/wheels/46/9d/1f/7a9661a8fcb0ed7d52d619d5385fcdc5cb78d6b0eed8782ad6
Successfully built apache-beam
Installing collected packages: crcmod, dill, fastavro, docopt, certifi, chardet, idna, urllib3, requests, hdfs, httplib2, pbr, funcsigs, mock, numpy, pymongo, pyasn1, rsa, pyasn1-modules, oauth2client, pyparsing, pydot, python-dateutil, pytz, avro, pyvcf, pyarrow, typing-extensions, cachetools, monotonic, fasteners, google-apitools, google-auth, googleapis-common-protos, google-api-core, google-cloud-core, google-cloud-datastore, grpc-google-iam-v1, google-cloud-pubsub, google-resumable-media, google-cloud-bigquery, google-cloud-bigtable, google-cloud-spanner, grpcio-gcp, proto-google-cloud-datastore-v1, googledatastore, freezegun, nose, nose-xunitmp, pandas, parameterized, pyhamcrest, pyyaml, requests-mock, tenacity, atomicwrites, packaging, attrs, wcwidth, more-itertools, pytest, pytest-forked, apipkg, execnet, pytest-xdist, pytest-timeout, apache-beam
> Task :runners:google-cloud-dataflow-java:worker:shadowJar
> Task :sdks:python:test-suites:dataflow:py2:installGcpTest
Successfully installed apache-beam-2.20.0.dev0 apipkg-1.5 atomicwrites-1.3.0 attrs-19.3.0 avro-1.9.2 cachetools-3.1.1 certifi-2019.11.28 chardet-3.0.4 crcmod-1.7 dill-0.3.1.1 docopt-0.6.2 execnet-1.7.1 fastavro-0.21.24 fasteners-0.15 freezegun-0.3.14 funcsigs-1.0.2 google-api-core-1.16.0 google-apitools-0.5.28 google-auth-1.11.0 google-cloud-bigquery-1.17.1 google-cloud-bigtable-1.0.0 google-cloud-core-1.3.0 google-cloud-datastore-1.7.4 google-cloud-pubsub-1.0.2 google-cloud-spanner-1.13.0 google-resumable-media-0.4.1 googleapis-common-protos-1.51.0 googledatastore-7.0.2 grpc-google-iam-v1-0.12.3 grpcio-gcp-0.2.2 hdfs-2.5.8 httplib2-0.12.0 idna-2.8 mock-2.0.0 monotonic-1.5 more-itertools-5.0.0 nose-1.3.7 nose-xunitmp-0.4.1 numpy-1.16.6 oauth2client-3.0.0 packaging-20.1 pandas-0.24.2 parameterized-0.7.1 pbr-5.4.4 proto-google-cloud-datastore-v1-0.90.4 pyarrow-0.15.1 pyasn1-0.4.8 pyasn1-modules-0.2.8 pydot-1.4.1 pyhamcrest-1.10.1 pymongo-3.10.1 pyparsing-2.4.6 pytest-4.6.9 pytest-forked-1.1.3 pytest-timeout-1.3.4 pytest-xdist-1.31.0 python-dateutil-2.8.1 pytz-2019.3 pyvcf-0.6.8 pyyaml-5.3 requests-2.22.0 requests-mock-1.7.0 rsa-4.0 tenacity-5.1.5 typing-extensions-3.7.4.1 urllib3-1.25.8 wcwidth-0.1.8
> Task :sdks:python:test-suites:dataflow:py2:validatesRunnerBatchTests
>>> RUNNING integration tests with pipeline options: --runner=TestDataflowRunner --project=apache-beam-testing --staging_location=gs://temp-storage-for-end-to-end-tests/staging-it --temp_location=gs://temp-storage-for-end-to-end-tests/temp-it --output=gs://temp-storage-for-end-to-end-tests/py-it-cloud/output --sdk_location=<https://builds.apache.org/job/beam_PostCommit_Py_VR_Dataflow/ws/src/sdks/python/build/apache-beam.tar.gz> --requirements_file=postcommit_requirements.txt --num_workers=1 --sleep_secs=20 --dataflow_worker_jar=<https://builds.apache.org/job/beam_PostCommit_Py_VR_Dataflow/ws/src/runners/google-cloud-dataflow-java/worker/build/libs/beam-runners-google-cloud-dataflow-java-fn-api-worker-2.20.0-SNAPSHOT.jar> --kms_key_name=projects/apache-beam-testing/locations/global/keyRings/beam-it/cryptoKeys/test --dataflow_kms_key=projects/apache-beam-testing/locations/global/keyRings/beam-it/cryptoKeys/test
>>> test options: --nocapture --processes=8 --process-timeout=4500 --attr=ValidatesRunner
setup.py:245: UserWarning: You are using Apache Beam with Python 2. New releases of Apache Beam will soon support Python 3 only.
'You are using Apache Beam with Python 2. '
<https://builds.apache.org/job/beam_PostCommit_Py_VR_Dataflow/ws/src/build/gradleenv/-194514014/local/lib/python2.7/site-packages/setuptools/dist.py>:476: UserWarning: Normalizing '2.20.0.dev' to '2.20.0.dev0'
normalized_version,
running nosetests
running egg_info
Skipping proto regeneration: all files up to date
writing requirements to apache_beam.egg-info/requires.txt
writing apache_beam.egg-info/PKG-INFO
writing top-level names to apache_beam.egg-info/top_level.txt
writing dependency_links to apache_beam.egg-info/dependency_links.txt
writing entry points to apache_beam.egg-info/entry_points.txt
reading manifest file 'apache_beam.egg-info/SOURCES.txt'
reading manifest template 'MANIFEST.in'
warning: no files found matching 'README.md'
warning: no files found matching 'NOTICE'
warning: no files found matching 'LICENSE'
writing manifest file 'apache_beam.egg-info/SOURCES.txt'
<https://builds.apache.org/job/beam_PostCommit_Py_VR_Dataflow/ws/src/sdks/python/apache_beam/__init__.py>:82: UserWarning: You are using Apache Beam with Python 2. New releases of Apache Beam will soon support Python 3 only.
'You are using Apache Beam with Python 2. '
<https://builds.apache.org/job/beam_PostCommit_Py_VR_Dataflow/ws/src/sdks/python/apache_beam/transforms/trigger_test.py>:541: YAMLLoadWarning: calling yaml.load_all() without Loader=... is deprecated, as the default Loader is unsafe. Please read https://msg.pyyaml.org/load for full details.
for spec in yaml.load_all(open(transcript_filename)):
test_gbk_many_values (apache_beam.runners.portability.fn_api_runner_test.FnApiBasedStateBackedCoderTest) ... ok
Test TimestampCombiner with EARLIEST. ... ok
Test TimestampCombiner with LATEST. ... ok
test_dofn_lifecycle (apache_beam.transforms.dofn_lifecycle_test.DoFnLifecycleTest) ... ok
test_flatten_same_pcollections (apache_beam.transforms.ptransform_test.PTransformTest) ... ok
test_impulse (apache_beam.transforms.ptransform_test.PTransformTest) ... ok
test_flatten_one_single_pcollection (apache_beam.transforms.ptransform_test.PTransformTest) ... ok
test_flatten_pcollections (apache_beam.transforms.ptransform_test.PTransformTest) ... ok
test_flatten_a_flattened_pcollection (apache_beam.transforms.ptransform_test.PTransformTest) ... ok
test_flatten_multiple_pcollections_having_multiple_consumers (apache_beam.transforms.ptransform_test.PTransformTest) ... ok
Runs streaming Dataflow job and verifies that user metrics are reported ... ok
test_read_metrics (apache_beam.transforms.ptransform_test.PTransformTest) ... ok
test_multiple_empty_outputs (apache_beam.transforms.ptransform_test.PTransformTest) ... ok
test_as_dict_twice (apache_beam.transforms.sideinputs_test.SideInputsTest) ... ok
test_as_list_and_as_dict_side_inputs (apache_beam.transforms.sideinputs_test.SideInputsTest) ... ok
test_par_do_with_multiple_outputs_and_using_return (apache_beam.transforms.ptransform_test.PTransformTest) ... ok
test_par_do_with_multiple_outputs_and_using_yield (apache_beam.transforms.ptransform_test.PTransformTest) ... ok
test_as_list_twice (apache_beam.transforms.sideinputs_test.SideInputsTest) ... ok
Test a GBK sideinput, with multiple triggering. ... ok
test_undeclared_outputs (apache_beam.transforms.ptransform_test.PTransformTest) ... ok
test_as_singleton_without_unique_labels (apache_beam.transforms.sideinputs_test.SideInputsTest) ... ok
test_flattened_side_input (apache_beam.transforms.sideinputs_test.SideInputsTest) ... ok
test_empty_singleton_side_input (apache_beam.transforms.sideinputs_test.SideInputsTest) ... ok
test_as_singleton_with_different_defaults (apache_beam.transforms.sideinputs_test.SideInputsTest) ... ok
test_iterable_side_input (apache_beam.transforms.sideinputs_test.SideInputsTest) ... ok
test_default_value_singleton_side_input (apache_beam.transforms.sideinputs_test.SideInputsTest) ... ok
test_multi_valued_singleton_side_input (apache_beam.transforms.sideinputs_test.SideInputsTest) ... ok
test_reshuffle_preserves_timestamps (apache_beam.transforms.util_test.ReshuffleTest) ... ok
test_element_param (apache_beam.pipeline_test.DoFnTest) ... ok
test_key_param (apache_beam.pipeline_test.DoFnTest) ... ok
----------------------------------------------------------------------
XML: nosetests-validatesRunnerBatchTests-df.xml
----------------------------------------------------------------------
XML: <https://builds.apache.org/job/beam_PostCommit_Py_VR_Dataflow/ws/src/sdks/python/nosetests.xml>
----------------------------------------------------------------------
Ran 30 tests in 1849.964s
OK
Worker logs: https://console.cloud.google.com/dataflow/jobsDetail/locations/us-central1/jobs/2020-02-12_10_12_42-8084550129129723591?project=apache-beam-testing
Worker logs: https://console.cloud.google.com/dataflow/jobsDetail/locations/us-central1/jobs/2020-02-12_10_18_37-3955831569906240889?project=apache-beam-testing
Worker logs: https://console.cloud.google.com/dataflow/jobsDetail/locations/us-central1/jobs/2020-02-12_10_25_18-7927871829559101608?project=apache-beam-testing
Worker logs: https://console.cloud.google.com/dataflow/jobsDetail/locations/us-central1/jobs/2020-02-12_10_31_13-3959663437105856365?project=apache-beam-testing
Worker logs: https://console.cloud.google.com/dataflow/jobsDetail/locations/us-central1/jobs/2020-02-12_10_37_11-9124849881379402145?project=apache-beam-testing
Worker logs: https://console.cloud.google.com/dataflow/jobsDetail/locations/us-central1/jobs/2020-02-12_10_12_45-7018054198270937428?project=apache-beam-testing
Worker logs: https://console.cloud.google.com/dataflow/jobsDetail/locations/us-central1/jobs/2020-02-12_10_19_37-9202869397397609206?project=apache-beam-testing
Worker logs: https://console.cloud.google.com/dataflow/jobsDetail/locations/us-central1/jobs/2020-02-12_10_25_45-17357824683042848741?project=apache-beam-testing
Worker logs: https://console.cloud.google.com/dataflow/jobsDetail/locations/us-central1/jobs/2020-02-12_10_12_44-10172560910420875479?project=apache-beam-testing
Worker logs: https://console.cloud.google.com/dataflow/jobsDetail/locations/us-central1/jobs/2020-02-12_10_18_48-5085863116918561181?project=apache-beam-testing
Worker logs: https://console.cloud.google.com/dataflow/jobsDetail/locations/us-central1/jobs/2020-02-12_10_25_31-16006580896569062904?project=apache-beam-testing
Worker logs: https://console.cloud.google.com/dataflow/jobsDetail/locations/us-central1/jobs/2020-02-12_10_12_45-18281249565766148556?project=apache-beam-testing
Worker logs: https://console.cloud.google.com/dataflow/jobsDetail/locations/us-central1/jobs/2020-02-12_10_18_55-4473849898523559544?project=apache-beam-testing
Worker logs: https://console.cloud.google.com/dataflow/jobsDetail/locations/us-central1/jobs/2020-02-12_10_25_38-611006150094104590?project=apache-beam-testing
Worker logs: https://console.cloud.google.com/dataflow/jobsDetail/locations/us-central1/jobs/2020-02-12_10_12_44-10076230678275929091?project=apache-beam-testing
Worker logs: https://console.cloud.google.com/dataflow/jobsDetail/locations/us-central1/jobs/2020-02-12_10_19_22-18036846010688440642?project=apache-beam-testing
Worker logs: https://console.cloud.google.com/dataflow/jobsDetail/locations/us-central1/jobs/2020-02-12_10_25_20-6049568707568917080?project=apache-beam-testing
Worker logs: https://console.cloud.google.com/dataflow/jobsDetail/locations/us-central1/jobs/2020-02-12_10_12_45-15292900363082691868?project=apache-beam-testing
Worker logs: https://console.cloud.google.com/dataflow/jobsDetail/locations/us-central1/jobs/2020-02-12_10_19_23-16650782549674044890?project=apache-beam-testing
Worker logs: https://console.cloud.google.com/dataflow/jobsDetail/locations/us-central1/jobs/2020-02-12_10_25_21-187447640025552897?project=apache-beam-testing
Worker logs: https://console.cloud.google.com/dataflow/jobsDetail/locations/us-central1/jobs/2020-02-12_10_12_43-13364356687252618829?project=apache-beam-testing
Worker logs: https://console.cloud.google.com/dataflow/jobsDetail/locations/us-central1/jobs/2020-02-12_10_19_04-9591300618860548505?project=apache-beam-testing
Worker logs: https://console.cloud.google.com/dataflow/jobsDetail/locations/us-central1/jobs/2020-02-12_10_25_10-9370037544490605724?project=apache-beam-testing
Worker logs: https://console.cloud.google.com/dataflow/jobsDetail/locations/us-central1/jobs/2020-02-12_10_12_45-3107737885714992109?project=apache-beam-testing
Worker logs: https://console.cloud.google.com/dataflow/jobsDetail/locations/us-central1/jobs/2020-02-12_10_19_13-9438322217608783238?project=apache-beam-testing
Worker logs: https://console.cloud.google.com/dataflow/jobsDetail/locations/us-central1/jobs/2020-02-12_10_25_49-3839091103289873951?project=apache-beam-testing
> Task :sdks:python:test-suites:dataflow:py2:validatesRunnerStreamingTests
>>> RUNNING integration tests with pipeline options: --runner=TestDataflowRunner --project=apache-beam-testing --staging_location=gs://temp-storage-for-end-to-end-tests/staging-it --temp_location=gs://temp-storage-for-end-to-end-tests/temp-it --output=gs://temp-storage-for-end-to-end-tests/py-it-cloud/output --sdk_location=<https://builds.apache.org/job/beam_PostCommit_Py_VR_Dataflow/ws/src/sdks/python/build/apache-beam.tar.gz> --requirements_file=postcommit_requirements.txt --num_workers=1 --sleep_secs=20 --streaming --dataflow_worker_jar=<https://builds.apache.org/job/beam_PostCommit_Py_VR_Dataflow/ws/src/runners/google-cloud-dataflow-java/worker/build/libs/beam-runners-google-cloud-dataflow-java-fn-api-worker-2.20.0-SNAPSHOT.jar> --kms_key_name=projects/apache-beam-testing/locations/global/keyRings/beam-it/cryptoKeys/test --dataflow_kms_key=projects/apache-beam-testing/locations/global/keyRings/beam-it/cryptoKeys/test
>>> test options: --nocapture --processes=8 --process-timeout=4500 --attr=ValidatesRunner,!sickbay-streaming
setup.py:245: UserWarning: You are using Apache Beam with Python 2. New releases of Apache Beam will soon support Python 3 only.
'You are using Apache Beam with Python 2. '
<https://builds.apache.org/job/beam_PostCommit_Py_VR_Dataflow/ws/src/build/gradleenv/-194514014/local/lib/python2.7/site-packages/setuptools/dist.py>:476: UserWarning: Normalizing '2.20.0.dev' to '2.20.0.dev0'
normalized_version,
running nosetests
running egg_info
Skipping proto regeneration: all files up to date
writing requirements to apache_beam.egg-info/requires.txt
writing apache_beam.egg-info/PKG-INFO
writing top-level names to apache_beam.egg-info/top_level.txt
writing dependency_links to apache_beam.egg-info/dependency_links.txt
writing entry points to apache_beam.egg-info/entry_points.txt
reading manifest file 'apache_beam.egg-info/SOURCES.txt'
reading manifest template 'MANIFEST.in'
warning: no files found matching 'README.md'
warning: no files found matching 'NOTICE'
warning: no files found matching 'LICENSE'
writing manifest file 'apache_beam.egg-info/SOURCES.txt'
<https://builds.apache.org/job/beam_PostCommit_Py_VR_Dataflow/ws/src/sdks/python/apache_beam/__init__.py>:82: UserWarning: You are using Apache Beam with Python 2. New releases of Apache Beam will soon support Python 3 only.
'You are using Apache Beam with Python 2. '
<https://builds.apache.org/job/beam_PostCommit_Py_VR_Dataflow/ws/src/sdks/python/apache_beam/transforms/trigger_test.py>:541: YAMLLoadWarning: calling yaml.load_all() without Loader=... is deprecated, as the default Loader is unsafe. Please read https://msg.pyyaml.org/load for full details.
for spec in yaml.load_all(open(transcript_filename)):
test_gbk_many_values (apache_beam.runners.portability.fn_api_runner_test.FnApiBasedStateBackedCoderTest) ... ok
Test TimestampCombiner with EARLIEST. ... ok
Test TimestampCombiner with LATEST. ... ok
Runs streaming Dataflow job and verifies that user metrics are reported ... ok
test_flatten_one_single_pcollection (apache_beam.transforms.ptransform_test.PTransformTest) ... ok
test_flatten_multiple_pcollections_having_multiple_consumers (apache_beam.transforms.ptransform_test.PTransformTest) ... ok
test_flatten_pcollections (apache_beam.transforms.ptransform_test.PTransformTest) ... ok
test_impulse (apache_beam.transforms.ptransform_test.PTransformTest) ... ok
test_flatten_a_flattened_pcollection (apache_beam.transforms.ptransform_test.PTransformTest) ... ok
test_multiple_empty_outputs (apache_beam.transforms.ptransform_test.PTransformTest) ... ok
test_dofn_lifecycle (apache_beam.transforms.dofn_lifecycle_test.DoFnLifecycleTest) ... ok
test_par_do_with_multiple_outputs_and_using_return (apache_beam.transforms.ptransform_test.PTransformTest) ... ok
test_par_do_with_multiple_outputs_and_using_yield (apache_beam.transforms.ptransform_test.PTransformTest) ... ok
test_as_singleton_with_different_defaults (apache_beam.transforms.sideinputs_test.SideInputsTest) ... ok
test_as_dict_twice (apache_beam.transforms.sideinputs_test.SideInputsTest) ... ok
test_as_list_and_as_dict_side_inputs (apache_beam.transforms.sideinputs_test.SideInputsTest) ... ok
test_as_list_twice (apache_beam.transforms.sideinputs_test.SideInputsTest) ... ok
Test a GBK sideinput, with multiple triggering. ... ok
test_undeclared_outputs (apache_beam.transforms.ptransform_test.PTransformTest) ... ok
test_as_singleton_without_unique_labels (apache_beam.transforms.sideinputs_test.SideInputsTest) ... ok
test_default_value_singleton_side_input (apache_beam.transforms.sideinputs_test.SideInputsTest) ... ok
test_empty_singleton_side_input (apache_beam.transforms.sideinputs_test.SideInputsTest) ... ok
test_flattened_side_input (apache_beam.transforms.sideinputs_test.SideInputsTest) ... ok
test_iterable_side_input (apache_beam.transforms.sideinputs_test.SideInputsTest) ... ok
test_element_param (apache_beam.pipeline_test.DoFnTest) ... ok
test_key_param (apache_beam.pipeline_test.DoFnTest) ... ok
----------------------------------------------------------------------
XML: nosetests-validatesRunnerStreamingTests-df.xml
----------------------------------------------------------------------
XML: <https://builds.apache.org/job/beam_PostCommit_Py_VR_Dataflow/ws/src/sdks/python/nosetests.xml>
----------------------------------------------------------------------
Ran 26 tests in 1719.660s
OK
Worker logs: https://console.cloud.google.com/dataflow/jobsDetail/locations/us-central1/jobs/2020-02-12_10_43_33-3319934334279908842?project=apache-beam-testing
Worker logs: https://console.cloud.google.com/dataflow/jobsDetail/locations/us-central1/jobs/2020-02-12_10_50_38-129336636903823667?project=apache-beam-testing
Worker logs: https://console.cloud.google.com/dataflow/jobsDetail/locations/us-central1/jobs/2020-02-12_10_57_41-9352913961361309553?project=apache-beam-testing
Worker logs: https://console.cloud.google.com/dataflow/jobsDetail/locations/us-central1/jobs/2020-02-12_11_05_18-2361883950232364997?project=apache-beam-testing
Worker logs: https://console.cloud.google.com/dataflow/jobsDetail/locations/us-central1/jobs/2020-02-12_10_43_34-5263806131771259768?project=apache-beam-testing
Worker logs: https://console.cloud.google.com/dataflow/jobsDetail/locations/us-central1/jobs/2020-02-12_10_49_49-9302135639509024415?project=apache-beam-testing
Worker logs: https://console.cloud.google.com/dataflow/jobsDetail/locations/us-central1/jobs/2020-02-12_10_56_38-15428242537586289732?project=apache-beam-testing
Worker logs: https://console.cloud.google.com/dataflow/jobsDetail/locations/us-central1/jobs/2020-02-12_10_43_33-813065369988798556?project=apache-beam-testing
Worker logs: https://console.cloud.google.com/dataflow/jobsDetail/locations/us-central1/jobs/2020-02-12_10_50_27-11856233669947500287?project=apache-beam-testing
Worker logs: https://console.cloud.google.com/dataflow/jobsDetail/locations/us-central1/jobs/2020-02-12_10_43_37-2906628317434251676?project=apache-beam-testing
Worker logs: https://console.cloud.google.com/dataflow/jobsDetail/locations/us-central1/jobs/2020-02-12_10_50_40-1779201195442402751?project=apache-beam-testing
Worker logs: https://console.cloud.google.com/dataflow/jobsDetail/locations/us-central1/jobs/2020-02-12_10_57_18-17350684811427723309?project=apache-beam-testing
Worker logs: https://console.cloud.google.com/dataflow/jobsDetail/locations/us-central1/jobs/2020-02-12_10_43_31-8007897470081364368?project=apache-beam-testing
Worker logs: https://console.cloud.google.com/dataflow/jobsDetail/locations/us-central1/jobs/2020-02-12_10_51_04-14220502400983783803?project=apache-beam-testing
Worker logs: https://console.cloud.google.com/dataflow/jobsDetail/locations/us-central1/jobs/2020-02-12_10_43_34-7697044324022972678?project=apache-beam-testing
Worker logs: https://console.cloud.google.com/dataflow/jobsDetail/locations/us-central1/jobs/2020-02-12_10_50_20-828062886641220974?project=apache-beam-testing
Worker logs: https://console.cloud.google.com/dataflow/jobsDetail/locations/us-central1/jobs/2020-02-12_10_43_32-479314723199369769?project=apache-beam-testing
Worker logs: https://console.cloud.google.com/dataflow/jobsDetail/locations/us-central1/jobs/2020-02-12_10_50_12-12188437166410282308?project=apache-beam-testing
Worker logs: https://console.cloud.google.com/dataflow/jobsDetail/locations/us-central1/jobs/2020-02-12_10_57_13-12191244917508139565?project=apache-beam-testing
Worker logs: https://console.cloud.google.com/dataflow/jobsDetail/locations/us-central1/jobs/2020-02-12_10_43_35-7394209916480950180?project=apache-beam-testing
Worker logs: https://console.cloud.google.com/dataflow/jobsDetail/locations/us-central1/jobs/2020-02-12_10_50_24-17776591682252887906?project=apache-beam-testing
Worker logs: https://console.cloud.google.com/dataflow/jobsDetail/locations/us-central1/jobs/2020-02-12_10_57_31-17688346293896495751?project=apache-beam-testing
FAILURE: Build completed with 3 failures.
1: Task failed with an exception.
-----------
* What went wrong:
Execution failed for task ':sdks:python:test-suites:dataflow:py37:installGcpTest'.
> Process 'command 'sh'' finished with non-zero exit value 1
* Try:
Run with --stacktrace option to get the stack trace. Run with --info or --debug option to get more log output. Run with --scan to get full insights.
==============================================================================
2: Task failed with an exception.
-----------
* What went wrong:
Execution failed for task ':sdks:python:test-suites:dataflow:py36:installGcpTest'.
> Process 'command 'sh'' finished with non-zero exit value 1
* Try:
Run with --stacktrace option to get the stack trace. Run with --info or --debug option to get more log output. Run with --scan to get full insights.
==============================================================================
3: Task failed with an exception.
-----------
* What went wrong:
Execution failed for task ':sdks:python:test-suites:dataflow:py35:installGcpTest'.
> Process 'command 'sh'' finished with non-zero exit value 1
* Try:
Run with --stacktrace option to get the stack trace. Run with --info or --debug option to get more log output. Run with --scan to get full insights.
==============================================================================
* Get more help at https://help.gradle.org
Deprecated Gradle features were used in this build, making it incompatible with Gradle 6.0.
Use '--warning-mode all' to show the individual deprecation warnings.
See https://docs.gradle.org/5.2.1/userguide/command_line_interface.html#sec:command_line_warnings
BUILD FAILED in 1h 1m 13s
68 actionable tasks: 51 executed, 17 from cache
Publishing build scan...
https://gradle.com/s/ipcplu7622qba
Build step 'Invoke Gradle script' changed build result to FAILURE
Build step 'Invoke Gradle script' marked build as failure
---------------------------------------------------------------------
To unsubscribe, e-mail: builds-unsubscribe@beam.apache.org
For additional commands, e-mail: builds-help@beam.apache.org