You are viewing a plain text version of this content. The canonical link for it is here.
Posted to notifications@jclouds.apache.org by je...@cloudbees.com on 2015/03/31 20:59:57 UTC

Build failed in Jenkins: jclouds-guava-17-18 » 17.0,OpenJDK 7 (latest) #160

See <https://jclouds.ci.cloudbees.com/job/jclouds-guava-17-18/GUAVA_VERSION=17.0,jdk=OpenJDK%207%20(latest)/160/changes>

Changes:

[Andrew Gaul] JCLOUDS-867: Use Azure API version 2013-08-15

[Andrew Gaul] JCLOUDS-867: Azure support for Content-Disposition

[Andrew Gaul] Return ETag from Azure setBlobMetadata

[Andrew Gaul] JCLOUDS-871: Azure Copy Blob support

------------------------------------------
[...truncated 11463 lines...]
Starting test testOnlyRetryAuthWhenSetViaProperties(org.jclouds.sshj.SshjSshClientTest)
Starting test testRetriesLoggedAtInfoWithCount(org.jclouds.sshj.SshjSshClientTest)
Starting test testRetryNotOnToStringCustomMismatch(org.jclouds.sshj.SshjSshClientTest)
[pool-1-thread-4] Test testOnlyRetryAuthWhenSetViaProperties(org.jclouds.sshj.SshjSshClientTest) skipped.
Test suite progress: tests succeeded: 0, failed: 0, skipped: 7.
[pool-1-thread-1] Test testRetryNotOnToStringCustomMismatch(org.jclouds.sshj.SshjSshClientTest) skipped.
Test suite progress: tests succeeded: 0, failed: 0, skipped: 8.
[pool-1-thread-3] Test testRetriesLoggedAtInfoWithCount(org.jclouds.sshj.SshjSshClientTest) skipped.
Test suite progress: tests succeeded: 0, failed: 0, skipped: 9.
Starting test testRetryOnToStringCustom(org.jclouds.sshj.SshjSshClientTest)
[pool-1-thread-2] Test testRetryOnToStringCustom(org.jclouds.sshj.SshjSshClientTest) skipped.
Test suite progress: tests succeeded: 0, failed: 0, skipped: 10.
Starting test testPropateConvertsAuthException(org.jclouds.sshj.SshjSshClientTest)
[pool-1-thread-5] Test testPropateConvertsAuthException(org.jclouds.sshj.SshjSshClientTest) skipped.
Starting test testRetryOnToStringNpe(org.jclouds.sshj.SshjSshClientTest)
Test suite progress: tests succeeded: 0, failed: 0, skipped: 11.
[pool-1-thread-4] Test testRetryOnToStringNpe(org.jclouds.sshj.SshjSshClientTest) skipped.
Test suite progress: tests succeeded: 0, failed: 0, skipped: 12.
Tests run: 13, Failures: 1, Errors: 0, Skipped: 12, Time elapsed: 0.786 sec <<< FAILURE! - in TestSuite
setupSsh(org.jclouds.sshj.SshjSshClientTest)  Time elapsed: 0.612 sec  <<< FAILURE!
com.google.inject.internal.util.$ComputationException: com.google.inject.internal.util.$ComputationException: com.google.inject.internal.util.$ComputationException: java.lang.NoClassDefFoundError: ch/qos/logback/core/joran/spi/JoranException
	at java.net.URLClassLoader$1.run(URLClassLoader.java:366)
	at java.net.URLClassLoader$1.run(URLClassLoader.java:355)
	at java.security.AccessController.doPrivileged(Native Method)
	at java.net.URLClassLoader.findClass(URLClassLoader.java:354)
	at java.lang.ClassLoader.loadClass(ClassLoader.java:425)
	at sun.misc.Launcher$AppClassLoader.loadClass(Launcher.java:308)
	at java.lang.ClassLoader.loadClass(ClassLoader.java:358)
	at org.slf4j.LoggerFactory.bind(LoggerFactory.java:128)
	at org.slf4j.LoggerFactory.performInitialization(LoggerFactory.java:107)
	at org.slf4j.LoggerFactory.getILoggerFactory(LoggerFactory.java:295)
	at org.jclouds.logging.slf4j.SLF4JLogger.<clinit>(SLF4JLogger.java:28)
	at org.jclouds.logging.slf4j.SLF4JLogger$SLF4JLoggerFactory.getLogger(SLF4JLogger.java:36)
	at org.jclouds.logging.config.BindLoggersAnnotatedWithResource.hear(BindLoggersAnnotatedWithResource.java:114)
	at com.google.inject.internal.MembersInjectorStore.createWithListeners(MembersInjectorStore.java:102)
	at com.google.inject.internal.MembersInjectorStore.access$000(MembersInjectorStore.java:34)
	at com.google.inject.internal.MembersInjectorStore$1.create(MembersInjectorStore.java:42)
	at com.google.inject.internal.MembersInjectorStore$1.create(MembersInjectorStore.java:39)
	at com.google.inject.internal.FailableCache$1.apply(FailableCache.java:39)
	at com.google.inject.internal.util.$MapMaker$StrategyImpl.compute(MapMaker.java:549)
	at com.google.inject.internal.util.$MapMaker$StrategyImpl.compute(MapMaker.java:419)
	at com.google.inject.internal.util.$CustomConcurrentHashMap$ComputingImpl.get(CustomConcurrentHashMap.java:2041)
	at com.google.inject.internal.FailableCache.get(FailableCache.java:50)
	at com.google.inject.internal.MembersInjectorStore.get(MembersInjectorStore.java:65)
	at com.google.inject.internal.ConstructorInjectorStore.createConstructor(ConstructorInjectorStore.java:73)
	at com.google.inject.internal.ConstructorInjectorStore.access$000(ConstructorInjectorStore.java:28)
	at com.google.inject.internal.ConstructorInjectorStore$1.create(ConstructorInjectorStore.java:36)
	at com.google.inject.internal.ConstructorInjectorStore$1.create(ConstructorInjectorStore.java:32)
	at com.google.inject.internal.FailableCache$1.apply(FailableCache.java:39)
	at com.google.inject.internal.util.$MapMaker$StrategyImpl.compute(MapMaker.java:549)
	at com.google.inject.internal.util.$MapMaker$StrategyImpl.compute(MapMaker.java:419)
	at com.google.inject.internal.util.$CustomConcurrentHashMap$ComputingImpl.get(CustomConcurrentHashMap.java:2041)
	at com.google.inject.internal.FailableCache.get(FailableCache.java:50)
	at com.google.inject.internal.ConstructorInjectorStore.get(ConstructorInjectorStore.java:49)
	at com.google.inject.internal.ConstructorBindingImpl.initialize(ConstructorBindingImpl.java:125)
	at com.google.inject.internal.InjectorImpl.initializeJitBinding(InjectorImpl.java:521)
	at com.google.inject.internal.InjectorImpl.createJustInTimeBinding(InjectorImpl.java:847)
	at com.google.inject.internal.InjectorImpl.createJustInTimeBindingRecursive(InjectorImpl.java:772)
	at com.google.inject.internal.InjectorImpl.getJustInTimeBinding(InjectorImpl.java:256)
	at com.google.inject.internal.InjectorImpl.getBindingOrThrow(InjectorImpl.java:205)
	at com.google.inject.internal.InjectorImpl.getInternalFactory(InjectorImpl.java:853)
	at com.google.inject.internal.InjectorImpl.createParameterInjector(InjectorImpl.java:925)
	at com.google.inject.internal.InjectorImpl.getParametersInjectors(InjectorImpl.java:913)
	at com.google.inject.internal.ConstructorInjectorStore.createConstructor(ConstructorInjectorStore.java:69)
	at com.google.inject.internal.ConstructorInjectorStore.access$000(ConstructorInjectorStore.java:28)
	at com.google.inject.internal.ConstructorInjectorStore$1.create(ConstructorInjectorStore.java:36)
	at com.google.inject.internal.ConstructorInjectorStore$1.create(ConstructorInjectorStore.java:32)
	at com.google.inject.internal.FailableCache$1.apply(FailableCache.java:39)
	at com.google.inject.internal.util.$MapMaker$StrategyImpl.compute(MapMaker.java:549)
	at com.google.inject.internal.util.$MapMaker$StrategyImpl.compute(MapMaker.java:419)
	at com.google.inject.internal.util.$CustomConcurrentHashMap$ComputingImpl.get(CustomConcurrentHashMap.java:2041)
	at com.google.inject.internal.FailableCache.get(FailableCache.java:50)
	at com.google.inject.internal.ConstructorInjectorStore.get(ConstructorInjectorStore.java:49)
	at com.google.inject.internal.ConstructorBindingImpl.initialize(ConstructorBindingImpl.java:125)
	at com.google.inject.internal.InjectorImpl.initializeJitBinding(InjectorImpl.java:521)
	at com.google.inject.internal.InjectorImpl.createJustInTimeBinding(InjectorImpl.java:847)
	at com.google.inject.internal.InjectorImpl.createJustInTimeBindingRecursive(InjectorImpl.java:772)
	at com.google.inject.internal.InjectorImpl.getJustInTimeBinding(InjectorImpl.java:256)
	at com.google.inject.internal.InjectorImpl.getBindingOrThrow(InjectorImpl.java:205)
	at com.google.inject.internal.InjectorImpl.getInternalFactory(InjectorImpl.java:853)
	at com.google.inject.internal.FactoryProxy.notify(FactoryProxy.java:46)
	at com.google.inject.internal.ProcessedBindingData.runCreationListeners(ProcessedBindingData.java:50)
	at com.google.inject.internal.InternalInjectorCreator.initializeStatically(InternalInjectorCreator.java:133)
	at com.google.inject.internal.InternalInjectorCreator.build(InternalInjectorCreator.java:106)
	at com.google.inject.Guice.createInjector(Guice.java:95)
	at com.google.inject.Guice.createInjector(Guice.java:72)
	at com.google.inject.Guice.createInjector(Guice.java:62)
	at org.jclouds.sshj.SshjSshClientTest.createClient(SshjSshClientTest.java:71)
	at org.jclouds.sshj.SshjSshClientTest.createClient(SshjSshClientTest.java:67)
	at org.jclouds.sshj.SshjSshClientTest.setupSsh(SshjSshClientTest.java:63)


Results :

Failed tests: 
  SshjSshClientTest.setupSsh:63->createClient:67->createClient:71 » $Computation

Tests run: 13, Failures: 1, Errors: 0, Skipped: 12

[INFO] ------------------------------------------------------------------------
[INFO] Reactor Summary:
[INFO] 
[INFO] Apache jclouds Project ............................ SUCCESS [18.886s]
[INFO] jclouds shared Maven resources .................... SUCCESS [4.763s]
[INFO] jclouds Components Core ........................... SUCCESS [1:34.259s]
[INFO] jclouds OpenStack Components Core ................. SUCCESS [19.865s]
[INFO] jclouds commons project ........................... SUCCESS [0.687s]
[INFO] jclouds script builder ............................ SUCCESS [7.787s]
[INFO] jclouds compute core .............................. SUCCESS [45.717s]
[INFO] jclouds Log4J Logging Module ...................... SUCCESS [2.613s]
[INFO] jclouds loadbalancer core ......................... SUCCESS [2.236s]
[INFO] jclouds sts api ................................... SUCCESS [8.558s]
[INFO] jclouds cloudwatch api ............................ SUCCESS [8.527s]
[INFO] jclouds SLF4J Logging Module ...................... SUCCESS [2.327s]
[INFO] jclouds bouncycastle EncryptionService Module ..... SUCCESS [4.920s]
[INFO] jclouds sshj ssh client ........................... FAILURE [31.661s]
[INFO] jclouds cloudstack core ........................... SKIPPED
[INFO] jclouds blobstore core ............................ SKIPPED
[INFO] jclouds filesystem core ........................... SKIPPED
[INFO] jclouds bring your own node provider .............. SKIPPED
[INFO] jclouds OkHttp Driver ............................. SKIPPED
[INFO] jclouds s3 api .................................... SKIPPED
[INFO] jclouds ec2 api ................................... SKIPPED
[INFO] jclouds sqs api ................................... SKIPPED
[INFO] jclouds elasticstack core ......................... SKIPPED
[INFO] jclouds atmos components .......................... SKIPPED
[INFO] jclouds openstack-keystone api .................... SKIPPED
[INFO] jclouds swift api ................................. SKIPPED
[INFO] jclouds openstack-cinder api ...................... SKIPPED
[INFO] Apache jclouds :: OpenStack :: Nova API ........... SKIPPED
[INFO] jclouds openstack-nova-ec2 api .................... SKIPPED
[INFO] jclouds openstack-swift api ....................... SKIPPED
[INFO] jclouds openstack-trove api ....................... SKIPPED
[INFO] jclouds cloudfiles api ............................ SKIPPED
[INFO] jclouds rackspace cloudidentity api ............... SKIPPED
[INFO] jclouds Rackspace Cloud Load Balancers API ........ SKIPPED
[INFO] jclouds Rackspace Next Generation Cloud Block Storage US provider  SKIPPED
[INFO] jclouds Rackspace Next Generation Cloud Servers US provider  SKIPPED
[INFO] jclouds rackspace clouddns api .................... SKIPPED
[INFO] jclouds route53 api ............................... SKIPPED
[INFO] jclouds Chef api .................................. SKIPPED
[INFO] jclouds apis project .............................. SKIPPED
[INFO] jclouds GoGrid provider ........................... SKIPPED
[INFO] jclouds Azure Storage provider .................... SKIPPED
[INFO] jclouds Apache Http Components Client ............. SKIPPED
[INFO] jclouds joda DateService Module ................... SKIPPED
[INFO] jclouds netty payload module ...................... SKIPPED
[INFO] jclouds enterprise Module ......................... SKIPPED
[INFO] jclouds Amazon Simple Storage Service (S3) provider  SKIPPED
[INFO] jclouds Amazon Elastic Load Balancer provider ..... SKIPPED
[INFO] jclouds Amazon EC2 provider ....................... SKIPPED
[INFO] jclouds Amazon Simple Queue Service provider ...... SKIPPED
[INFO] jclouds ElasticHosts Peer1 London provider ........ SKIPPED
[INFO] jclouds ElasticHosts Peer1 San Antonio provider ... SKIPPED
[INFO] jclouds ElasticHosts BlueSquare London provider ... SKIPPED
[INFO] jclouds ElasticHosts Peer1 Toronto provider ....... SKIPPED
[INFO] jclouds ElasticHosts Peer1 Los Angeles provider ... SKIPPED
[INFO] jclouds ElasticHosts Amsterdam provider ........... SKIPPED
[INFO] jclouds ElasticHosts San Jose provider ............ SKIPPED
[INFO] jclouds ElasticHosts Hong Kong provider ........... SKIPPED
[INFO] jclouds ElasticHosts Sydney provider .............. SKIPPED
[INFO] jclouds Open Hosting East1 provider ............... SKIPPED
[INFO] jclouds Serverlove Manchester provider ............ SKIPPED
[INFO] jclouds SkaliCloud Malaysia provider .............. SKIPPED
[INFO] jclouds Go2Cloud Johannesburg1 provider ........... SKIPPED
[INFO] jclouds SoftLayer core ............................ SKIPPED
[INFO] jclouds HP Cloud Compute provider ................. SKIPPED
[INFO] jclouds HP Cloud Block Storage Provider ........... SKIPPED
[INFO] jclouds HP Cloud Object Storage ................... SKIPPED
[INFO] jclouds CloudFiles US provider .................... SKIPPED
[INFO] jclouds CloudFiles UK provider .................... SKIPPED
[INFO] jclouds Rackspace Next Generation Cloud DNS US provider  SKIPPED
[INFO] jclouds Rackspace Next Generation Cloud DNS UK provider  SKIPPED
[INFO] jclouds Rackspace Cloud Databases US provider ..... SKIPPED
[INFO] jclouds Rackspace Cloud Databases UK provider ..... SKIPPED
[INFO] jclouds Rackspace Cloud Load Balancers US provider  SKIPPED
[INFO] jclouds Rackspace Cloud Load Balancers UK provider  SKIPPED
[INFO] jclouds Rackspace Next Generation Cloud Block Storage UK provider  SKIPPED
[INFO] jclouds Rackspace Next Generation Cloud Servers provider  SKIPPED
[INFO] jclouds GleSYS core ............................... SKIPPED
[INFO] jclouds Amazon Identity and Access Management (STS) provider  SKIPPED
[INFO] jclouds Amazon Route 53 provider .................. SKIPPED
[INFO] jclouds ultradns-ws provider ...................... SKIPPED
[INFO] jclouds dynect api ................................ SKIPPED
[INFO] jclouds Enterprise Chef provider .................. SKIPPED
[INFO] jclouds providers project ......................... SKIPPED
[INFO] jclouds jsch ssh client ........................... SKIPPED
[INFO] jclouds example components for a standalone compute provider  SKIPPED
[INFO] jclouds skeletons project ......................... SKIPPED
[INFO] jclouds Google App Engine Components .............. SKIPPED
[INFO] jclouds drivers project ........................... SKIPPED
[INFO] allcompute ........................................ SKIPPED
[INFO] allblobstore ...................................... SKIPPED
[INFO] allloadbalancer ................................... SKIPPED
[INFO] all ............................................... SKIPPED
[INFO] Apache jclouds .................................... SKIPPED
[INFO] ------------------------------------------------------------------------
[INFO] BUILD FAILURE
[INFO] ------------------------------------------------------------------------
[INFO] Total time: 4:17.652s
[INFO] Finished at: Tue Mar 31 14:59:53 EDT 2015
[INFO] Final Memory: 110M/371M
[INFO] ------------------------------------------------------------------------
[ERROR] Failed to execute goal org.apache.maven.plugins:maven-surefire-plugin:2.17:test (default-test) on project jclouds-sshj: There are test failures.
[ERROR] 
[ERROR] Please refer to <https://jclouds.ci.cloudbees.com/job/jclouds-guava-17-18/GUAVA_VERSION=17.0,jdk=OpenJDK%207%20(latest)/ws/drivers/sshj/target/surefire-reports> for the individual test results.
[ERROR] -> [Help 1]
org.apache.maven.lifecycle.LifecycleExecutionException: Failed to execute goal org.apache.maven.plugins:maven-surefire-plugin:2.17:test (default-test) on project jclouds-sshj: There are test failures.

Please refer to <https://jclouds.ci.cloudbees.com/job/jclouds-guava-17-18/GUAVA_VERSION=17.0,jdk=OpenJDK%207%20(latest)/ws/drivers/sshj/target/surefire-reports> for the individual test results.
	at org.apache.maven.lifecycle.internal.MojoExecutor.execute(MojoExecutor.java:213)
	at org.apache.maven.lifecycle.internal.MojoExecutor.execute(MojoExecutor.java:153)
	at org.apache.maven.lifecycle.internal.MojoExecutor.execute(MojoExecutor.java:145)
	at org.apache.maven.lifecycle.internal.LifecycleModuleBuilder.buildProject(LifecycleModuleBuilder.java:84)
	at org.apache.maven.lifecycle.internal.LifecycleModuleBuilder.buildProject(LifecycleModuleBuilder.java:59)
	at org.apache.maven.lifecycle.internal.LifecycleStarter.singleThreadedBuild(LifecycleStarter.java:183)
	at org.apache.maven.lifecycle.internal.LifecycleStarter.execute(LifecycleStarter.java:161)
	at org.apache.maven.DefaultMaven.doExecute(DefaultMaven.java:320)
	at org.apache.maven.DefaultMaven.execute(DefaultMaven.java:156)
	at org.apache.maven.cli.MavenCli.execute(MavenCli.java:537)
	at org.apache.maven.cli.MavenCli.doMain(MavenCli.java:196)
	at org.apache.maven.cli.MavenCli.main(MavenCli.java:141)
	at sun.reflect.NativeMethodAccessorImpl.invoke0(Native Method)
	at sun.reflect.NativeMethodAccessorImpl.invoke(NativeMethodAccessorImpl.java:57)
	at sun.reflect.DelegatingMethodAccessorImpl.invoke(DelegatingMethodAccessorImpl.java:43)
	at java.lang.reflect.Method.invoke(Method.java:606)
	at org.codehaus.plexus.classworlds.launcher.Launcher.launchEnhanced(Launcher.java:290)
	at org.codehaus.plexus.classworlds.launcher.Launcher.launch(Launcher.java:230)
	at org.codehaus.plexus.classworlds.launcher.Launcher.mainWithExitCode(Launcher.java:409)
	at org.codehaus.plexus.classworlds.launcher.Launcher.main(Launcher.java:352)
Caused by: org.apache.maven.plugin.MojoFailureException: There are test failures.

Please refer to <https://jclouds.ci.cloudbees.com/job/jclouds-guava-17-18/GUAVA_VERSION=17.0,jdk=OpenJDK%207%20(latest)/ws/drivers/sshj/target/surefire-reports> for the individual test results.
	at org.apache.maven.plugin.surefire.SurefireHelper.reportExecution(SurefireHelper.java:82)
	at org.apache.maven.plugin.surefire.SurefirePlugin.handleSummary(SurefirePlugin.java:195)
	at org.apache.maven.plugin.surefire.AbstractSurefireMojo.executeAfterPreconditionsChecked(AbstractSurefireMojo.java:861)
	at org.apache.maven.plugin.surefire.AbstractSurefireMojo.execute(AbstractSurefireMojo.java:729)
	at org.apache.maven.plugin.DefaultBuildPluginManager.executeMojo(DefaultBuildPluginManager.java:101)
	at org.apache.maven.lifecycle.internal.MojoExecutor.execute(MojoExecutor.java:209)
	... 19 more
[ERROR] 
[ERROR] Re-run Maven using the -X switch to enable full debug logging.
[ERROR] 
[ERROR] For more information about the errors and possible solutions, please read the following articles:
[ERROR] [Help 1] http://cwiki.apache.org/confluence/display/MAVEN/MojoFailureException
[ERROR] 
[ERROR] After correcting the problems, you can resume the build with the command
[ERROR]   mvn <goals> -rf :jclouds-sshj
Build step 'Invoke top-level Maven targets' marked build as failure