You are viewing a plain text version of this content. The canonical link for it is here.
Posted to dev@river.apache.org by Apache Jenkins Server <je...@builds.apache.org> on 2014/06/02 13:50:29 UTC

Build failed in Jenkins: river-JERITests #6

See <https://builds.apache.org/job/river-JERITests/6/>

------------------------------------------
[...truncated 8841 lines...]
     [java] Test Passed: OK
     [java] 
     [java] -----------------------------------------
     [java] com/sun/jini/test/spec/jeri/https/HttpsConstructorAccessor.td
     [java] Test Passed: OK
     [java] 
     [java] -----------------------------------------
     [java] com/sun/jini/test/spec/jeri/https/HttpsEndpointInUse.td
     [java] Test Passed: OK
     [java] 
     [java] -----------------------------------------
     [java] com/sun/jini/test/spec/jeri/https/HttpsEqualityTest.td
     [java] Test Passed: OK
     [java] 
     [java] -----------------------------------------
     [java] com/sun/jini/test/spec/jeri/https/HttpsIllegalArgumentException.td
     [java] Test Passed: OK
     [java] 
     [java] -----------------------------------------
     [java] com/sun/jini/test/spec/jeri/https/HttpsListenContextException.td
     [java] Test Passed: OK
     [java] 
     [java] -----------------------------------------
     [java] com/sun/jini/test/spec/jeri/https/HttpsNewRequestConflictingConstraints.td
     [java] Test Passed: OK
     [java] 
     [java] -----------------------------------------
     [java] com/sun/jini/test/spec/jeri/https/HttpsNullPointerException.td
     [java] Test Passed: OK
     [java] 
     [java] -----------------------------------------
     [java] com/sun/jini/test/spec/jeri/https/HttpsRobustnessTest.td
     [java] Test Passed: OK
     [java] 
     [java] -----------------------------------------
     [java] com/sun/jini/test/spec/jeri/https/HttpsServerConstructorAccessor.td
     [java] Test Failed: Test Failed with an Unexpected Exception: java.lang.ExceptionInInitializerError
     [java] 
     [java] -----------------------------------------
     [java] com/sun/jini/test/spec/jeri/https/HttpsServerEndpoint.td
     [java] Test Passed: OK
     [java] 
     [java] -----------------------------------------
     [java] com/sun/jini/test/spec/jeri/kerberos/KerberosCheckConstraints.td
     [java] Test Skipped: verifiers are: com.sun.jini.qa.harness.SkipTestVerifier
     [java] -----------------------------------------
     [java] com/sun/jini/test/spec/jeri/kerberos/KerberosCheckTrustEquivalence.td
     [java] Test Skipped: verifiers are: com.sun.jini.qa.harness.SkipTestVerifier
     [java] -----------------------------------------
     [java] com/sun/jini/test/spec/jeri/kerberos/KerberosConstructorAccessor.td
     [java] Test Skipped: verifiers are: com.sun.jini.qa.harness.SkipTestVerifier
     [java] -----------------------------------------
     [java] com/sun/jini/test/spec/jeri/kerberos/KerberosEndpointInUse.td
     [java] Test Skipped: verifiers are: com.sun.jini.qa.harness.SkipTestVerifier
     [java] -----------------------------------------
     [java] com/sun/jini/test/spec/jeri/kerberos/KerberosEqualityTest.td
     [java] Test Skipped: verifiers are: com.sun.jini.qa.harness.SkipTestVerifier
     [java] -----------------------------------------
     [java] com/sun/jini/test/spec/jeri/kerberos/KerberosIllegalArgumentException.td
     [java] Test Skipped: verifiers are: com.sun.jini.qa.harness.SkipTestVerifier
     [java] -----------------------------------------
     [java] com/sun/jini/test/spec/jeri/kerberos/KerberosListenContextException.td
     [java] Test Skipped: verifiers are: com.sun.jini.qa.harness.SkipTestVerifier
     [java] -----------------------------------------
     [java] com/sun/jini/test/spec/jeri/kerberos/KerberosNewRequestConflictingConstraints.td
     [java] Test Skipped: verifiers are: com.sun.jini.qa.harness.SkipTestVerifier
     [java] -----------------------------------------
     [java] com/sun/jini/test/spec/jeri/kerberos/KerberosNullPointerException.td
     [java] Test Skipped: verifiers are: com.sun.jini.qa.harness.SkipTestVerifier
     [java] -----------------------------------------
     [java] com/sun/jini/test/spec/jeri/kerberos/KerberosRobustnessTest.td
     [java] Test Skipped: verifiers are: com.sun.jini.qa.harness.SkipTestVerifier
     [java] -----------------------------------------
     [java] com/sun/jini/test/spec/jeri/kerberos/KerberosServerConstructorAccessor.td
     [java] Test Skipped: verifiers are: com.sun.jini.qa.harness.SkipTestVerifier
     [java] -----------------------------------------
     [java] com/sun/jini/test/spec/jeri/kerberos/KerberosServerEndpoint.td
     [java] Test Skipped: verifiers are: com.sun.jini.qa.harness.SkipTestVerifier
     [java] -----------------------------------------
     [java] com/sun/jini/test/spec/jeri/kerberostrustverifier/IsTrustedObject.td
     [java] Test Passed: OK
     [java] 
     [java] -----------------------------------------
     [java] com/sun/jini/test/spec/jeri/mux/ClientAbortTest.td
     [java] Test Passed: OK
     [java] 
     [java] -----------------------------------------
     [java] com/sun/jini/test/spec/jeri/mux/ClientFlowControlTest.td
     [java] Test Passed: OK
     [java] 
     [java] -----------------------------------------
     [java] com/sun/jini/test/spec/jeri/mux/CloseTest.td
     [java] Test Passed: OK
     [java] 
     [java] -----------------------------------------
     [java] com/sun/jini/test/spec/jeri/mux/MuxClientTest.td
     [java] Test Passed: OK
     [java] 
     [java] -----------------------------------------
     [java] com/sun/jini/test/spec/jeri/mux/MuxServerTest.td
     [java] Test Passed: OK
     [java] 
     [java] -----------------------------------------
     [java] com/sun/jini/test/spec/jeri/mux/ServerAbortTest.td
     [java] Test Passed: OK
     [java] 
     [java] -----------------------------------------
     [java] com/sun/jini/test/spec/jeri/mux/ServerFlowControlTest.td
     [java] Test Passed: OK
     [java] 
     [java] -----------------------------------------
     [java] com/sun/jini/test/spec/jeri/proxytrustilfactory/AccessorTest.td
     [java] Test Passed: OK
     [java] 
     [java] -----------------------------------------
     [java] com/sun/jini/test/spec/jeri/proxytrustilfactory/ConstructorAccessorTest.td
     [java] Test Passed: OK
     [java] 
     [java] -----------------------------------------
     [java] com/sun/jini/test/spec/jeri/ssl/SslCheckConstraints.td
     [java] Test Passed: OK
     [java] 
     [java] -----------------------------------------
     [java] com/sun/jini/test/spec/jeri/ssl/SslCheckTrustEquivalence.td
     [java] Test Passed: OK
     [java] 
     [java] -----------------------------------------
     [java] com/sun/jini/test/spec/jeri/ssl/SslConstructorAccessor.td
     [java] Test Passed: OK
     [java] 
     [java] -----------------------------------------
     [java] com/sun/jini/test/spec/jeri/ssl/SslEndpointInUse.td
     [java] Test Passed: OK
     [java] 
     [java] -----------------------------------------
     [java] com/sun/jini/test/spec/jeri/ssl/SslEqualityTest.td
     [java] Test Passed: OK
     [java] 
     [java] -----------------------------------------
     [java] com/sun/jini/test/spec/jeri/ssl/SslIllegalArgumentException.td
     [java] Test Passed: OK
     [java] 
     [java] -----------------------------------------
     [java] com/sun/jini/test/spec/jeri/ssl/SslListenContextException.td
     [java] Test Passed: OK
     [java] 
     [java] -----------------------------------------
     [java] com/sun/jini/test/spec/jeri/ssl/SslNewRequestConflictingConstraints.td
     [java] Test Passed: OK
     [java] 
     [java] -----------------------------------------
     [java] com/sun/jini/test/spec/jeri/ssl/SslNullPointerException.td
     [java] Test Passed: OK
     [java] 
     [java] -----------------------------------------
     [java] com/sun/jini/test/spec/jeri/ssl/SslRobustnessTest.td
     [java] Test Passed: OK
     [java] 
     [java] -----------------------------------------
     [java] com/sun/jini/test/spec/jeri/ssl/SslServerConstructorAccessor.td
     [java] Test Failed: Test Failed with an Unexpected Exception: java.security.PrivilegedActionException: java.lang.reflect.InvocationTargetException
     [java] 
     [java] -----------------------------------------
     [java] com/sun/jini/test/spec/jeri/ssl/SslServerEndpoint.td
     [java] Test Passed: OK
     [java] 
     [java] -----------------------------------------
     [java] com/sun/jini/test/spec/jeri/ssltrustverifier/IsTrustedObject.td
     [java] Test Passed: OK
     [java] 
     [java] -----------------------------------------
     [java] com/sun/jini/test/spec/jeri/tcp/TcpCheckConstraints.td
     [java] Test Passed: OK
     [java] 
     [java] -----------------------------------------
     [java] com/sun/jini/test/spec/jeri/tcp/TcpCheckTrustEquivalence.td
     [java] Test Passed: OK
     [java] 
     [java] -----------------------------------------
     [java] com/sun/jini/test/spec/jeri/tcp/TcpConstructorAccessor.td
     [java] Test Passed: OK
     [java] 
     [java] -----------------------------------------
     [java] com/sun/jini/test/spec/jeri/tcp/TcpEndpointInUse.td
     [java] Test Passed: OK
     [java] 
     [java] -----------------------------------------
     [java] com/sun/jini/test/spec/jeri/tcp/TcpEqualityTest.td
     [java] Test Passed: OK
     [java] 
     [java] -----------------------------------------
     [java] com/sun/jini/test/spec/jeri/tcp/TcpIllegalArgumentException.td
     [java] Test Passed: OK
     [java] 
     [java] -----------------------------------------
     [java] com/sun/jini/test/spec/jeri/tcp/TcpListenContextException.td
     [java] Test Passed: OK
     [java] 
     [java] -----------------------------------------
     [java] com/sun/jini/test/spec/jeri/tcp/TcpNewRequestConflictingConstraints.td
     [java] Test Passed: OK
     [java] 
     [java] -----------------------------------------
     [java] com/sun/jini/test/spec/jeri/tcp/TcpNullPointerException.td
     [java] Test Passed: OK
     [java] 
     [java] -----------------------------------------
     [java] com/sun/jini/test/spec/jeri/tcp/TcpRobustnessTest.td
     [java] Test Passed: OK
     [java] 
     [java] -----------------------------------------
     [java] com/sun/jini/test/spec/jeri/tcp/TcpServerConstructorAccessor.td
     [java] Test Passed: OK
     [java] 
     [java] -----------------------------------------
     [java] com/sun/jini/test/spec/jeri/tcp/TcpServerEndpoint.td
     [java] Test Passed: OK
     [java] 
     [java] -----------------------------------------
     [java] 
     [java] # of tests started   = 122
     [java] # of tests completed = 122
     [java] # of tests skipped   = 12
     [java] # of tests passed    = 120
     [java] # of tests failed    = 2
     [java] 
     [java] -----------------------------------------
     [java] 
     [java]    Date finished:
     [java]       Mon Jun 02 11:50:27 UTC 2014
     [java]    Time elapsed:
     [java]       1505 seconds
     [java] 
     [java] Java Result: 1

collect-result:
     [copy] Copying 1 file to <https://builds.apache.org/job/river-JERITests/ws/trunk/qa/result>
     [copy] Copying 1 file to <https://builds.apache.org/job/river-JERITests/ws/trunk/qa/result>
      [zip] Building zip: <https://builds.apache.org/job/river-JERITests/6/artifact/trunk/qa/result/qaresults-i386-Linux-1.7.0_25.zip>

BUILD FAILED
<https://builds.apache.org/job/river-JERITests/ws/trunk/build.xml>:61: The following error occurred while executing this line:
<https://builds.apache.org/job/river-JERITests/ws/trunk/qa/build.xml>:380: condition satisfied

Total time: 29 minutes 38 seconds
Build step 'Invoke Ant' marked build as failure
[locks-and-latches] Releasing all the locks
[locks-and-latches] All the locks released
Archiving artifacts

Jenkins build is back to normal : river-JERITests #8

Posted by Apache Jenkins Server <je...@builds.apache.org>.
See <https://builds.apache.org/job/river-JERITests/8/>


Build failed in Jenkins: river-JERITests #7

Posted by Apache Jenkins Server <je...@builds.apache.org>.
See <https://builds.apache.org/job/river-JERITests/7/changes>

Changes:

[peter_firmstone] Changed PreferredListGen to catch a NoClassDefFoundError, print message to System.err and continue.  Sometimes classes found are not available as they are in external libraries, this shouldn't stop PreferredListGen from working.

Altered registering ThreadPool's shutdown hook to be performed from privileged context.

------------------------------------------
[...truncated 7821 lines...]

computehttpmdcodebase.jar:

jsk-debug-policy.jar:
      [jar] Building jar: <https://builds.apache.org/job/river-JERITests/ws/trunk/lib-ext/jsk-debug-policy.jar>

preferredlistgen.jar:

envcheck.jar:
      [jar] Updating jar: <https://builds.apache.org/job/river-JERITests/ws/trunk/lib/envcheck.jar>

toolswrappers.jars:

destroy.jar:
     [java] Warning: Class not found: au.net.zeus.collection.Referrer
     [java] Warning: Class not found: au.net.zeus.collection.RC
     [java] Warning: Class not found: au.net.zeus.collection.Ref
     [java] Warning: Class not found: org.cliffc.high_scale_lib.NonBlockingHashMap
      [jar] Building jar: <https://builds.apache.org/job/river-JERITests/ws/trunk/lib/destroy.jar>

fiddler.jar:
     [java] Warning: Class not found: au.net.zeus.collection.RC
     [java] Warning: Class not found: au.net.zeus.collection.Ref
      [jar] Building jar: <https://builds.apache.org/job/river-JERITests/ws/trunk/lib/fiddler.jar>

fiddler-dl.jar:
     [java] Warning: Class not found: au.net.zeus.collection.RC
     [java] Warning: Class not found: au.net.zeus.collection.Ref
      [jar] Building jar: <https://builds.apache.org/job/river-JERITests/ws/trunk/lib-dl/fiddler-dl.jar>

group.jar:
     [java] Warning: Class not found: au.net.zeus.collection.RC
     [java] Warning: Class not found: au.net.zeus.collection.Ref
      [jar] Building jar: <https://builds.apache.org/job/river-JERITests/ws/trunk/lib/group.jar>

group-dl.jar:
      [jar] Building jar: <https://builds.apache.org/job/river-JERITests/ws/trunk/lib-dl/group-dl.jar>

mahalo.jar:
     [java] Warning: Class not found: au.net.zeus.collection.RC
     [java] Warning: Class not found: au.net.zeus.collection.Ref
      [jar] Building jar: <https://builds.apache.org/job/river-JERITests/ws/trunk/lib/mahalo.jar>

mahalo-dl.jar:
     [java] Warning: Class not found: au.net.zeus.collection.RC
     [java] Warning: Class not found: au.net.zeus.collection.Ref
      [jar] Building jar: <https://builds.apache.org/job/river-JERITests/ws/trunk/lib-dl/mahalo-dl.jar>

mercury.jar:
     [java] Warning: Class not found: au.net.zeus.collection.RC
     [java] Warning: Class not found: au.net.zeus.collection.Ref
      [jar] Building jar: <https://builds.apache.org/job/river-JERITests/ws/trunk/lib/mercury.jar>

mercury-dl.jar:
     [java] Warning: Class not found: au.net.zeus.collection.RC
     [java] Warning: Class not found: au.net.zeus.collection.Ref
      [jar] Building jar: <https://builds.apache.org/job/river-JERITests/ws/trunk/lib-dl/mercury-dl.jar>

norm.jar:
     [java] Warning: Class not found: au.net.zeus.collection.RC
     [java] Warning: Class not found: au.net.zeus.collection.Ref
      [jar] Building jar: <https://builds.apache.org/job/river-JERITests/ws/trunk/lib/norm.jar>

norm-dl.jar:
     [java] Warning: Class not found: au.net.zeus.collection.RC
     [java] Warning: Class not found: au.net.zeus.collection.Ref
      [jar] Building jar: <https://builds.apache.org/job/river-JERITests/ws/trunk/lib-dl/norm-dl.jar>

outrigger-snaplogstore.jar:
      [jar] Building jar: <https://builds.apache.org/job/river-JERITests/ws/trunk/lib/outrigger-snaplogstore.jar>

outrigger.jar:
     [java] Warning: Class not found: au.net.zeus.collection.RC
     [java] Warning: Class not found: au.net.zeus.collection.Ref
      [jar] Building jar: <https://builds.apache.org/job/river-JERITests/ws/trunk/lib/outrigger.jar>

outrigger-dl.jar:
     [java] Warning: Class not found: au.net.zeus.collection.RC
     [java] Warning: Class not found: au.net.zeus.collection.Ref
      [jar] Building jar: <https://builds.apache.org/job/river-JERITests/ws/trunk/lib-dl/outrigger-dl.jar>

phoenix.jar:
     [java] Warning: Class not found: au.net.zeus.collection.Referrer
     [java] Warning: Class not found: au.net.zeus.collection.RC
     [java] Warning: Class not found: org.cliffc.high_scale_lib.NonBlockingHashMap
     [java] Warning: Class not found: au.net.zeus.collection.Ref
      [jar] Building jar: <https://builds.apache.org/job/river-JERITests/ws/trunk/lib/phoenix.jar>

phoenix-dl.jar:
     [java] Warning: Class not found: au.net.zeus.collection.RC
     [java] Warning: Class not found: au.net.zeus.collection.Ref
      [jar] Building jar: <https://builds.apache.org/job/river-JERITests/ws/trunk/lib-dl/phoenix-dl.jar>

phoenix-group.jar:
     [java] Warning: Class not found: au.net.zeus.collection.RC
     [java] Warning: Class not found: au.net.zeus.collection.Ref
      [jar] Building jar: <https://builds.apache.org/job/river-JERITests/ws/trunk/lib/phoenix-group.jar>

phoenix-init.jar:
     [java] Warning: Class not found: au.net.zeus.collection.Referrer
     [java] Warning: Class not found: au.net.zeus.collection.RC
     [java] Warning: Class not found: org.cliffc.high_scale_lib.NonBlockingHashMap
     [java] Warning: Class not found: au.net.zeus.collection.Ref
      [jar] Building jar: <https://builds.apache.org/job/river-JERITests/ws/trunk/lib/phoenix-init.jar>

reggie.jar:
     [java] Warning: Class not found: au.net.zeus.collection.RC
     [java] Warning: Class not found: au.net.zeus.collection.Ref
      [jar] Building jar: <https://builds.apache.org/job/river-JERITests/ws/trunk/lib/reggie.jar>

reggie-dl.jar:
     [java] Warning: Class not found: au.net.zeus.collection.RC
     [java] Warning: Class not found: au.net.zeus.collection.Ref
      [jar] Building jar: <https://builds.apache.org/job/river-JERITests/ws/trunk/lib-dl/reggie-dl.jar>

serviceui.jar:
      [jar] Building jar: <https://builds.apache.org/job/river-JERITests/ws/trunk/lib/serviceui.jar>

sharedvm.jar:
     [java] Warning: Class not found: au.net.zeus.collection.RC
     [java] Warning: Class not found: au.net.zeus.collection.Ref
      [jar] Building jar: <https://builds.apache.org/job/river-JERITests/ws/trunk/lib/sharedvm.jar>

start.jar:
     [java] Warning: Class not found: au.net.zeus.collection.Referrer
     [java] Warning: Class not found: au.net.zeus.collection.RC
     [java] Warning: Class not found: org.cliffc.high_scale_lib.NonBlockingHashMap
     [java] Warning: Class not found: au.net.zeus.collection.Ref
      [jar] Building jar: <https://builds.apache.org/job/river-JERITests/ws/trunk/lib/start.jar>

services.jars:

extra.jar:
      [jar] Building jar: <https://builds.apache.org/job/river-JERITests/ws/trunk/lib/extra.jar>

browser.jar:
     [java] Warning: Class not found: au.net.zeus.collection.RC
     [java] Warning: Class not found: au.net.zeus.collection.Ref
      [jar] Building jar: <https://builds.apache.org/job/river-JERITests/ws/trunk/lib/browser.jar>

browser-dl.jar:
      [jar] Building jar: <https://builds.apache.org/job/river-JERITests/ws/trunk/lib-dl/browser-dl.jar>
     [java] Warning: Nested class Transaction$Created has different preferred state than outer class Transaction
     [java] Warning: Nested class LookupLocator$1 has different preferred state than outer class LookupLocator

browser.jars:

jars:

river-runtime:
    [touch] Creating <https://builds.apache.org/job/river-JERITests/ws/trunk/qa/riverruntimelastbuild>

prep:
    [mkdir] Created dir: <https://builds.apache.org/job/river-JERITests/ws/trunk/qa/build>
    [mkdir] Created dir: <https://builds.apache.org/job/river-JERITests/ws/trunk/qa/build/classes>
    [mkdir] Created dir: <https://builds.apache.org/job/river-JERITests/ws/trunk/qa/build/deps>
    [mkdir] Created dir: <https://builds.apache.org/job/river-JERITests/ws/trunk/qa/lib>
    [mkdir] Created dir: <https://builds.apache.org/job/river-JERITests/ws/trunk/qa/lib-ext>

copy-resources:
     [copy] Copying 1806 files to <https://builds.apache.org/job/river-JERITests/ws/trunk/qa/build/classes>

compile:
    [javac] Compiling 1982 source files to <https://builds.apache.org/job/river-JERITests/ws/trunk/qa/build/classes>
    [javac] <https://builds.apache.org/job/river-JERITests/ws/trunk/qa/src/com/sun/jini/test/impl/mahalo/RandomStressTask.java>:22: error: package com.sun.jini.mahalo does not exist
    [javac] import com.sun.jini.mahalo.*;
    [javac] ^
    [javac] <https://builds.apache.org/job/river-JERITests/ws/trunk/qa/src/com/sun/jini/test/impl/mahalo/RandomStressTask.java>:23: error: package com.sun.jini.mahalo.log does not exist
    [javac] import com.sun.jini.mahalo.log.*;
    [javac] ^
    [javac] <https://builds.apache.org/job/river-JERITests/ws/trunk/qa/src/com/sun/jini/test/impl/mahalo/CommitStressTask.java>:21: error: package com.sun.jini.mahalo does not exist
    [javac] import com.sun.jini.mahalo.*;
    [javac] ^
    [javac] <https://builds.apache.org/job/river-JERITests/ws/trunk/qa/src/com/sun/jini/test/impl/mahalo/CommitStressTask.java>:22: error: package com.sun.jini.mahalo.log does not exist
    [javac] import com.sun.jini.mahalo.log.*;
    [javac] ^
    [javac] <https://builds.apache.org/job/river-JERITests/ws/trunk/qa/src/com/sun/jini/test/impl/mahalo/PrepareAndCommitExceptionTest.java>:21: error: package com.sun.jini.mahalo does not exist
    [javac] import com.sun.jini.mahalo.*;
    [javac] ^
    [javac] <https://builds.apache.org/job/river-JERITests/ws/trunk/qa/src/com/sun/jini/test/share/TxnManagerTest.java>:23: error: package com.sun.jini.mahalo does not exist
    [javac] import com.sun.jini.mahalo.*;
    [javac] ^
    [javac] <https://builds.apache.org/job/river-JERITests/ws/trunk/qa/src/com/sun/jini/test/impl/mahalo/PrepareAndCommitExceptionTest2.java>:21: error: package com.sun.jini.mahalo does not exist
    [javac] import com.sun.jini.mahalo.*;
    [javac] ^
    [javac] <https://builds.apache.org/job/river-JERITests/ws/trunk/qa/src/com/sun/jini/test/impl/mahalo/PrepareAndCommitExceptionTest3.java>:21: error: package com.sun.jini.mahalo does not exist
    [javac] import com.sun.jini.mahalo.*;
    [javac] ^
    [javac] <https://builds.apache.org/job/river-JERITests/ws/trunk/qa/src/com/sun/jini/test/impl/mahalo/PrepareAndCommitExceptionTest4.java>:21: error: package com.sun.jini.mahalo does not exist
    [javac] import com.sun.jini.mahalo.*;
    [javac] ^
    [javac] <https://builds.apache.org/job/river-JERITests/ws/trunk/qa/src/com/sun/jini/test/impl/mahalo/PrepareAndCommitExceptionTest5.java>:21: error: package com.sun.jini.mahalo does not exist
    [javac] import com.sun.jini.mahalo.*;
    [javac] ^
    [javac] <https://builds.apache.org/job/river-JERITests/ws/trunk/qa/src/com/sun/jini/test/share/TestParticipantImpl.java>:21: error: package com.sun.jini.mahalo does not exist
    [javac] import com.sun.jini.mahalo.*;
    [javac] ^
    [javac] <https://builds.apache.org/job/river-JERITests/ws/trunk/qa/src/com/sun/jini/test/spec/txnmanager/AsynchAbortOnCommitTest.java>:21: error: package com.sun.jini.mahalo does not exist
    [javac] import com.sun.jini.mahalo.*;
    [javac] ^
    [javac] <https://builds.apache.org/job/river-JERITests/ws/trunk/qa/src/com/sun/jini/test/spec/txnmanager/AsynchAbortOnPrepareTest.java>:21: error: package com.sun.jini.mahalo does not exist
    [javac] import com.sun.jini.mahalo.*;
    [javac] ^
    [javac] <https://builds.apache.org/job/river-JERITests/ws/trunk/qa/src/com/sun/jini/test/spec/txnmanager/CommitExpiredTest.java>:21: error: package com.sun.jini.mahalo does not exist
    [javac] import com.sun.jini.mahalo.*;
    [javac] ^
    [javac] <https://builds.apache.org/job/river-JERITests/ws/trunk/qa/src/com/sun/jini/test/spec/txnmanager/CommitTimeoutTest.java>:21: error: package com.sun.jini.mahalo does not exist
    [javac] import com.sun.jini.mahalo.*;
    [javac] ^
    [javac] <https://builds.apache.org/job/river-JERITests/ws/trunk/qa/src/com/sun/jini/test/spec/txnmanager/GetStateTest.java>:21: error: package com.sun.jini.mahalo does not exist
    [javac] import com.sun.jini.mahalo.*;
    [javac] ^
    [javac] <https://builds.apache.org/job/river-JERITests/ws/trunk/qa/src/com/sun/jini/test/spec/txnmanager/JoinIdempotentTest.java>:21: error: package com.sun.jini.mahalo does not exist
    [javac] import com.sun.jini.mahalo.*;
    [javac] ^
    [javac] <https://builds.apache.org/job/river-JERITests/ws/trunk/qa/src/com/sun/jini/test/spec/txnmanager/JoinWhileActiveTest.java>:21: error: package com.sun.jini.mahalo does not exist
    [javac] import com.sun.jini.mahalo.*;
    [javac] ^
    [javac] <https://builds.apache.org/job/river-JERITests/ws/trunk/qa/src/com/sun/jini/test/spec/txnmanager/ManyParticipantsTest.java>:21: error: package com.sun.jini.mahalo does not exist
    [javac] import com.sun.jini.mahalo.*;
    [javac] ^
    [javac] <https://builds.apache.org/job/river-JERITests/ws/trunk/qa/src/com/sun/jini/test/spec/txnmanager/PrepareTimeoutTest.java>:21: error: package com.sun.jini.mahalo does not exist
    [javac] import com.sun.jini.mahalo.*;
    [javac] ^
    [javac] <https://builds.apache.org/job/river-JERITests/ws/trunk/qa/src/com/sun/jini/test/spec/txnmanager/RollBackErrorTest.java>:21: error: package com.sun.jini.mahalo does not exist
    [javac] import com.sun.jini.mahalo.*;
    [javac] ^
    [javac] <https://builds.apache.org/job/river-JERITests/ws/trunk/qa/src/com/sun/jini/test/spec/txnmanager/RollForwardErrorTest.java>:21: error: package com.sun.jini.mahalo does not exist
    [javac] import com.sun.jini.mahalo.*;
    [javac] ^
    [javac] <https://builds.apache.org/job/river-JERITests/ws/trunk/qa/src/com/sun/jini/test/spec/txnmanager/TwoPhaseTest.java>:21: error: package com.sun.jini.mahalo does not exist
    [javac] import com.sun.jini.mahalo.*;
    [javac] ^
    [javac] Note: Some input files use or override a deprecated API.
    [javac] Note: Recompile with -Xlint:deprecation for details.
    [javac] Note: Some input files use unchecked or unsafe operations.
    [javac] Note: Recompile with -Xlint:unchecked for details.
    [javac] 23 errors

BUILD FAILED
<https://builds.apache.org/job/river-JERITests/ws/trunk/build.xml>:60: The following error occurred while executing this line:
<https://builds.apache.org/job/river-JERITests/ws/trunk/qa/build.xml>:184: The following error occurred while executing this line:
<https://builds.apache.org/job/river-JERITests/ws/trunk/common.xml>:225: Compile failed; see the compiler error output for details.

Total time: 2 minutes 2 seconds
Build step 'Invoke Ant' marked build as failure
[locks-and-latches] Releasing all the locks
[locks-and-latches] All the locks released
Archiving artifacts