You are viewing a plain text version of this content. The canonical link for it is here.
Posted to commits@flex.apache.org by fl...@gmail.com on 2015/03/19 22:59:29 UTC
rc_flex-sdk_mustella-mobile - Build # 159 - Failure!
rc_flex-sdk_mustella-mobile - Build # 159 - Failure:
http://flex-mustella.cloudapp.net/job/rc_flex-sdk_mustella-mobile/159/
Changes for Build #159
No changes
--------------------------------
[...truncated 13063 lines...]
[java] test script count: 4
[java] apollo adj with : C:\jenkins_slave\workspace\rc_flex-sdk_mustella-mobile\mustella\tests\mobile\SkinnablePopUpContainer\swfs\SkinnablePopUpContainerApp.swf
[java] apollo adj thinks it's a swf
[java] writing Apollo file!
[java] full swf is C:\jenkins_slave\workspace\rc_flex-sdk_mustella-mobile\mustella\tests\mobile\SkinnablePopUpContainer\swfs\SkinnablePopUpContainerApp.swf
[java] starting the baseline server: Thu Mar 19 16:52:19 ACT 2015
[java] post ApolloAdjuster: C:\jenkins_slave\workspace\rc_flex-sdk_mustella-mobile\mustella\tests\mobile\SkinnablePopUpContainer\swfs\SkinnablePopUpContainerApp.xml
[java] new test file: C:\jenkins_slave\workspace\rc_flex-sdk_mustella-mobile\mustella\tests\mobile\SkinnablePopUpContainer\swfs\SkinnablePopUpContainerApp.xml
[java] ******** cmdArr before:
[java] C:\ApacheFlex\dependencies\AdobeAIRSDK\16\bin\adl.exe
[java] C:\jenkins_slave\workspace\rc_flex-sdk_mustella-mobile\mustella\tests\mobile\SkinnablePopUpContainer\swfs\SkinnablePopUpContainerApp.xml
[java] ******** moreParameters before:
[java] -screensize
[java] 640x960:640x960
[java] -profile
[java] mobileDevice
[java] -XscreenDPI
[java] 240
[java] ******** cmdArr after:
[java] C:\ApacheFlex\dependencies\AdobeAIRSDK\16\bin\adl.exe
[java] C:\jenkins_slave\workspace\rc_flex-sdk_mustella-mobile\mustella\tests\mobile\SkinnablePopUpContainer\swfs\SkinnablePopUpContainerApp.xml
[java] -screensize
[java] 640x960:640x960
[java] -profile
[java] mobileDevice
[java] -XscreenDPI
[java] 240
[java] getting directory from the swf file
[java] derived directory: C:\jenkins_slave\workspace\rc_flex-sdk_mustella-mobile\mustella\tests\mobile\SkinnablePopUpContainer\swfs
[java] Launching:
[java] C:\ApacheFlex\dependencies\AdobeAIRSDK\16\bin\adl.exe C:\jenkins_slave\workspace\rc_flex-sdk_mustella-mobile\mustella\tests\mobile\SkinnablePopUpContainer\swfs\SkinnablePopUpContainerApp.xml -screensize 640x960:640x960 -profile mobileDevice -XscreenDPI 240 Launching: C:\ApacheFlex\dependencies\AdobeAIRSDK\16\bin\adl.exe C:\jenkins_slave\workspace\rc_flex-sdk_mustella-mobile\mustella\tests\mobile\SkinnablePopUpContainer\swfs\SkinnablePopUpContainerApp.xml
[java] USING directory: C:\jenkins_slave\workspace\rc_flex-sdk_mustella-mobile\mustella\tests\mobile\SkinnablePopUpContainer\swfs
[java] time: 16:52:21.207
[java] Firing Meta Timeout for process start after 12000 millis at: 16:52:33.257
[java] clobberProcess true
[java] ClobberProcess, destroying process
[java] unpacked result: C:\jenkins_slave\workspace\rc_flex-sdk_mustella-mobile\mustella\tests\mobile\SkinnablePopUpContainer\swfs\SkinnablePopUpContainerApp.xml Failed Timed out 0 Thu Mar 19 16:52:21 ACT 2015 0.0
[java] removing the xml app file
[java] Grab log, do parse = false
[java] Grabbing the log from: C:\Users\ApacheFlex\AppData/Roaming\Macromedia/Flash Player/Logs/flashlog.txt to: C:\jenkins_slave\workspace\rc_flex-sdk_mustella-mobile\mustella\tests\mobile\SkinnablePopUpContainer\swfs\SkinnablePopUpContainerApp.log
[java] Grablog: never saw the ScriptDone for C:\jenkins_slave\workspace\rc_flex-sdk_mustella-mobile\mustella\tests\mobile\SkinnablePopUpContainer\swfs\SkinnablePopUpContainerApp.swf
[java] apollo adj with : C:\jenkins_slave\workspace\rc_flex-sdk_mustella-mobile\mustella\tests\mobile\ViewAndViewNavigator\swfs\ViewAndViewNavigatorMainTabbed.swf
[java] apollo adj thinks it's a swf
[java] writing Apollo file!
[java] full swf is C:\jenkins_slave\workspace\rc_flex-sdk_mustella-mobile\mustella\tests\mobile\ViewAndViewNavigator\swfs\ViewAndViewNavigatorMainTabbed.swf
[java] Total Results so far: 1
[java] post ApolloAdjuster: C:\jenkins_slave\workspace\rc_flex-sdk_mustella-mobile\mustella\tests\mobile\ViewAndViewNavigator\swfs\ViewAndViewNavigatorMainTabbed.xml
[java] new test file: C:\jenkins_slave\workspace\rc_flex-sdk_mustella-mobile\mustella\tests\mobile\ViewAndViewNavigator\swfs\ViewAndViewNavigatorMainTabbed.xml
[java] ******** cmdArr before:
[java] C:\ApacheFlex\dependencies\AdobeAIRSDK\16\bin\adl.exe
[java] C:\jenkins_slave\workspace\rc_flex-sdk_mustella-mobile\mustella\tests\mobile\ViewAndViewNavigator\swfs\ViewAndViewNavigatorMainTabbed.xml
[java] ******** moreParameters before:
[java] -screensize
[java] 640x960:640x960
[java] -profile
[java] mobileDevice
[java] -XscreenDPI
[java] 240
[java] ******** cmdArr after:
[java] C:\ApacheFlex\dependencies\AdobeAIRSDK\16\bin\adl.exe
[java] C:\jenkins_slave\workspace\rc_flex-sdk_mustella-mobile\mustella\tests\mobile\ViewAndViewNavigator\swfs\ViewAndViewNavigatorMainTabbed.xml
[java] -screensize
[java] 640x960:640x960
[java] -profile
[java] mobileDevice
[java] -XscreenDPI
[java] 240
[java] getting directory from the swf file
[java] derived directory: C:\jenkins_slave\workspace\rc_flex-sdk_mustella-mobile\mustella\tests\mobile\ViewAndViewNavigator\swfs
[java] Launching:
[java] C:\ApacheFlex\dependencies\AdobeAIRSDK\16\bin\adl.exe C:\jenkins_slave\workspace\rc_flex-sdk_mustella-mobile\mustella\tests\mobile\ViewAndViewNavigator\swfs\ViewAndViewNavigatorMainTabbed.xml -screensize 640x960:640x960 -profile mobileDevice -XscreenDPI 240 Launching: C:\ApacheFlex\dependencies\AdobeAIRSDK\16\bin\adl.exe C:\jenkins_slave\workspace\rc_flex-sdk_mustella-mobile\mustella\tests\mobile\ViewAndViewNavigator\swfs\ViewAndViewNavigatorMainTabbed.xml
[java] USING directory: C:\jenkins_slave\workspace\rc_flex-sdk_mustella-mobile\mustella\tests\mobile\ViewAndViewNavigator\swfs
[java] time: 16:52:33.337
[java] SCRIPTDONE! 16:52:39.731
[java] GET /ScriptComplete?0 HTTP/1.1
[java] Before Wait loop 16:52:39.731 waiting = 0
[java] After Wait loop 16:52:39.731 waiting = 0
[java] clobberProcess false
[java] Total Results so far: 3
[java] removing the xml app file
[java] Grab log, do parse = false
[java] Grabbing the log from: C:\Users\ApacheFlex\AppData/Roaming\Macromedia/Flash Player/Logs/flashlog.txt to: C:\jenkins_slave\workspace\rc_flex-sdk_mustella-mobile\mustella\tests\mobile\ViewAndViewNavigator\swfs\ViewAndViewNavigatorMainTabbed.log
[java] apollo adj with : C:\jenkins_slave\workspace\rc_flex-sdk_mustella-mobile\mustella\tests\mobile\components\ActionBar\swfs\ActionBar.swf
[java] apollo adj thinks it's a swf
[java] writing Apollo file!
[java] full swf is C:\jenkins_slave\workspace\rc_flex-sdk_mustella-mobile\mustella\tests\mobile\components\ActionBar\swfs\ActionBar.swf
[java] post ApolloAdjuster: C:\jenkins_slave\workspace\rc_flex-sdk_mustella-mobile\mustella\tests\mobile\components\ActionBar\swfs\ActionBar.xml
[java] new test file: C:\jenkins_slave\workspace\rc_flex-sdk_mustella-mobile\mustella\tests\mobile\components\ActionBar\swfs\ActionBar.xml
[java] ******** cmdArr before:
[java] C:\ApacheFlex\dependencies\AdobeAIRSDK\16\bin\adl.exe
[java] C:\jenkins_slave\workspace\rc_flex-sdk_mustella-mobile\mustella\tests\mobile\components\ActionBar\swfs\ActionBar.xml
[java] ******** moreParameters before:
[java] -screensize
[java] 640x960:640x960
[java] -profile
[java] mobileDevice
[java] -XscreenDPI
[java] 240
[java] ******** cmdArr after:
[java] C:\ApacheFlex\dependencies\AdobeAIRSDK\16\bin\adl.exe
[java] C:\jenkins_slave\workspace\rc_flex-sdk_mustella-mobile\mustella\tests\mobile\components\ActionBar\swfs\ActionBar.xml
[java] -screensize
[java] 640x960:640x960
[java] -profile
[java] mobileDevice
[java] -XscreenDPI
[java] 240
[java] getting directory from the swf file
[java] derived directory: C:\jenkins_slave\workspace\rc_flex-sdk_mustella-mobile\mustella\tests\mobile\components\ActionBar\swfs
[java] Launching:
[java] C:\ApacheFlex\dependencies\AdobeAIRSDK\16\bin\adl.exe C:\jenkins_slave\workspace\rc_flex-sdk_mustella-mobile\mustella\tests\mobile\components\ActionBar\swfs\ActionBar.xml -screensize 640x960:640x960 -profile mobileDevice -XscreenDPI 240 Launching: C:\ApacheFlex\dependencies\AdobeAIRSDK\16\bin\adl.exe C:\jenkins_slave\workspace\rc_flex-sdk_mustella-mobile\mustella\tests\mobile\components\ActionBar\swfs\ActionBar.xml
[java] USING directory: C:\jenkins_slave\workspace\rc_flex-sdk_mustella-mobile\mustella\tests\mobile\components\ActionBar\swfs
[java] time: 16:52:41.735
[java] waited 1700
[java] ClobberProcess, it was already null
[java] Wrote file: c:/jenkins_slave/workspace/rc_flex-sdk_mustella-mobile/mustella/tests/mobile/components/ActionBar/styles/baselines/ActionBar_TitleDisplay_TextDecoration@android_240ppi.png.bad.png.xml length: 41892
[java] Wrote file: c:/jenkins_slave/workspace/rc_flex-sdk_mustella-mobile/mustella/tests/mobile/components/ActionBar/styles/baselines/ActionBar_TitleDisplay_TextDecoration@android_240ppi.png.bad.png length: 2375
[java] FAIL: mobile/components/ActionBar/styles/ActionBar_Styles ActionBar_TitleDisplay_TextDecoration
[java] SCRIPTDONE! 16:52:48.913
[java] GET /ScriptComplete?0 HTTP/1.1
[java] Before Wait loop 16:52:48.913 waiting = 0
[java] After Wait loop 16:52:48.913 waiting = 0
[java] clobberProcess false
[java] Total Results so far: 4
[java] removing the xml app file
[java] Grab log, do parse = false
[java] Grabbing the log from: C:\Users\ApacheFlex\AppData/Roaming\Macromedia/Flash Player/Logs/flashlog.txt to: C:\jenkins_slave\workspace\rc_flex-sdk_mustella-mobile\mustella\tests\mobile\components\ActionBar\swfs\ActionBar.log
[java] apollo adj with : C:\jenkins_slave\workspace\rc_flex-sdk_mustella-mobile\mustella\tests\mobile\components\ActionBar\swfs\ActionBarTest.swf
[java] apollo adj thinks it's a swf
[java] writing Apollo file!
[java] full swf is C:\jenkins_slave\workspace\rc_flex-sdk_mustella-mobile\mustella\tests\mobile\components\ActionBar\swfs\ActionBarTest.swf
[java] post ApolloAdjuster: C:\jenkins_slave\workspace\rc_flex-sdk_mustella-mobile\mustella\tests\mobile\components\ActionBar\swfs\ActionBarTest.xml
[java] new test file: C:\jenkins_slave\workspace\rc_flex-sdk_mustella-mobile\mustella\tests\mobile\components\ActionBar\swfs\ActionBarTest.xml
[java] ******** cmdArr before:
[java] C:\ApacheFlex\dependencies\AdobeAIRSDK\16\bin\adl.exe
[java] C:\jenkins_slave\workspace\rc_flex-sdk_mustella-mobile\mustella\tests\mobile\components\ActionBar\swfs\ActionBarTest.xml
[java] ******** moreParameters before:
[java] -screensize
[java] 640x960:640x960
[java] -profile
[java] mobileDevice
[java] -XscreenDPI
[java] 240
[java] ******** cmdArr after:
[java] C:\ApacheFlex\dependencies\AdobeAIRSDK\16\bin\adl.exe
[java] C:\jenkins_slave\workspace\rc_flex-sdk_mustella-mobile\mustella\tests\mobile\components\ActionBar\swfs\ActionBarTest.xml
[java] -screensize
[java] 640x960:640x960
[java] -profile
[java] mobileDevice
[java] -XscreenDPI
[java] 240
[java] getting directory from the swf file
[java] derived directory: C:\jenkins_slave\workspace\rc_flex-sdk_mustella-mobile\mustella\tests\mobile\components\ActionBar\swfs
[java] Launching:
[java] C:\ApacheFlex\dependencies\AdobeAIRSDK\16\bin\adl.exe C:\jenkins_slave\workspace\rc_flex-sdk_mustella-mobile\mustella\tests\mobile\components\ActionBar\swfs\ActionBarTest.xml -screensize 640x960:640x960 -profile mobileDevice -XscreenDPI 240 Launching: C:\ApacheFlex\dependencies\AdobeAIRSDK\16\bin\adl.exe C:\jenkins_slave\workspace\rc_flex-sdk_mustella-mobile\mustella\tests\mobile\components\ActionBar\swfs\ActionBarTest.xml
[java] USING directory: C:\jenkins_slave\workspace\rc_flex-sdk_mustella-mobile\mustella\tests\mobile\components\ActionBar\swfs
[java] time: 16:52:50.816
[java] waited 1600
[java] ClobberProcess, it was already null
[java] SCRIPTDONE! 16:52:58.160
[java] GET /ScriptComplete?0 HTTP/1.1
[java] Before Wait loop 16:52:58.160 waiting = 0
[java] After Wait loop 16:52:58.160 waiting = 0
[java] clobberProcess false
[java] Total Results so far: 7
[java] removing the xml app file
[java] Grab log, do parse = false
[java] Grabbing the log from: C:\Users\ApacheFlex\AppData/Roaming\Macromedia/Flash Player/Logs/flashlog.txt to: C:\jenkins_slave\workspace\rc_flex-sdk_mustella-mobile\mustella\tests\mobile\components\ActionBar\swfs\ActionBarTest.log
[java] at the end of main
[java] Shutting down the results server
[java] shutting down the baseline server
[java] done waiting for results...bye
[java] =====================================================
[java] Passes: 5
[java] Fails: 2
[java] =====================================================
[java]
[java] =====================================================
[java] =====================================================
[java] Passed:
[java] =====================================================
[java] mobile/ViewAndViewNavigator/tests/ViewAndViewNavigator_orientationTabbed orientationStatesUnDefinedActionBarOverlayLeftTabbed Passed
[java] mobile/ViewAndViewNavigator/tests/ViewAndViewNavigator_orientationTabbed orientationStatesUnDefinedActionBarOverlayRightTabbed Passed
[java] mobile/components/ActionBar/properties/ActionBar_ViewNavigator_Properties ActionBar_ViewNavigator_titleLayout_vertical Passed
[java] mobile/components/ActionBar/properties/ActionBar_ViewNavigator_Properties ActionBar_ViewNavigator_titleLayout_tile Passed
[java] mobile/components/ActionBar/properties/ActionBar_ViewNavigator_Properties ActionBar_ViewNavigator_titleLayout_basic Passed
[java] =====================================================
[java] Failed:
[java] =====================================================
[java] C:\jenkins_slave\workspace\rc_flex-sdk_mustella-mobile\mustella\tests\mobile\SkinnablePopUpContainer\swfs\SkinnablePopUpContainerApp.xml Failed Timed out
[java] mobile/components/ActionBar/styles/ActionBar_Styles ActionBar_TitleDisplay_TextDecoration Failed CompareBitmap(body:step 2) compare returned[object BitmapData]
[java]
[java]
[java] =====================================================
[java] Passes: 5
[java] Fails: 2
[java] =====================================================
[java]
[java]
[java] Wrote summary to results.txt
[java] Wrote failures to failures.txt
BUILD FAILED
C:\jenkins_slave\workspace\rc_flex-sdk_mustella-mobile\mustella\build.xml:1547: The following error occurred while executing this line:
C:\jenkins_slave\workspace\rc_flex-sdk_mustella-mobile\mustella\build.xml:1665: Java returned: 1
Total time: 2 minutes 52 seconds
============ JENKINS MUSTELLA RUN REPORT ============
Date/Time: 03-19-2015 21:53
Run duration: 0 days 1 hours 45 mins 48 seconds
Settings:
player.version = 16.0
air.version = 16
FLASHPLAYER_DEBUGGER = C:\ApacheFlex\dependencies\FlashPlayer_Debug\flashplayer_16_sa_debug.exe
AIR_HOME = C:\ApacheFlex\dependencies\AdobeAIRSDK\16
Build:
type = mobile
command = -mobile
set = tests/mobile
Log:
- Made Cygwin ignore carriage returns
- Set FLASH_VERSION to '16.0' and AIR_VERSION to '16'
- Set AIR_HOME to 'C:\ApacheFlex\dependencies\AdobeAIRSDK\16'
- Set FLASHPLAYER_DEBUGGER to 'C:\ApacheFlex\dependencies\FlashPlayer_Debug\flashplayer_16_sa_debug.exe'
- Cleaned up 'local.properties' files from previous runs
- Created fresh 'local.properties' files with containing run specific values
- Ran 'clean', 'main' and 'other.locales' ant targets to prepare the SDK for testing
- Ran Mustella on the SDK with these parameters: '-mobile tests/mobile'
- Some tests failed: running '-failures'
- Some of tests failed, even after running '-failures'...
=====================================================
Build step 'Execute shell' marked build as failure
Archiving artifacts
Email was triggered for: Failure - Any
Sending email for trigger: Failure - Any
(sent from ext-email)
rc_flex-sdk_mustella-mobile - Build # 162 - Fixed!
Posted by fl...@gmail.com.
rc_flex-sdk_mustella-mobile - Build # 162 - Fixed:
http://flex-mustella.cloudapp.net/job/rc_flex-sdk_mustella-mobile/162/
Changes for Build #159
No changes
Changes for Build #160
[jmclean] Added support for FP/AIR 17 and 17 beta
[jmclean] set version in config file to 17.0 not 17.0b as some IDEs may check this
[jmclean] added support for FP 17
[jmclean] added support for FP 17
[jmclean] update with missing contributors
[jmclean] add a few more missing people
[jmclean] add missing bug to release notes
[jmclean] Remove @author tags
Changes for Build #161
[erik] FLEX-34778 Adding a unit test which verifies that replacements in the HierarchicalCollectionView work as expected in various circumstances, so that a fix for this bug can be made knowing that we're not breaking something else.
[erik] FLEX-34778
[erik] FLEX-34778 running the unit tests as part of 'ant test' now, which implied moving them to frameworks/projects/advancedgrids/tests and changing the build scripts to allow test execution in the advancedgrids project.
[erik] FLEX-34119 moving the unit test to where it can be executed part of 'ant test'
[erik] FLEX-34119 renamed the test to the format expected by the ant test script.
[erik] FLEX-34119 our test runner seems to be an Application, rather than WindowedApplication. Now the unit test reflects that.
[erik] FLEX-34778 moved the test to where it can be executed via 'ant test'
[erik] FLEX-43119 moved the unit test where it can be run by 'ant test'. Also, the main test runner is an Application, rather than WindowedApplication, so I changed how uncaught client errors are captured.
[erik] FLEX-34424 moved the unit test where it can be run by 'ant test'. Also, the main test runner is an Application, rather than a WindowedApplication, so I changed how uncaught client errors are captured to reflect this.
[erik] FLEX-34440 moved the unit test where it can be run by 'ant test'. Also, the main test runner is an Application, rather than a WindowedApplication, so I changed how uncaught client errors are captured to reflect this.
[erik] FLEX-34456 moved the unit test where it can be run by 'ant test'. Also, the main test runner is an Application, rather than a WindowedApplication, so I changed how uncaught client errors are captured to reflect this.
[erik] FLEX-34458 moved the unit test where it can be run by 'ant test'. Also, the main test runner is an Application, rather than a WindowedApplication, so I changed how uncaught client errors are captured to reflect this.
[erik] FLEX-34775 moved the unit test where it can be run by 'ant test'.
[erik] FLEX-34119 Running the over 10,000 parameterized tests in the ant test runner takes over an hour! (On my computer it only takes a bit above three minutes.) I'm ignoring this for now.
[erik] FLEX-34119 this unit test is blocking FlexUnit, so I'm moving it back (temporarily) to prevent it from being executed in the flex-sdk_test job until we find a solution for the stack overflow.
[erik] Updated with FP 17 mention and corrected whitespace (for consistency)
Changes for Build #162
No changes
--------------------------------
[...truncated 8066 lines...]
[java] ******** cmdArr before:
[java] C:\ApacheFlex\dependencies\AdobeAIRSDK\4.0\bin\adl.exe
[java] C:\jenkins_slave\workspace\rc_flex-sdk_mustella-mobile\mustella\tests\mobile\transitions\ViewTransition\swfs\TabbedViewTransition.xml
[java] ******** moreParameters before:
[java] -screensize
[java] 640x960:640x960
[java] -profile
[java] mobileDevice
[java] -XscreenDPI
[java] 240
[java] ******** cmdArr after:
[java] C:\ApacheFlex\dependencies\AdobeAIRSDK\4.0\bin\adl.exe
[java] C:\jenkins_slave\workspace\rc_flex-sdk_mustella-mobile\mustella\tests\mobile\transitions\ViewTransition\swfs\TabbedViewTransition.xml
[java] -screensize
[java] 640x960:640x960
[java] -profile
[java] mobileDevice
[java] -XscreenDPI
[java] 240
[java] getting directory from the swf file
[java] derived directory: C:\jenkins_slave\workspace\rc_flex-sdk_mustella-mobile\mustella\tests\mobile\transitions\ViewTransition\swfs
[java] Launching:
[java] C:\ApacheFlex\dependencies\AdobeAIRSDK\4.0\bin\adl.exe C:\jenkins_slave\workspace\rc_flex-sdk_mustella-mobile\mustella\tests\mobile\transitions\ViewTransition\swfs\TabbedViewTransition.xml -screensize 640x960:640x960 -profile mobileDevice -XscreenDPI 240 Launching: C:\ApacheFlex\dependencies\AdobeAIRSDK\4.0\bin\adl.exe C:\jenkins_slave\workspace\rc_flex-sdk_mustella-mobile\mustella\tests\mobile\transitions\ViewTransition\swfs\TabbedViewTransition.xml
[java] USING directory: C:\jenkins_slave\workspace\rc_flex-sdk_mustella-mobile\mustella\tests\mobile\transitions\ViewTransition\swfs
[java] time: 05:00:32.449
[java] Total Results so far: 0
[java] removing the xml app file
[java] Grab log, do parse = false
[java] Grabbing the log from: C:\Users\ApacheFlex\AppData/Roaming\Macromedia/Flash Player/Logs/flashlog.txt to: C:\jenkins_slave\workspace\rc_flex-sdk_mustella-mobile\mustella\tests\mobile\transitions\ViewTransition\swfs\TabbedViewTransition.log
[java] Grablog: never saw the ScriptDone for C:\jenkins_slave\workspace\rc_flex-sdk_mustella-mobile\mustella\tests\mobile\transitions\ViewTransition\swfs\TabbedViewTransition.swf
[java] apollo adj with : C:\jenkins_slave\workspace\rc_flex-sdk_mustella-mobile\mustella\tests\mobile\transitions\ViewTransition\swfs\ViewTransition.swf
[java] apollo adj thinks it's a swf
[java] writing Apollo file!
[java] full swf is C:\jenkins_slave\workspace\rc_flex-sdk_mustella-mobile\mustella\tests\mobile\transitions\ViewTransition\swfs\ViewTransition.swf
[java] post ApolloAdjuster: C:\jenkins_slave\workspace\rc_flex-sdk_mustella-mobile\mustella\tests\mobile\transitions\ViewTransition\swfs\ViewTransition.xml
[java] new test file: C:\jenkins_slave\workspace\rc_flex-sdk_mustella-mobile\mustella\tests\mobile\transitions\ViewTransition\swfs\ViewTransition.xml
[java] ******** cmdArr before:
[java] C:\ApacheFlex\dependencies\AdobeAIRSDK\4.0\bin\adl.exe
[java] C:\jenkins_slave\workspace\rc_flex-sdk_mustella-mobile\mustella\tests\mobile\transitions\ViewTransition\swfs\ViewTransition.xml
[java] ******** moreParameters before:
[java] -screensize
[java] 640x960:640x960
[java] -profile
[java] mobileDevice
[java] -XscreenDPI
[java] 240
[java] ******** cmdArr after:
[java] C:\ApacheFlex\dependencies\AdobeAIRSDK\4.0\bin\adl.exe
[java] C:\jenkins_slave\workspace\rc_flex-sdk_mustella-mobile\mustella\tests\mobile\transitions\ViewTransition\swfs\ViewTransition.xml
[java] -screensize
[java] 640x960:640x960
[java] -profile
[java] mobileDevice
[java] -XscreenDPI
[java] 240
[java] getting directory from the swf file
[java] derived directory: C:\jenkins_slave\workspace\rc_flex-sdk_mustella-mobile\mustella\tests\mobile\transitions\ViewTransition\swfs
[java] Launching:
[java] C:\ApacheFlex\dependencies\AdobeAIRSDK\4.0\bin\adl.exe C:\jenkins_slave\workspace\rc_flex-sdk_mustella-mobile\mustella\tests\mobile\transitions\ViewTransition\swfs\ViewTransition.xml -screensize 640x960:640x960 -profile mobileDevice -XscreenDPI 240 Launching: C:\ApacheFlex\dependencies\AdobeAIRSDK\4.0\bin\adl.exe C:\jenkins_slave\workspace\rc_flex-sdk_mustella-mobile\mustella\tests\mobile\transitions\ViewTransition\swfs\ViewTransition.xml
[java] USING directory: C:\jenkins_slave\workspace\rc_flex-sdk_mustella-mobile\mustella\tests\mobile\transitions\ViewTransition\swfs
[java] time: 05:00:32.880
[java] Total Results so far: 0
[java] removing the xml app file
[java] Grab log, do parse = false
[java] Grabbing the log from: C:\Users\ApacheFlex\AppData/Roaming\Macromedia/Flash Player/Logs/flashlog.txt to: C:\jenkins_slave\workspace\rc_flex-sdk_mustella-mobile\mustella\tests\mobile\transitions\ViewTransition\swfs\ViewTransition.log
[java] Grablog: never saw the ScriptDone for C:\jenkins_slave\workspace\rc_flex-sdk_mustella-mobile\mustella\tests\mobile\transitions\ViewTransition\swfs\ViewTransition.swf
[java] apollo adj with : C:\jenkins_slave\workspace\rc_flex-sdk_mustella-mobile\mustella\tests\mobile\utils\MultiDPIBitmapSource\swfs\MultiDPIBitmapSourceInteg.swf
[java] apollo adj thinks it's a swf
[java] writing Apollo file!
[java] full swf is C:\jenkins_slave\workspace\rc_flex-sdk_mustella-mobile\mustella\tests\mobile\utils\MultiDPIBitmapSource\swfs\MultiDPIBitmapSourceInteg.swf
[java] post ApolloAdjuster: C:\jenkins_slave\workspace\rc_flex-sdk_mustella-mobile\mustella\tests\mobile\utils\MultiDPIBitmapSource\swfs\MultiDPIBitmapSourceInteg.xml
[java] new test file: C:\jenkins_slave\workspace\rc_flex-sdk_mustella-mobile\mustella\tests\mobile\utils\MultiDPIBitmapSource\swfs\MultiDPIBitmapSourceInteg.xml
[java] ******** cmdArr before:
[java] C:\ApacheFlex\dependencies\AdobeAIRSDK\4.0\bin\adl.exe
[java] C:\jenkins_slave\workspace\rc_flex-sdk_mustella-mobile\mustella\tests\mobile\utils\MultiDPIBitmapSource\swfs\MultiDPIBitmapSourceInteg.xml
[java] ******** moreParameters before:
[java] -screensize
[java] 640x960:640x960
[java] -profile
[java] mobileDevice
[java] -XscreenDPI
[java] 240
[java] ******** cmdArr after:
[java] C:\ApacheFlex\dependencies\AdobeAIRSDK\4.0\bin\adl.exe
[java] C:\jenkins_slave\workspace\rc_flex-sdk_mustella-mobile\mustella\tests\mobile\utils\MultiDPIBitmapSource\swfs\MultiDPIBitmapSourceInteg.xml
[java] -screensize
[java] 640x960:640x960
[java] -profile
[java] mobileDevice
[java] -XscreenDPI
[java] 240
[java] getting directory from the swf file
[java] derived directory: C:\jenkins_slave\workspace\rc_flex-sdk_mustella-mobile\mustella\tests\mobile\utils\MultiDPIBitmapSource\swfs
[java] Launching:
[java] C:\ApacheFlex\dependencies\AdobeAIRSDK\4.0\bin\adl.exe C:\jenkins_slave\workspace\rc_flex-sdk_mustella-mobile\mustella\tests\mobile\utils\MultiDPIBitmapSource\swfs\MultiDPIBitmapSourceInteg.xml -screensize 640x960:640x960 -profile mobileDevice -XscreenDPI 240 Launching: C:\ApacheFlex\dependencies\AdobeAIRSDK\4.0\bin\adl.exe C:\jenkins_slave\workspace\rc_flex-sdk_mustella-mobile\mustella\tests\mobile\utils\MultiDPIBitmapSource\swfs\MultiDPIBitmapSourceInteg.xml
[java] USING directory: C:\jenkins_slave\workspace\rc_flex-sdk_mustella-mobile\mustella\tests\mobile\utils\MultiDPIBitmapSource\swfs
[java] time: 05:00:33.347
[java] Total Results so far: 0
[java] removing the xml app file
[java] Grab log, do parse = false
[java] Grabbing the log from: C:\Users\ApacheFlex\AppData/Roaming\Macromedia/Flash Player/Logs/flashlog.txt to: C:\jenkins_slave\workspace\rc_flex-sdk_mustella-mobile\mustella\tests\mobile\utils\MultiDPIBitmapSource\swfs\MultiDPIBitmapSourceInteg.log
[java] Grablog: never saw the ScriptDone for C:\jenkins_slave\workspace\rc_flex-sdk_mustella-mobile\mustella\tests\mobile\utils\MultiDPIBitmapSource\swfs\MultiDPIBitmapSourceInteg.swf
[java] apollo adj with : C:\jenkins_slave\workspace\rc_flex-sdk_mustella-mobile\mustella\tests\mobile\utils\MultiDPIBitmapSource\swfs\MultiDPIBitmapSourceMain.swf
[java] apollo adj thinks it's a swf
[java] writing Apollo file!
[java] full swf is C:\jenkins_slave\workspace\rc_flex-sdk_mustella-mobile\mustella\tests\mobile\utils\MultiDPIBitmapSource\swfs\MultiDPIBitmapSourceMain.swf
[java] post ApolloAdjuster: C:\jenkins_slave\workspace\rc_flex-sdk_mustella-mobile\mustella\tests\mobile\utils\MultiDPIBitmapSource\swfs\MultiDPIBitmapSourceMain.xml
[java] new test file: C:\jenkins_slave\workspace\rc_flex-sdk_mustella-mobile\mustella\tests\mobile\utils\MultiDPIBitmapSource\swfs\MultiDPIBitmapSourceMain.xml
[java] ******** cmdArr before:
[java] C:\ApacheFlex\dependencies\AdobeAIRSDK\4.0\bin\adl.exe
[java] C:\jenkins_slave\workspace\rc_flex-sdk_mustella-mobile\mustella\tests\mobile\utils\MultiDPIBitmapSource\swfs\MultiDPIBitmapSourceMain.xml
[java] ******** moreParameters before:
[java] -screensize
[java] 640x960:640x960
[java] -profile
[java] mobileDevice
[java] -XscreenDPI
[java] 240
[java] ******** cmdArr after:
[java] C:\ApacheFlex\dependencies\AdobeAIRSDK\4.0\bin\adl.exe
[java] C:\jenkins_slave\workspace\rc_flex-sdk_mustella-mobile\mustella\tests\mobile\utils\MultiDPIBitmapSource\swfs\MultiDPIBitmapSourceMain.xml
[java] -screensize
[java] 640x960:640x960
[java] -profile
[java] mobileDevice
[java] -XscreenDPI
[java] 240
[java] getting directory from the swf file
[java] derived directory: C:\jenkins_slave\workspace\rc_flex-sdk_mustella-mobile\mustella\tests\mobile\utils\MultiDPIBitmapSource\swfs
[java] Launching:
[java] C:\ApacheFlex\dependencies\AdobeAIRSDK\4.0\bin\adl.exe C:\jenkins_slave\workspace\rc_flex-sdk_mustella-mobile\mustella\tests\mobile\utils\MultiDPIBitmapSource\swfs\MultiDPIBitmapSourceMain.xml -screensize 640x960:640x960 -profile mobileDevice -XscreenDPI 240 Launching: C:\ApacheFlex\dependencies\AdobeAIRSDK\4.0\bin\adl.exe C:\jenkins_slave\workspace\rc_flex-sdk_mustella-mobile\mustella\tests\mobile\utils\MultiDPIBitmapSource\swfs\MultiDPIBitmapSourceMain.xml
[java] USING directory: C:\jenkins_slave\workspace\rc_flex-sdk_mustella-mobile\mustella\tests\mobile\utils\MultiDPIBitmapSource\swfs
[java] time: 05:00:33.773
[java] Total Results so far: 0
[java] removing the xml app file
[java] Grab log, do parse = false
[java] Grabbing the log from: C:\Users\ApacheFlex\AppData/Roaming\Macromedia/Flash Player/Logs/flashlog.txt to: C:\jenkins_slave\workspace\rc_flex-sdk_mustella-mobile\mustella\tests\mobile\utils\MultiDPIBitmapSource\swfs\MultiDPIBitmapSourceMain.log
[java] Grablog: never saw the ScriptDone for C:\jenkins_slave\workspace\rc_flex-sdk_mustella-mobile\mustella\tests\mobile\utils\MultiDPIBitmapSource\swfs\MultiDPIBitmapSourceMain.swf
[java] apollo adj with : C:\jenkins_slave\workspace\rc_flex-sdk_mustella-mobile\mustella\tests\mobile\utils\MultiDPIBitmapSource\swfs\MultiDPIBitmapSourceScaling.swf
[java] apollo adj thinks it's a swf
[java] writing Apollo file!
[java] full swf is C:\jenkins_slave\workspace\rc_flex-sdk_mustella-mobile\mustella\tests\mobile\utils\MultiDPIBitmapSource\swfs\MultiDPIBitmapSourceScaling.swf
[java] post ApolloAdjuster: C:\jenkins_slave\workspace\rc_flex-sdk_mustella-mobile\mustella\tests\mobile\utils\MultiDPIBitmapSource\swfs\MultiDPIBitmapSourceScaling.xml
[java] new test file: C:\jenkins_slave\workspace\rc_flex-sdk_mustella-mobile\mustella\tests\mobile\utils\MultiDPIBitmapSource\swfs\MultiDPIBitmapSourceScaling.xml
[java] ******** cmdArr before:
[java] C:\ApacheFlex\dependencies\AdobeAIRSDK\4.0\bin\adl.exe
[java] C:\jenkins_slave\workspace\rc_flex-sdk_mustella-mobile\mustella\tests\mobile\utils\MultiDPIBitmapSource\swfs\MultiDPIBitmapSourceScaling.xml
[java] ******** moreParameters before:
[java] -screensize
[java] 640x960:640x960
[java] -profile
[java] mobileDevice
[java] -XscreenDPI
[java] 240
[java] ******** cmdArr after:
[java] C:\ApacheFlex\dependencies\AdobeAIRSDK\4.0\bin\adl.exe
[java] C:\jenkins_slave\workspace\rc_flex-sdk_mustella-mobile\mustella\tests\mobile\utils\MultiDPIBitmapSource\swfs\MultiDPIBitmapSourceScaling.xml
[java] -screensize
[java] 640x960:640x960
[java] -profile
[java] mobileDevice
[java] -XscreenDPI
[java] 240
[java] getting directory from the swf file
[java] derived directory: C:\jenkins_slave\workspace\rc_flex-sdk_mustella-mobile\mustella\tests\mobile\utils\MultiDPIBitmapSource\swfs
[java] Launching:
[java] C:\ApacheFlex\dependencies\AdobeAIRSDK\4.0\bin\adl.exe C:\jenkins_slave\workspace\rc_flex-sdk_mustella-mobile\mustella\tests\mobile\utils\MultiDPIBitmapSource\swfs\MultiDPIBitmapSourceScaling.xml -screensize 640x960:640x960 -profile mobileDevice -XscreenDPI 240 Launching: C:\ApacheFlex\dependencies\AdobeAIRSDK\4.0\bin\adl.exe C:\jenkins_slave\workspace\rc_flex-sdk_mustella-mobile\mustella\tests\mobile\utils\MultiDPIBitmapSource\swfs\MultiDPIBitmapSourceScaling.xml
[java] USING directory: C:\jenkins_slave\workspace\rc_flex-sdk_mustella-mobile\mustella\tests\mobile\utils\MultiDPIBitmapSource\swfs
[java] time: 05:00:34.359
[java] Total Results so far: 0
[java] removing the xml app file
[java] Grab log, do parse = false
[java] Grabbing the log from: C:\Users\ApacheFlex\AppData/Roaming\Macromedia/Flash Player/Logs/flashlog.txt to: C:\jenkins_slave\workspace\rc_flex-sdk_mustella-mobile\mustella\tests\mobile\utils\MultiDPIBitmapSource\swfs\MultiDPIBitmapSourceScaling.log
[java] Grablog: never saw the ScriptDone for C:\jenkins_slave\workspace\rc_flex-sdk_mustella-mobile\mustella\tests\mobile\utils\MultiDPIBitmapSource\swfs\MultiDPIBitmapSourceScaling.swf
[java] at the end of main
[java] Shutting down the results server
[java] shutting down the baseline server
[java] done waiting for results...bye
[java] =====================================================
[java] Passes: 0
[java] Fails: 0
[java] =====================================================
[java]
[java] =====================================================
[java] =====================================================
[java] Passed:
[java] =====================================================
[java] =====================================================
[java] Failed:
[java] =====================================================
[java]
[java]
[java] =====================================================
[java] Passes: 0
[java] Fails: 0
[java] =====================================================
[java]
[java]
[java] Wrote summary to results.txt
[java] Wrote failures to failures.txt
call_runners:
run:
BUILD SUCCESSFUL
Total time: 16 minutes 28 seconds
============ JENKINS MUSTELLA RUN REPORT ============
Date/Time: 03-21-2015 10:00
Run duration: 0 days 0 hours 44 mins 21 seconds
Settings:
player.version = 13.0
air.version = 4.0
FLASHPLAYER_DEBUGGER = C:\ApacheFlex\dependencies\FlashPlayer_Debug\flashplayer13_0r0_214_win_sa_debug.exe
AIR_HOME = C:\ApacheFlex\dependencies\AdobeAIRSDK\4.0
Build:
type = mobile
command = -mobile
set = tests/mobile
Log:
- Made Cygwin ignore carriage returns
- Set FLASH_VERSION to '13.0' and AIR_VERSION to '4.0'
- Set AIR_HOME to 'C:\ApacheFlex\dependencies\AdobeAIRSDK\4.0'
- Set FLASHPLAYER_DEBUGGER to 'C:\ApacheFlex\dependencies\FlashPlayer_Debug\flashplayer13_0r0_214_win_sa_debug.exe'
- Cleaned up 'local.properties' files from previous runs
- Created fresh 'local.properties' files with containing run specific values
- Ran 'clean', 'main' and 'other.locales' ant targets to prepare the SDK for testing
- Ran Mustella on the SDK with these parameters: '-mobile tests/mobile'
- All tests passed on the first run
=====================================================
Archiving artifacts
WARN: No artifacts found that match the file pattern "mustella/tests/**/*.bad.png*". Configuration error?
WARN: java.lang.InterruptedException: no matches found within 10000
Email was triggered for: Fixed
Trigger Success was overridden by another trigger and will not send an email.
Sending email for trigger: Fixed
(sent from ext-email)
rc_flex-sdk_mustella-mobile - Build # 161 - Still Failing!
Posted by fl...@gmail.com.
rc_flex-sdk_mustella-mobile - Build # 161 - Still Failing:
http://flex-mustella.cloudapp.net/job/rc_flex-sdk_mustella-mobile/161/
Changes for Build #159
No changes
Changes for Build #160
[jmclean] Added support for FP/AIR 17 and 17 beta
[jmclean] set version in config file to 17.0 not 17.0b as some IDEs may check this
[jmclean] added support for FP 17
[jmclean] added support for FP 17
[jmclean] update with missing contributors
[jmclean] add a few more missing people
[jmclean] add missing bug to release notes
[jmclean] Remove @author tags
Changes for Build #161
[erik] FLEX-34778 Adding a unit test which verifies that replacements in the HierarchicalCollectionView work as expected in various circumstances, so that a fix for this bug can be made knowing that we're not breaking something else.
[erik] FLEX-34778
[erik] FLEX-34778 running the unit tests as part of 'ant test' now, which implied moving them to frameworks/projects/advancedgrids/tests and changing the build scripts to allow test execution in the advancedgrids project.
[erik] FLEX-34119 moving the unit test to where it can be executed part of 'ant test'
[erik] FLEX-34119 renamed the test to the format expected by the ant test script.
[erik] FLEX-34119 our test runner seems to be an Application, rather than WindowedApplication. Now the unit test reflects that.
[erik] FLEX-34778 moved the test to where it can be executed via 'ant test'
[erik] FLEX-43119 moved the unit test where it can be run by 'ant test'. Also, the main test runner is an Application, rather than WindowedApplication, so I changed how uncaught client errors are captured.
[erik] FLEX-34424 moved the unit test where it can be run by 'ant test'. Also, the main test runner is an Application, rather than a WindowedApplication, so I changed how uncaught client errors are captured to reflect this.
[erik] FLEX-34440 moved the unit test where it can be run by 'ant test'. Also, the main test runner is an Application, rather than a WindowedApplication, so I changed how uncaught client errors are captured to reflect this.
[erik] FLEX-34456 moved the unit test where it can be run by 'ant test'. Also, the main test runner is an Application, rather than a WindowedApplication, so I changed how uncaught client errors are captured to reflect this.
[erik] FLEX-34458 moved the unit test where it can be run by 'ant test'. Also, the main test runner is an Application, rather than a WindowedApplication, so I changed how uncaught client errors are captured to reflect this.
[erik] FLEX-34775 moved the unit test where it can be run by 'ant test'.
[erik] FLEX-34119 Running the over 10,000 parameterized tests in the ant test runner takes over an hour! (On my computer it only takes a bit above three minutes.) I'm ignoring this for now.
[erik] FLEX-34119 this unit test is blocking FlexUnit, so I'm moving it back (temporarily) to prevent it from being executed in the flex-sdk_test job until we find a solution for the stack overflow.
[erik] Updated with FP 17 mention and corrected whitespace (for consistency)
--------------------------------
[...truncated 13065 lines...]
[java] apollo adj thinks it's a swf
[java] writing Apollo file!
[java] full swf is C:\jenkins_slave\workspace\rc_flex-sdk_mustella-mobile\mustella\tests\mobile\SkinnablePopUpContainer\swfs\SkinnablePopUpContainerApp.swf
[java] starting the baseline server: Fri Mar 20 17:37:14 ACT 2015
[java] post ApolloAdjuster: C:\jenkins_slave\workspace\rc_flex-sdk_mustella-mobile\mustella\tests\mobile\SkinnablePopUpContainer\swfs\SkinnablePopUpContainerApp.xml
[java] new test file: C:\jenkins_slave\workspace\rc_flex-sdk_mustella-mobile\mustella\tests\mobile\SkinnablePopUpContainer\swfs\SkinnablePopUpContainerApp.xml
[java] ******** cmdArr before:
[java] C:\ApacheFlex\dependencies\AdobeAIRSDK\3.7\bin\adl.exe
[java] C:\jenkins_slave\workspace\rc_flex-sdk_mustella-mobile\mustella\tests\mobile\SkinnablePopUpContainer\swfs\SkinnablePopUpContainerApp.xml
[java] ******** moreParameters before:
[java] -screensize
[java] 640x960:640x960
[java] -profile
[java] mobileDevice
[java] -XscreenDPI
[java] 240
[java] ******** cmdArr after:
[java] C:\ApacheFlex\dependencies\AdobeAIRSDK\3.7\bin\adl.exe
[java] C:\jenkins_slave\workspace\rc_flex-sdk_mustella-mobile\mustella\tests\mobile\SkinnablePopUpContainer\swfs\SkinnablePopUpContainerApp.xml
[java] -screensize
[java] 640x960:640x960
[java] -profile
[java] mobileDevice
[java] -XscreenDPI
[java] 240
[java] getting directory from the swf file
[java] derived directory: C:\jenkins_slave\workspace\rc_flex-sdk_mustella-mobile\mustella\tests\mobile\SkinnablePopUpContainer\swfs
[java] Launching:
[java] C:\ApacheFlex\dependencies\AdobeAIRSDK\3.7\bin\adl.exe C:\jenkins_slave\workspace\rc_flex-sdk_mustella-mobile\mustella\tests\mobile\SkinnablePopUpContainer\swfs\SkinnablePopUpContainerApp.xml -screensize 640x960:640x960 -profile mobileDevice -XscreenDPI 240 Launching: C:\ApacheFlex\dependencies\AdobeAIRSDK\3.7\bin\adl.exe C:\jenkins_slave\workspace\rc_flex-sdk_mustella-mobile\mustella\tests\mobile\SkinnablePopUpContainer\swfs\SkinnablePopUpContainerApp.xml
[java] USING directory: C:\jenkins_slave\workspace\rc_flex-sdk_mustella-mobile\mustella\tests\mobile\SkinnablePopUpContainer\swfs
[java] time: 17:37:15.671
[java] Firing Meta Timeout for process start after 12000 millis at: 17:37:27.720
[java] clobberProcess true
[java] ClobberProcess, destroying process
[java] unpacked result: C:\jenkins_slave\workspace\rc_flex-sdk_mustella-mobile\mustella\tests\mobile\SkinnablePopUpContainer\swfs\SkinnablePopUpContainerApp.xml Failed Timed out 0 Fri Mar 20 17:37:15 ACT 2015 0.0
[java] Total Results so far: 1
[java] removing the xml app file
[java] Grab log, do parse = false
[java] Grabbing the log from: C:\Users\ApacheFlex\AppData/Roaming\Macromedia/Flash Player/Logs/flashlog.txt to: C:\jenkins_slave\workspace\rc_flex-sdk_mustella-mobile\mustella\tests\mobile\SkinnablePopUpContainer\swfs\SkinnablePopUpContainerApp.log
[java] Grablog: never saw the ScriptDone for C:\jenkins_slave\workspace\rc_flex-sdk_mustella-mobile\mustella\tests\mobile\SkinnablePopUpContainer\swfs\SkinnablePopUpContainerApp.swf
[java] apollo adj with : C:\jenkins_slave\workspace\rc_flex-sdk_mustella-mobile\mustella\tests\mobile\ViewAndViewNavigator\swfs\ViewAndViewNavigatorMainTabbed.swf
[java] apollo adj thinks it's a swf
[java] writing Apollo file!
[java] full swf is C:\jenkins_slave\workspace\rc_flex-sdk_mustella-mobile\mustella\tests\mobile\ViewAndViewNavigator\swfs\ViewAndViewNavigatorMainTabbed.swf
[java] post ApolloAdjuster: C:\jenkins_slave\workspace\rc_flex-sdk_mustella-mobile\mustella\tests\mobile\ViewAndViewNavigator\swfs\ViewAndViewNavigatorMainTabbed.xml
[java] new test file: C:\jenkins_slave\workspace\rc_flex-sdk_mustella-mobile\mustella\tests\mobile\ViewAndViewNavigator\swfs\ViewAndViewNavigatorMainTabbed.xml
[java] ******** cmdArr before:
[java] C:\ApacheFlex\dependencies\AdobeAIRSDK\3.7\bin\adl.exe
[java] C:\jenkins_slave\workspace\rc_flex-sdk_mustella-mobile\mustella\tests\mobile\ViewAndViewNavigator\swfs\ViewAndViewNavigatorMainTabbed.xml
[java] ******** moreParameters before:
[java] -screensize
[java] 640x960:640x960
[java] -profile
[java] mobileDevice
[java] -XscreenDPI
[java] 240
[java] ******** cmdArr after:
[java] C:\ApacheFlex\dependencies\AdobeAIRSDK\3.7\bin\adl.exe
[java] C:\jenkins_slave\workspace\rc_flex-sdk_mustella-mobile\mustella\tests\mobile\ViewAndViewNavigator\swfs\ViewAndViewNavigatorMainTabbed.xml
[java] -screensize
[java] 640x960:640x960
[java] -profile
[java] mobileDevice
[java] -XscreenDPI
[java] 240
[java] getting directory from the swf file
[java] derived directory: C:\jenkins_slave\workspace\rc_flex-sdk_mustella-mobile\mustella\tests\mobile\ViewAndViewNavigator\swfs
[java] Launching:
[java] C:\ApacheFlex\dependencies\AdobeAIRSDK\3.7\bin\adl.exe C:\jenkins_slave\workspace\rc_flex-sdk_mustella-mobile\mustella\tests\mobile\ViewAndViewNavigator\swfs\ViewAndViewNavigatorMainTabbed.xml -screensize 640x960:640x960 -profile mobileDevice -XscreenDPI 240 Launching: C:\ApacheFlex\dependencies\AdobeAIRSDK\3.7\bin\adl.exe C:\jenkins_slave\workspace\rc_flex-sdk_mustella-mobile\mustella\tests\mobile\ViewAndViewNavigator\swfs\ViewAndViewNavigatorMainTabbed.xml
[java] USING directory: C:\jenkins_slave\workspace\rc_flex-sdk_mustella-mobile\mustella\tests\mobile\ViewAndViewNavigator\swfs
[java] time: 17:37:27.791
[java] SCRIPTDONE! 17:37:34.899
[java] GET /ScriptComplete?0 HTTP/1.1
[java] Before Wait loop 17:37:34.899 waiting = 0
[java] After Wait loop 17:37:34.899 waiting = 0
[java] clobberProcess false
[java] Total Results so far: 3
[java] removing the xml app file
[java] Grab log, do parse = false
[java] Grabbing the log from: C:\Users\ApacheFlex\AppData/Roaming\Macromedia/Flash Player/Logs/flashlog.txt to: C:\jenkins_slave\workspace\rc_flex-sdk_mustella-mobile\mustella\tests\mobile\ViewAndViewNavigator\swfs\ViewAndViewNavigatorMainTabbed.log
[java] apollo adj with : C:\jenkins_slave\workspace\rc_flex-sdk_mustella-mobile\mustella\tests\mobile\components\ActionBar\swfs\ActionBar.swf
[java] apollo adj thinks it's a swf
[java] writing Apollo file!
[java] full swf is C:\jenkins_slave\workspace\rc_flex-sdk_mustella-mobile\mustella\tests\mobile\components\ActionBar\swfs\ActionBar.swf
[java] post ApolloAdjuster: C:\jenkins_slave\workspace\rc_flex-sdk_mustella-mobile\mustella\tests\mobile\components\ActionBar\swfs\ActionBar.xml
[java] new test file: C:\jenkins_slave\workspace\rc_flex-sdk_mustella-mobile\mustella\tests\mobile\components\ActionBar\swfs\ActionBar.xml
[java] ******** cmdArr before:
[java] C:\ApacheFlex\dependencies\AdobeAIRSDK\3.7\bin\adl.exe
[java] C:\jenkins_slave\workspace\rc_flex-sdk_mustella-mobile\mustella\tests\mobile\components\ActionBar\swfs\ActionBar.xml
[java] ******** moreParameters before:
[java] -screensize
[java] 640x960:640x960
[java] -profile
[java] mobileDevice
[java] -XscreenDPI
[java] 240
[java] ******** cmdArr after:
[java] C:\ApacheFlex\dependencies\AdobeAIRSDK\3.7\bin\adl.exe
[java] C:\jenkins_slave\workspace\rc_flex-sdk_mustella-mobile\mustella\tests\mobile\components\ActionBar\swfs\ActionBar.xml
[java] -screensize
[java] 640x960:640x960
[java] -profile
[java] mobileDevice
[java] -XscreenDPI
[java] 240
[java] getting directory from the swf file
[java] derived directory: C:\jenkins_slave\workspace\rc_flex-sdk_mustella-mobile\mustella\tests\mobile\components\ActionBar\swfs
[java] Launching:
[java] C:\ApacheFlex\dependencies\AdobeAIRSDK\3.7\bin\adl.exe C:\jenkins_slave\workspace\rc_flex-sdk_mustella-mobile\mustella\tests\mobile\components\ActionBar\swfs\ActionBar.xml -screensize 640x960:640x960 -profile mobileDevice -XscreenDPI 240 Launching: C:\ApacheFlex\dependencies\AdobeAIRSDK\3.7\bin\adl.exe C:\jenkins_slave\workspace\rc_flex-sdk_mustella-mobile\mustella\tests\mobile\components\ActionBar\swfs\ActionBar.xml
[java] USING directory: C:\jenkins_slave\workspace\rc_flex-sdk_mustella-mobile\mustella\tests\mobile\components\ActionBar\swfs
[java] time: 17:37:36.909
[java] waited 1700
[java] ClobberProcess, it was already null
[java] Wrote file: c:/jenkins_slave/workspace/rc_flex-sdk_mustella-mobile/mustella/tests/mobile/components/ActionBar/styles/baselines/ActionBar_TitleDisplay_TextDecoration@android_240ppi.png.bad.png.xml length: 41892
[java] Wrote file: c:/jenkins_slave/workspace/rc_flex-sdk_mustella-mobile/mustella/tests/mobile/components/ActionBar/styles/baselines/ActionBar_TitleDisplay_TextDecoration@android_240ppi.png.bad.png length: 2375
[java] FAIL: mobile/components/ActionBar/styles/ActionBar_Styles ActionBar_TitleDisplay_TextDecoration
[java] SCRIPTDONE! 17:37:43.982
[java] GET /ScriptComplete?0 HTTP/1.1
[java] Before Wait loop 17:37:43.982 waiting = 0
[java] After Wait loop 17:37:43.982 waiting = 0
[java] clobberProcess false
[java] Total Results so far: 4
[java] removing the xml app file
[java] Grab log, do parse = false
[java] Grabbing the log from: C:\Users\ApacheFlex\AppData/Roaming\Macromedia/Flash Player/Logs/flashlog.txt to: C:\jenkins_slave\workspace\rc_flex-sdk_mustella-mobile\mustella\tests\mobile\components\ActionBar\swfs\ActionBar.log
[java] apollo adj with : C:\jenkins_slave\workspace\rc_flex-sdk_mustella-mobile\mustella\tests\mobile\components\ActionBar\swfs\ActionBarTest.swf
[java] apollo adj thinks it's a swf
[java] writing Apollo file!
[java] full swf is C:\jenkins_slave\workspace\rc_flex-sdk_mustella-mobile\mustella\tests\mobile\components\ActionBar\swfs\ActionBarTest.swf
[java] post ApolloAdjuster: C:\jenkins_slave\workspace\rc_flex-sdk_mustella-mobile\mustella\tests\mobile\components\ActionBar\swfs\ActionBarTest.xml
[java] new test file: C:\jenkins_slave\workspace\rc_flex-sdk_mustella-mobile\mustella\tests\mobile\components\ActionBar\swfs\ActionBarTest.xml
[java] ******** cmdArr before:
[java] C:\ApacheFlex\dependencies\AdobeAIRSDK\3.7\bin\adl.exe
[java] C:\jenkins_slave\workspace\rc_flex-sdk_mustella-mobile\mustella\tests\mobile\components\ActionBar\swfs\ActionBarTest.xml
[java] ******** moreParameters before:
[java] -screensize
[java] 640x960:640x960
[java] -profile
[java] mobileDevice
[java] -XscreenDPI
[java] 240
[java] ******** cmdArr after:
[java] C:\ApacheFlex\dependencies\AdobeAIRSDK\3.7\bin\adl.exe
[java] C:\jenkins_slave\workspace\rc_flex-sdk_mustella-mobile\mustella\tests\mobile\components\ActionBar\swfs\ActionBarTest.xml
[java] -screensize
[java] 640x960:640x960
[java] -profile
[java] mobileDevice
[java] -XscreenDPI
[java] 240
[java] getting directory from the swf file
[java] derived directory: C:\jenkins_slave\workspace\rc_flex-sdk_mustella-mobile\mustella\tests\mobile\components\ActionBar\swfs
[java] waited 1600
[java] ClobberProcess, it was already null
[java] Launching:
[java] C:\ApacheFlex\dependencies\AdobeAIRSDK\3.7\bin\adl.exe C:\jenkins_slave\workspace\rc_flex-sdk_mustella-mobile\mustella\tests\mobile\components\ActionBar\swfs\ActionBarTest.xml -screensize 640x960:640x960 -profile mobileDevice -XscreenDPI 240 Launching: C:\ApacheFlex\dependencies\AdobeAIRSDK\3.7\bin\adl.exe C:\jenkins_slave\workspace\rc_flex-sdk_mustella-mobile\mustella\tests\mobile\components\ActionBar\swfs\ActionBarTest.xml
[java] USING directory: C:\jenkins_slave\workspace\rc_flex-sdk_mustella-mobile\mustella\tests\mobile\components\ActionBar\swfs
[java] time: 17:37:45.938
[java] SCRIPTDONE! 17:37:53.379
[java] GET /ScriptComplete?0 HTTP/1.1
[java] Before Wait loop 17:37:53.379 waiting = 0
[java] After Wait loop 17:37:53.379 waiting = 0
[java] clobberProcess false
[java] Total Results so far: 7
[java] waited 1600
[java] ClobberProcess, it was already null
[java] removing the xml app file
[java] Grab log, do parse = false
[java] Grabbing the log from: C:\Users\ApacheFlex\AppData/Roaming\Macromedia/Flash Player/Logs/flashlog.txt to: C:\jenkins_slave\workspace\rc_flex-sdk_mustella-mobile\mustella\tests\mobile\components\ActionBar\swfs\ActionBarTest.log
[java] at the end of main
[java] Shutting down the results server
[java] shutting down the baseline server
[java] done waiting for results...bye
[java] =====================================================
[java] Passes: 5
[java] Fails: 2
[java] =====================================================
[java]
[java] =====================================================
[java] =====================================================
[java] Passed:
[java] =====================================================
[java] mobile/ViewAndViewNavigator/tests/ViewAndViewNavigator_orientationTabbed orientationStatesUnDefinedActionBarOverlayLeftTabbed Passed
[java] mobile/ViewAndViewNavigator/tests/ViewAndViewNavigator_orientationTabbed orientationStatesUnDefinedActionBarOverlayRightTabbed Passed
[java] mobile/components/ActionBar/properties/ActionBar_ViewNavigator_Properties ActionBar_ViewNavigator_titleLayout_vertical Passed
[java] mobile/components/ActionBar/properties/ActionBar_ViewNavigator_Properties ActionBar_ViewNavigator_titleLayout_tile Passed
[java] mobile/components/ActionBar/properties/ActionBar_ViewNavigator_Properties ActionBar_ViewNavigator_titleLayout_basic Passed
[java] =====================================================
[java] Failed:
[java] =====================================================
[java] C:\jenkins_slave\workspace\rc_flex-sdk_mustella-mobile\mustella\tests\mobile\SkinnablePopUpContainer\swfs\SkinnablePopUpContainerApp.xml Failed Timed out
[java] mobile/components/ActionBar/styles/ActionBar_Styles ActionBar_TitleDisplay_TextDecoration Failed CompareBitmap(body:step 2) compare returned[object BitmapData]
[java]
[java]
[java] =====================================================
[java] Passes: 5
[java] Fails: 2
[java] =====================================================
[java]
[java]
[java] Wrote summary to results.txt
[java] Wrote failures to failures.txt
BUILD FAILED
C:\jenkins_slave\workspace\rc_flex-sdk_mustella-mobile\mustella\build.xml:1547: The following error occurred while executing this line:
C:\jenkins_slave\workspace\rc_flex-sdk_mustella-mobile\mustella\build.xml:1665: Java returned: 1
Total time: 2 minutes 56 seconds
============ JENKINS MUSTELLA RUN REPORT ============
Date/Time: 03-20-2015 22:37
Run duration: 0 days 1 hours 51 mins 19 seconds
Settings:
player.version = 11.7
air.version = 3.7
FLASHPLAYER_DEBUGGER = C:\ApacheFlex\dependencies\FlashPlayer_Debug\flashplayer11_7r700_232_win_sa_debug.exe
AIR_HOME = C:\ApacheFlex\dependencies\AdobeAIRSDK\3.7
Build:
type = mobile
command = -mobile
set = tests/mobile
Log:
- Made Cygwin ignore carriage returns
- Set FLASH_VERSION to '11.7' and AIR_VERSION to '3.7'
- Set AIR_HOME to 'C:\ApacheFlex\dependencies\AdobeAIRSDK\3.7'
- Set FLASHPLAYER_DEBUGGER to 'C:\ApacheFlex\dependencies\FlashPlayer_Debug\flashplayer11_7r700_232_win_sa_debug.exe'
- Cleaned up 'local.properties' files from previous runs
- Created fresh 'local.properties' files with containing run specific values
- Ran 'clean', 'main' and 'other.locales' ant targets to prepare the SDK for testing
- Ran Mustella on the SDK with these parameters: '-mobile tests/mobile'
- Some tests failed: running '-failures'
- Some of tests failed, even after running '-failures'...
=====================================================
Build step 'Execute shell' marked build as failure
Archiving artifacts
Email was triggered for: Failure - Any
Sending email for trigger: Failure - Any
(sent from ext-email)
rc_flex-sdk_mustella-mobile - Build # 160 - Still Failing!
Posted by fl...@gmail.com.
rc_flex-sdk_mustella-mobile - Build # 160 - Still Failing:
http://flex-mustella.cloudapp.net/job/rc_flex-sdk_mustella-mobile/160/
Changes for Build #159
No changes
Changes for Build #160
[jmclean] Added support for FP/AIR 17 and 17 beta
[jmclean] set version in config file to 17.0 not 17.0b as some IDEs may check this
[jmclean] added support for FP 17
[jmclean] added support for FP 17
[jmclean] update with missing contributors
[jmclean] add a few more missing people
[jmclean] add missing bug to release notes
[jmclean] Remove @author tags
--------------------------------
[...truncated 12999 lines...]
[java] C:\ApacheFlex\dependencies\AdobeAIRSDK\3.7\bin\adl.exe
[java] C:\jenkins_slave\workspace\rc_flex-sdk_mustella-mobile\mustella\tests\mobile\components\ActionBar\swfs\ActionBarTest.xml
[java] ******** moreParameters before:
[java] -screensize
[java] 640x960:640x960
[java] -profile
[java] mobileDevice
[java] -XscreenDPI
[java] 240
[java] ******** cmdArr after:
[java] C:\ApacheFlex\dependencies\AdobeAIRSDK\3.7\bin\adl.exe
[java] C:\jenkins_slave\workspace\rc_flex-sdk_mustella-mobile\mustella\tests\mobile\components\ActionBar\swfs\ActionBarTest.xml
[java] -screensize
[java] 640x960:640x960
[java] -profile
[java] mobileDevice
[java] -XscreenDPI
[java] 240
[java] getting directory from the swf file
[java] derived directory: C:\jenkins_slave\workspace\rc_flex-sdk_mustella-mobile\mustella\tests\mobile\components\ActionBar\swfs
[java] Launching:
[java] C:\ApacheFlex\dependencies\AdobeAIRSDK\3.7\bin\adl.exe C:\jenkins_slave\workspace\rc_flex-sdk_mustella-mobile\mustella\tests\mobile\components\ActionBar\swfs\ActionBarTest.xml -screensize 640x960:640x960 -profile mobileDevice -XscreenDPI 240 Launching: C:\ApacheFlex\dependencies\AdobeAIRSDK\3.7\bin\adl.exe C:\jenkins_slave\workspace\rc_flex-sdk_mustella-mobile\mustella\tests\mobile\components\ActionBar\swfs\ActionBarTest.xml
[java] USING directory: C:\jenkins_slave\workspace\rc_flex-sdk_mustella-mobile\mustella\tests\mobile\components\ActionBar\swfs
[java] time: 05:20:38.596
[java] waited 1600
[java] ClobberProcess, it was already null
[java] SCRIPTDONE! 05:20:45.852
[java] GET /ScriptComplete?0 HTTP/1.1
[java] Before Wait loop 05:20:45.852 waiting = 0
[java] After Wait loop 05:20:45.852 waiting = 0
[java] clobberProcess false
[java] Total Results so far: 10
[java] removing the xml app file
[java] Grab log, do parse = false
[java] Grabbing the log from: C:\Users\ApacheFlex\AppData/Roaming\Macromedia/Flash Player/Logs/flashlog.txt to: C:\jenkins_slave\workspace\rc_flex-sdk_mustella-mobile\mustella\tests\mobile\components\ActionBar\swfs\ActionBarTest.log
[java] apollo adj with : C:\jenkins_slave\workspace\rc_flex-sdk_mustella-mobile\mustella\tests\mobile\components\Label\swfs\Label2.swf
[java] apollo adj thinks it's a swf
[java] writing Apollo file!
[java] full swf is C:\jenkins_slave\workspace\rc_flex-sdk_mustella-mobile\mustella\tests\mobile\components\Label\swfs\Label2.swf
[java] post ApolloAdjuster: C:\jenkins_slave\workspace\rc_flex-sdk_mustella-mobile\mustella\tests\mobile\components\Label\swfs\Label2.xml
[java] new test file: C:\jenkins_slave\workspace\rc_flex-sdk_mustella-mobile\mustella\tests\mobile\components\Label\swfs\Label2.xml
[java] ******** cmdArr before:
[java] C:\ApacheFlex\dependencies\AdobeAIRSDK\3.7\bin\adl.exe
[java] C:\jenkins_slave\workspace\rc_flex-sdk_mustella-mobile\mustella\tests\mobile\components\Label\swfs\Label2.xml
[java] ******** moreParameters before:
[java] -screensize
[java] 640x960:640x960
[java] -profile
[java] mobileDevice
[java] -XscreenDPI
[java] 240
[java] ******** cmdArr after:
[java] C:\ApacheFlex\dependencies\AdobeAIRSDK\3.7\bin\adl.exe
[java] C:\jenkins_slave\workspace\rc_flex-sdk_mustella-mobile\mustella\tests\mobile\components\Label\swfs\Label2.xml
[java] -screensize
[java] 640x960:640x960
[java] -profile
[java] mobileDevice
[java] -XscreenDPI
[java] 240
[java] getting directory from the swf file
[java] derived directory: C:\jenkins_slave\workspace\rc_flex-sdk_mustella-mobile\mustella\tests\mobile\components\Label\swfs
[java] Launching:
[java] C:\ApacheFlex\dependencies\AdobeAIRSDK\3.7\bin\adl.exe C:\jenkins_slave\workspace\rc_flex-sdk_mustella-mobile\mustella\tests\mobile\components\Label\swfs\Label2.xml -screensize 640x960:640x960 -profile mobileDevice -XscreenDPI 240 Launching: C:\ApacheFlex\dependencies\AdobeAIRSDK\3.7\bin\adl.exe C:\jenkins_slave\workspace\rc_flex-sdk_mustella-mobile\mustella\tests\mobile\components\Label\swfs\Label2.xml
[java] USING directory: C:\jenkins_slave\workspace\rc_flex-sdk_mustella-mobile\mustella\tests\mobile\components\Label\swfs
[java] time: 05:20:47.726
[java] waited 1600
[java] ClobberProcess, it was already null
[java] SCRIPTDONE! 05:20:52.311
[java] GET /ScriptComplete?0 HTTP/1.1
[java] Before Wait loop 05:20:52.311 waiting = 0
[java] After Wait loop 05:20:52.311 waiting = 0
[java] clobberProcess false
[java] Total Results so far: 11
[java] removing the xml app file
[java] Grab log, do parse = false
[java] Grabbing the log from: C:\Users\ApacheFlex\AppData/Roaming\Macromedia/Flash Player/Logs/flashlog.txt to: C:\jenkins_slave\workspace\rc_flex-sdk_mustella-mobile\mustella\tests\mobile\components\Label\swfs\Label2.log
[java] apollo adj with : C:\jenkins_slave\workspace\rc_flex-sdk_mustella-mobile\mustella\tests\mobile\components\ToggleSwitch\swfs\ToggleSwitchStyles3.swf
[java] apollo adj thinks it's a swf
[java] writing Apollo file!
[java] full swf is C:\jenkins_slave\workspace\rc_flex-sdk_mustella-mobile\mustella\tests\mobile\components\ToggleSwitch\swfs\ToggleSwitchStyles3.swf
[java] post ApolloAdjuster: C:\jenkins_slave\workspace\rc_flex-sdk_mustella-mobile\mustella\tests\mobile\components\ToggleSwitch\swfs\ToggleSwitchStyles3.xml
[java] new test file: C:\jenkins_slave\workspace\rc_flex-sdk_mustella-mobile\mustella\tests\mobile\components\ToggleSwitch\swfs\ToggleSwitchStyles3.xml
[java] ******** cmdArr before:
[java] C:\ApacheFlex\dependencies\AdobeAIRSDK\3.7\bin\adl.exe
[java] C:\jenkins_slave\workspace\rc_flex-sdk_mustella-mobile\mustella\tests\mobile\components\ToggleSwitch\swfs\ToggleSwitchStyles3.xml
[java] ******** moreParameters before:
[java] -screensize
[java] 640x960:640x960
[java] -profile
[java] mobileDevice
[java] -XscreenDPI
[java] 240
[java] ******** cmdArr after:
[java] C:\ApacheFlex\dependencies\AdobeAIRSDK\3.7\bin\adl.exe
[java] C:\jenkins_slave\workspace\rc_flex-sdk_mustella-mobile\mustella\tests\mobile\components\ToggleSwitch\swfs\ToggleSwitchStyles3.xml
[java] -screensize
[java] 640x960:640x960
[java] -profile
[java] mobileDevice
[java] -XscreenDPI
[java] 240
[java] getting directory from the swf file
[java] derived directory: C:\jenkins_slave\workspace\rc_flex-sdk_mustella-mobile\mustella\tests\mobile\components\ToggleSwitch\swfs
[java] Launching:
[java] C:\ApacheFlex\dependencies\AdobeAIRSDK\3.7\bin\adl.exe C:\jenkins_slave\workspace\rc_flex-sdk_mustella-mobile\mustella\tests\mobile\components\ToggleSwitch\swfs\ToggleSwitchStyles3.xml -screensize 640x960:640x960 -profile mobileDevice -XscreenDPI 240 Launching: C:\ApacheFlex\dependencies\AdobeAIRSDK\3.7\bin\adl.exe C:\jenkins_slave\workspace\rc_flex-sdk_mustella-mobile\mustella\tests\mobile\components\ToggleSwitch\swfs\ToggleSwitchStyles3.xml
[java] USING directory: C:\jenkins_slave\workspace\rc_flex-sdk_mustella-mobile\mustella\tests\mobile\components\ToggleSwitch\swfs
[java] time: 05:20:54.197
[java] waited 1600
[java] ClobberProcess, it was already null
[java] SCRIPTDONE! 05:20:58.169
[java] GET /ScriptComplete?0 HTTP/1.1
[java] Before Wait loop 05:20:58.169 waiting = 0
[java] After Wait loop 05:20:58.169 waiting = 0
[java] clobberProcess false
[java] Total Results so far: 12
[java] removing the xml app file
[java] Grab log, do parse = false
[java] Grabbing the log from: C:\Users\ApacheFlex\AppData/Roaming\Macromedia/Flash Player/Logs/flashlog.txt to: C:\jenkins_slave\workspace\rc_flex-sdk_mustella-mobile\mustella\tests\mobile\components\ToggleSwitch\swfs\ToggleSwitchStyles3.log
[java] apollo adj with : C:\jenkins_slave\workspace\rc_flex-sdk_mustella-mobile\mustella\tests\mobile\transitions\ViewTransition\swfs\SplitViewNavTransition.swf
[java] apollo adj thinks it's a swf
[java] writing Apollo file!
[java] full swf is C:\jenkins_slave\workspace\rc_flex-sdk_mustella-mobile\mustella\tests\mobile\transitions\ViewTransition\swfs\SplitViewNavTransition.swf
[java] post ApolloAdjuster: C:\jenkins_slave\workspace\rc_flex-sdk_mustella-mobile\mustella\tests\mobile\transitions\ViewTransition\swfs\SplitViewNavTransition.xml
[java] new test file: C:\jenkins_slave\workspace\rc_flex-sdk_mustella-mobile\mustella\tests\mobile\transitions\ViewTransition\swfs\SplitViewNavTransition.xml
[java] ******** cmdArr before:
[java] C:\ApacheFlex\dependencies\AdobeAIRSDK\3.7\bin\adl.exe
[java] C:\jenkins_slave\workspace\rc_flex-sdk_mustella-mobile\mustella\tests\mobile\transitions\ViewTransition\swfs\SplitViewNavTransition.xml
[java] ******** moreParameters before:
[java] -screensize
[java] 640x960:640x960
[java] -profile
[java] mobileDevice
[java] -XscreenDPI
[java] 240
[java] ******** cmdArr after:
[java] C:\ApacheFlex\dependencies\AdobeAIRSDK\3.7\bin\adl.exe
[java] C:\jenkins_slave\workspace\rc_flex-sdk_mustella-mobile\mustella\tests\mobile\transitions\ViewTransition\swfs\SplitViewNavTransition.xml
[java] -screensize
[java] 640x960:640x960
[java] -profile
[java] mobileDevice
[java] -XscreenDPI
[java] 240
[java] getting directory from the swf file
[java] derived directory: C:\jenkins_slave\workspace\rc_flex-sdk_mustella-mobile\mustella\tests\mobile\transitions\ViewTransition\swfs
[java] Launching:
[java] C:\ApacheFlex\dependencies\AdobeAIRSDK\3.7\bin\adl.exe C:\jenkins_slave\workspace\rc_flex-sdk_mustella-mobile\mustella\tests\mobile\transitions\ViewTransition\swfs\SplitViewNavTransition.xml -screensize 640x960:640x960 -profile mobileDevice -XscreenDPI 240 Launching: C:\ApacheFlex\dependencies\AdobeAIRSDK\3.7\bin\adl.exe C:\jenkins_slave\workspace\rc_flex-sdk_mustella-mobile\mustella\tests\mobile\transitions\ViewTransition\swfs\SplitViewNavTransition.xml
[java] USING directory: C:\jenkins_slave\workspace\rc_flex-sdk_mustella-mobile\mustella\tests\mobile\transitions\ViewTransition\swfs
[java] time: 05:21:00.079
[java] waited 1600
[java] ClobberProcess, it was already null
[java] SCRIPTDONE! 05:21:04.708
[java] GET /ScriptComplete?0 HTTP/1.1
[java] Before Wait loop 05:21:04.708 waiting = 0
[java] After Wait loop 05:21:04.708 waiting = 0
[java] clobberProcess false
[java] Total Results so far: 13
[java] removing the xml app file
[java] Grab log, do parse = false
[java] Grabbing the log from: C:\Users\ApacheFlex\AppData/Roaming\Macromedia/Flash Player/Logs/flashlog.txt to: C:\jenkins_slave\workspace\rc_flex-sdk_mustella-mobile\mustella\tests\mobile\transitions\ViewTransition\swfs\SplitViewNavTransition.log
[java] at the end of main
[java] Shutting down the results server
[java] shutting down the baseline server
[java] done waiting for results...bye
[java] =====================================================
[java] Passes: 11
[java] Fails: 2
[java] =====================================================
[java]
[java] =====================================================
[java] =====================================================
[java] Passed:
[java] =====================================================
[java] mobile/SkinnablePopUpContainer/tests/SpucProperties isModal Passed
[java] mobile/SplitViewNavigator/integration/SplitViewNavigator_persistence Persistence_set_data_in_second_VN Passed
[java] mobile/ViewAndViewNavigator/tests/ViewAndViewNavigator_orientationTabbed orientationStatesUnDefinedActionBarOverlayLeftTabbed Passed
[java] mobile/ViewAndViewNavigator/tests/ViewAndViewNavigator_orientationTabbed orientationStatesUnDefinedActionBarOverlayRightTabbed Passed
[java] mobile/ViewAndViewNavigator/tests/ViewAndViewNavigator_orientation orientationStatesDefinedLabelOrientationInLandscapeRight Passed
[java] mobile/components/ActionBar/properties/ActionBar_ViewNavigator_Properties ActionBar_ViewNavigator_titleLayout_vertical Passed
[java] mobile/components/ActionBar/properties/ActionBar_ViewNavigator_Properties ActionBar_ViewNavigator_titleLayout_tile Passed
[java] mobile/components/ActionBar/properties/ActionBar_ViewNavigator_Properties ActionBar_ViewNavigator_titleLayout_basic Passed
[java] mobile/components/Label/properties/Label_Properties_tester2 Label_height_default Passed
[java] mobile/components/ToggleSwitch/styles/ToggleSwitch_advancedCSS advancedCSS_typeselector_selected Passed
[java] mobile/transitions/ViewTransition/integration/SplitViewTransition_integration SplitViewNavTransition_slide_up Passed
[java] =====================================================
[java] Failed:
[java] =====================================================
[java] C:\jenkins_slave\workspace\rc_flex-sdk_mustella-mobile\mustella\tests\mobile\MobileApplication\swfs\MobileApplicationFirstViewFirstData.xml Failed Timed out
[java] mobile/components/ActionBar/styles/ActionBar_Styles ActionBar_TitleDisplay_TextDecoration Failed CompareBitmap(body:step 2) compare returned[object BitmapData]
[java]
[java]
[java] =====================================================
[java] Passes: 11
[java] Fails: 2
[java] =====================================================
[java]
[java]
[java] Wrote summary to results.txt
[java] Wrote failures to failures.txt
waited 1600
ClobberProcess, it was already null
BUILD FAILED
C:\jenkins_slave\workspace\rc_flex-sdk_mustella-mobile\mustella\build.xml:1547: The following error occurred while executing this line:
C:\jenkins_slave\workspace\rc_flex-sdk_mustella-mobile\mustella\build.xml:1665: Java returned: 1
Total time: 4 minutes 24 seconds
============ JENKINS MUSTELLA RUN REPORT ============
Date/Time: 03-20-2015 10:21
Run duration: 0 days 1 hours 58 mins 13 seconds
Settings:
player.version = 11.1
air.version = 3.7
FLASHPLAYER_DEBUGGER = C:\ApacheFlex\dependencies\FlashPlayer_Debug\flashplayer11_1r102_55_win_sa_debug_32bit.exe
AIR_HOME = C:\ApacheFlex\dependencies\AdobeAIRSDK\3.7
Build:
type = mobile
command = -mobile
set = tests/mobile
Log:
- Made Cygwin ignore carriage returns
- Set FLASH_VERSION to '11.1' and AIR_VERSION to '3.7'
- Set AIR_HOME to 'C:\ApacheFlex\dependencies\AdobeAIRSDK\3.7'
- Set FLASHPLAYER_DEBUGGER to 'C:\ApacheFlex\dependencies\FlashPlayer_Debug\flashplayer11_1r102_55_win_sa_debug_32bit.exe'
- Cleaned up 'local.properties' files from previous runs
- Created fresh 'local.properties' files with containing run specific values
- Ran 'clean', 'main' and 'other.locales' ant targets to prepare the SDK for testing
- Ran Mustella on the SDK with these parameters: '-mobile tests/mobile'
- Some tests failed: running '-failures'
- Some of tests failed, even after running '-failures'...
=====================================================
Build step 'Execute shell' marked build as failure
Archiving artifacts
Email was triggered for: Failure - Any
Sending email for trigger: Failure - Any
(sent from ext-email)