You are viewing a plain text version of this content. The canonical link for it is here.
Posted to yarn-dev@hadoop.apache.org by Apache Jenkins Server <je...@builds.apache.org> on 2015/04/07 12:43:49 UTC

Build failed in Jenkins: Hadoop-Yarn-trunk #890

See <https://builds.apache.org/job/Hadoop-Yarn-trunk/890/changes>

Changes:

[ozawa] TestFairScheduler.testContinuousScheduling fails Intermittently. Contributed by Zhihai Xu.

[cmccabe] HDFS-7999. FsDatasetImpl#createTemporary sometimes holds the FSDatasetImpl lock for a very long time (sinago via cmccabe)

[rkanter] YARN-2429. TestAMRMTokens.testTokenExpiry fails Intermittently with error message:Invalid AMRMToken (zxu via rkanter)

[zjshen] Move YARN-3273 from 2.8 to 2.7.

[shv] HDFS-8071. Redundant checkFileProgress() in PART II of getAdditionalBlock(). Contributed by Konstantin Shvachko.

------------------------------------------
[...truncated 7450 lines...]
	at org.apache.hadoop.yarn.factories.impl.pb.RpcServerFactoryPBImpl.getServer(RpcServerFactoryPBImpl.java:132)
	at org.apache.hadoop.yarn.ipc.HadoopYarnProtoRPC.getServer(HadoopYarnProtoRPC.java:65)
	at org.apache.hadoop.yarn.ipc.YarnRPC.getServer(YarnRPC.java:54)
	at org.apache.hadoop.yarn.server.nodemanager.containermanager.ContainerManagerImpl.serviceStart(ContainerManagerImpl.java:420)
	at org.apache.hadoop.service.AbstractService.start(AbstractService.java:193)
	at org.apache.hadoop.service.CompositeService.serviceStart(CompositeService.java:120)
	at org.apache.hadoop.yarn.server.nodemanager.NodeManager.serviceStart(NodeManager.java:313)
	at org.apache.hadoop.service.AbstractService.start(AbstractService.java:193)
	at org.apache.hadoop.yarn.server.nodemanager.TestNodeStatusUpdater.verifyNodeStartFailure(TestNodeStatusUpdater.java:1612)
	at org.apache.hadoop.yarn.server.nodemanager.TestNodeStatusUpdater.testNMShutdownForRegistrationFailure(TestNodeStatusUpdater.java:1184)

testApplicationKeepAlive(org.apache.hadoop.yarn.server.nodemanager.TestNodeStatusUpdater)  Time elapsed: 0.085 sec  <<< ERROR!
org.apache.hadoop.yarn.exceptions.YarnRuntimeException: java.net.BindException: Problem binding to [localhost:12345] java.net.BindException: Address already in use; For more details see:  http://wiki.apache.org/hadoop/BindException
	at sun.nio.ch.Net.bind0(Native Method)
	at sun.nio.ch.Net.bind(Net.java:444)
	at sun.nio.ch.Net.bind(Net.java:436)
	at sun.nio.ch.ServerSocketChannelImpl.bind(ServerSocketChannelImpl.java:214)
	at sun.nio.ch.ServerSocketAdaptor.bind(ServerSocketAdaptor.java:74)
	at org.apache.hadoop.ipc.Server.bind(Server.java:413)
	at org.apache.hadoop.ipc.Server$Listener.<init>(Server.java:579)
	at org.apache.hadoop.ipc.Server.<init>(Server.java:2308)
	at org.apache.hadoop.ipc.RPC$Server.<init>(RPC.java:945)
	at org.apache.hadoop.ipc.ProtobufRpcEngine$Server.<init>(ProtobufRpcEngine.java:534)
	at org.apache.hadoop.ipc.ProtobufRpcEngine.getServer(ProtobufRpcEngine.java:509)
	at org.apache.hadoop.ipc.RPC$Builder.build(RPC.java:787)
	at org.apache.hadoop.yarn.factories.impl.pb.RpcServerFactoryPBImpl.createServer(RpcServerFactoryPBImpl.java:169)
	at org.apache.hadoop.yarn.factories.impl.pb.RpcServerFactoryPBImpl.getServer(RpcServerFactoryPBImpl.java:132)
	at org.apache.hadoop.yarn.ipc.HadoopYarnProtoRPC.getServer(HadoopYarnProtoRPC.java:65)
	at org.apache.hadoop.yarn.ipc.YarnRPC.getServer(YarnRPC.java:54)
	at org.apache.hadoop.yarn.server.nodemanager.containermanager.ContainerManagerImpl.serviceStart(ContainerManagerImpl.java:420)
	at org.apache.hadoop.service.AbstractService.start(AbstractService.java:193)
	at org.apache.hadoop.service.CompositeService.serviceStart(CompositeService.java:120)
	at org.apache.hadoop.yarn.server.nodemanager.NodeManager.serviceStart(NodeManager.java:313)
	at org.apache.hadoop.service.AbstractService.start(AbstractService.java:193)
	at org.apache.hadoop.yarn.server.nodemanager.TestNodeStatusUpdater.testApplicationKeepAlive(TestNodeStatusUpdater.java:1320)

testNodeStatusUpdaterRetryAndNMShutdown(org.apache.hadoop.yarn.server.nodemanager.TestNodeStatusUpdater)  Time elapsed: 10.131 sec  <<< ERROR!
org.apache.hadoop.yarn.exceptions.YarnRuntimeException: java.net.BindException: Problem binding to [localhost:12345] java.net.BindException: Address already in use; For more details see:  http://wiki.apache.org/hadoop/BindException
	at sun.nio.ch.Net.bind0(Native Method)
	at sun.nio.ch.Net.bind(Net.java:444)
	at sun.nio.ch.Net.bind(Net.java:436)
	at sun.nio.ch.ServerSocketChannelImpl.bind(ServerSocketChannelImpl.java:214)
	at sun.nio.ch.ServerSocketAdaptor.bind(ServerSocketAdaptor.java:74)
	at org.apache.hadoop.ipc.Server.bind(Server.java:413)
	at org.apache.hadoop.ipc.Server$Listener.<init>(Server.java:579)
	at org.apache.hadoop.ipc.Server.<init>(Server.java:2308)
	at org.apache.hadoop.ipc.RPC$Server.<init>(RPC.java:945)
	at org.apache.hadoop.ipc.ProtobufRpcEngine$Server.<init>(ProtobufRpcEngine.java:534)
	at org.apache.hadoop.ipc.ProtobufRpcEngine.getServer(ProtobufRpcEngine.java:509)
	at org.apache.hadoop.ipc.RPC$Builder.build(RPC.java:787)
	at org.apache.hadoop.yarn.factories.impl.pb.RpcServerFactoryPBImpl.createServer(RpcServerFactoryPBImpl.java:169)
	at org.apache.hadoop.yarn.factories.impl.pb.RpcServerFactoryPBImpl.getServer(RpcServerFactoryPBImpl.java:132)
	at org.apache.hadoop.yarn.ipc.HadoopYarnProtoRPC.getServer(HadoopYarnProtoRPC.java:65)
	at org.apache.hadoop.yarn.ipc.YarnRPC.getServer(YarnRPC.java:54)
	at org.apache.hadoop.yarn.server.nodemanager.containermanager.ContainerManagerImpl.serviceStart(ContainerManagerImpl.java:420)
	at org.apache.hadoop.service.AbstractService.start(AbstractService.java:193)
	at org.apache.hadoop.service.CompositeService.serviceStart(CompositeService.java:120)
	at org.apache.hadoop.yarn.server.nodemanager.NodeManager.serviceStart(NodeManager.java:313)
	at org.apache.hadoop.service.AbstractService.start(AbstractService.java:193)
	at org.apache.hadoop.yarn.server.nodemanager.TestNodeStatusUpdater.testNodeStatusUpdaterRetryAndNMShutdown(TestNodeStatusUpdater.java:1405)

Running org.apache.hadoop.yarn.server.nodemanager.TestDockerContainerExecutor
Tests run: 1, Failures: 0, Errors: 0, Skipped: 0, Time elapsed: 0.733 sec - in org.apache.hadoop.yarn.server.nodemanager.TestDockerContainerExecutor
Running org.apache.hadoop.yarn.server.nodemanager.TestLinuxContainerExecutor
Tests run: 8, Failures: 0, Errors: 0, Skipped: 8, Time elapsed: 1.142 sec - in org.apache.hadoop.yarn.server.nodemanager.TestLinuxContainerExecutor
Running org.apache.hadoop.yarn.server.nodemanager.TestLinuxContainerExecutorWithMocks
Tests run: 8, Failures: 0, Errors: 0, Skipped: 0, Time elapsed: 1.345 sec - in org.apache.hadoop.yarn.server.nodemanager.TestLinuxContainerExecutorWithMocks
Running org.apache.hadoop.yarn.server.nodemanager.security.TestNMTokenSecretManagerInNM
Tests run: 1, Failures: 0, Errors: 0, Skipped: 0, Time elapsed: 1.3 sec - in org.apache.hadoop.yarn.server.nodemanager.security.TestNMTokenSecretManagerInNM
Running org.apache.hadoop.yarn.server.nodemanager.security.TestNMContainerTokenSecretManager
Tests run: 1, Failures: 0, Errors: 0, Skipped: 0, Time elapsed: 1.182 sec - in org.apache.hadoop.yarn.server.nodemanager.security.TestNMContainerTokenSecretManager
Running org.apache.hadoop.yarn.server.nodemanager.TestRecordFactory
Tests run: 1, Failures: 0, Errors: 0, Skipped: 0, Time elapsed: 0.266 sec - in org.apache.hadoop.yarn.server.nodemanager.TestRecordFactory
Running org.apache.hadoop.yarn.server.nodemanager.recovery.TestNMLeveldbStateStoreService
Tests run: 12, Failures: 0, Errors: 0, Skipped: 0, Time elapsed: 2.143 sec - in org.apache.hadoop.yarn.server.nodemanager.recovery.TestNMLeveldbStateStoreService
Running org.apache.hadoop.yarn.server.nodemanager.TestContainerManagerWithLCE
Tests run: 10, Failures: 0, Errors: 0, Skipped: 0, Time elapsed: 1.546 sec - in org.apache.hadoop.yarn.server.nodemanager.TestContainerManagerWithLCE
Running org.apache.hadoop.yarn.server.nodemanager.TestRPCFactories
Tests run: 1, Failures: 0, Errors: 0, Skipped: 0, Time elapsed: 0.831 sec - in org.apache.hadoop.yarn.server.nodemanager.TestRPCFactories
Running org.apache.hadoop.yarn.server.nodemanager.TestContainerExecutor
Tests run: 5, Failures: 0, Errors: 0, Skipped: 3, Time elapsed: 0.869 sec - in org.apache.hadoop.yarn.server.nodemanager.TestContainerExecutor
Running org.apache.hadoop.yarn.server.nodemanager.TestNodeManagerShutdown
Tests run: 2, Failures: 0, Errors: 0, Skipped: 0, Time elapsed: 6.029 sec - in org.apache.hadoop.yarn.server.nodemanager.TestNodeManagerShutdown
Running org.apache.hadoop.yarn.server.nodemanager.metrics.TestNodeManagerMetrics
Tests run: 1, Failures: 0, Errors: 0, Skipped: 0, Time elapsed: 0.789 sec - in org.apache.hadoop.yarn.server.nodemanager.metrics.TestNodeManagerMetrics
Running org.apache.hadoop.yarn.server.nodemanager.TestNodeManager
Tests run: 1, Failures: 0, Errors: 0, Skipped: 0, Time elapsed: 1.092 sec - in org.apache.hadoop.yarn.server.nodemanager.TestNodeManager
Running org.apache.hadoop.yarn.server.nodemanager.TestNodeManagerReboot
Tests run: 1, Failures: 0, Errors: 0, Skipped: 0, Time elapsed: 6.023 sec - in org.apache.hadoop.yarn.server.nodemanager.TestNodeManagerReboot
Running org.apache.hadoop.yarn.server.nodemanager.TestDefaultContainerExecutor
Tests run: 3, Failures: 0, Errors: 0, Skipped: 0, Time elapsed: 4.757 sec - in org.apache.hadoop.yarn.server.nodemanager.TestDefaultContainerExecutor
Running org.apache.hadoop.yarn.server.nodemanager.api.protocolrecords.impl.pb.TestPBLocalizerRPC
Tests run: 1, Failures: 0, Errors: 1, Skipped: 0, Time elapsed: 0.614 sec <<< FAILURE! - in org.apache.hadoop.yarn.server.nodemanager.api.protocolrecords.impl.pb.TestPBLocalizerRPC
testLocalizerRPC(org.apache.hadoop.yarn.server.nodemanager.api.protocolrecords.impl.pb.TestPBLocalizerRPC)  Time elapsed: 0.267 sec  <<< ERROR!
org.apache.hadoop.yarn.exceptions.YarnRuntimeException: java.net.BindException: Problem binding to [0.0.0.0:8040] java.net.BindException: Address already in use; For more details see:  http://wiki.apache.org/hadoop/BindException
	at sun.nio.ch.Net.bind0(Native Method)
	at sun.nio.ch.Net.bind(Net.java:444)
	at sun.nio.ch.Net.bind(Net.java:436)
	at sun.nio.ch.ServerSocketChannelImpl.bind(ServerSocketChannelImpl.java:214)
	at sun.nio.ch.ServerSocketAdaptor.bind(ServerSocketAdaptor.java:74)
	at org.apache.hadoop.ipc.Server.bind(Server.java:413)
	at org.apache.hadoop.ipc.Server$Listener.<init>(Server.java:579)
	at org.apache.hadoop.ipc.Server.<init>(Server.java:2308)
	at org.apache.hadoop.ipc.RPC$Server.<init>(RPC.java:945)
	at org.apache.hadoop.ipc.ProtobufRpcEngine$Server.<init>(ProtobufRpcEngine.java:534)
	at org.apache.hadoop.ipc.ProtobufRpcEngine.getServer(ProtobufRpcEngine.java:509)
	at org.apache.hadoop.ipc.RPC$Builder.build(RPC.java:787)
	at org.apache.hadoop.yarn.factories.impl.pb.RpcServerFactoryPBImpl.createServer(RpcServerFactoryPBImpl.java:169)
	at org.apache.hadoop.yarn.factories.impl.pb.RpcServerFactoryPBImpl.getServer(RpcServerFactoryPBImpl.java:132)
	at org.apache.hadoop.yarn.ipc.HadoopYarnProtoRPC.getServer(HadoopYarnProtoRPC.java:65)
	at org.apache.hadoop.yarn.ipc.YarnRPC.getServer(YarnRPC.java:54)
	at org.apache.hadoop.yarn.server.nodemanager.api.protocolrecords.impl.pb.TestPBLocalizerRPC$LocalizerService.start(TestPBLocalizerRPC.java:56)
	at org.apache.hadoop.yarn.server.nodemanager.api.protocolrecords.impl.pb.TestPBLocalizerRPC.testLocalizerRPC(TestPBLocalizerRPC.java:85)

Running org.apache.hadoop.yarn.server.nodemanager.api.protocolrecords.impl.pb.TestPBRecordImpl
Tests run: 4, Failures: 0, Errors: 0, Skipped: 0, Time elapsed: 0.598 sec - in org.apache.hadoop.yarn.server.nodemanager.api.protocolrecords.impl.pb.TestPBRecordImpl
Running org.apache.hadoop.yarn.server.nodemanager.TestLocalDirsHandlerService
Tests run: 3, Failures: 0, Errors: 0, Skipped: 0, Time elapsed: 0.944 sec - in org.apache.hadoop.yarn.server.nodemanager.TestLocalDirsHandlerService
Running org.apache.hadoop.yarn.server.nodemanager.TestNodeHealthService
Tests run: 1, Failures: 0, Errors: 0, Skipped: 0, Time elapsed: 1.244 sec - in org.apache.hadoop.yarn.server.nodemanager.TestNodeHealthService
Running org.apache.hadoop.yarn.server.nodemanager.containermanager.container.TestContainer
Tests run: 18, Failures: 0, Errors: 0, Skipped: 0, Time elapsed: 2.4 sec - in org.apache.hadoop.yarn.server.nodemanager.containermanager.container.TestContainer
Running org.apache.hadoop.yarn.server.nodemanager.containermanager.TestNMProxy
Tests run: 1, Failures: 0, Errors: 0, Skipped: 0, Time elapsed: 3.62 sec - in org.apache.hadoop.yarn.server.nodemanager.containermanager.TestNMProxy
Running org.apache.hadoop.yarn.server.nodemanager.containermanager.logaggregation.TestLogAggregationService
Tests run: 16, Failures: 0, Errors: 0, Skipped: 0, Time elapsed: 31.341 sec - in org.apache.hadoop.yarn.server.nodemanager.containermanager.logaggregation.TestLogAggregationService
Running org.apache.hadoop.yarn.server.nodemanager.containermanager.TestContainerManager
Tests run: 10, Failures: 0, Errors: 0, Skipped: 0, Time elapsed: 25.252 sec - in org.apache.hadoop.yarn.server.nodemanager.containermanager.TestContainerManager
Running org.apache.hadoop.yarn.server.nodemanager.containermanager.monitor.TestContainerMetrics
Tests run: 2, Failures: 0, Errors: 0, Skipped: 0, Time elapsed: 0.92 sec - in org.apache.hadoop.yarn.server.nodemanager.containermanager.monitor.TestContainerMetrics
Running org.apache.hadoop.yarn.server.nodemanager.containermanager.monitor.TestContainersMonitor
Tests run: 3, Failures: 0, Errors: 0, Skipped: 0, Time elapsed: 7.271 sec - in org.apache.hadoop.yarn.server.nodemanager.containermanager.monitor.TestContainersMonitor
Running org.apache.hadoop.yarn.server.nodemanager.containermanager.loghandler.TestNonAggregatingLogHandler
Tests run: 6, Failures: 0, Errors: 0, Skipped: 0, Time elapsed: 1.637 sec - in org.apache.hadoop.yarn.server.nodemanager.containermanager.loghandler.TestNonAggregatingLogHandler
Running org.apache.hadoop.yarn.server.nodemanager.containermanager.TestAuxServices
Tests run: 6, Failures: 0, Errors: 0, Skipped: 0, Time elapsed: 1.017 sec - in org.apache.hadoop.yarn.server.nodemanager.containermanager.TestAuxServices
Running org.apache.hadoop.yarn.server.nodemanager.containermanager.TestContainerManagerRecovery
Tests run: 1, Failures: 0, Errors: 0, Skipped: 0, Time elapsed: 1.906 sec - in org.apache.hadoop.yarn.server.nodemanager.containermanager.TestContainerManagerRecovery
Running org.apache.hadoop.yarn.server.nodemanager.containermanager.launcher.TestContainerLaunch
Tests run: 16, Failures: 0, Errors: 0, Skipped: 4, Time elapsed: 20.392 sec - in org.apache.hadoop.yarn.server.nodemanager.containermanager.launcher.TestContainerLaunch
Running org.apache.hadoop.yarn.server.nodemanager.containermanager.localizer.TestLocalCacheDirectoryManager
Tests run: 5, Failures: 0, Errors: 0, Skipped: 0, Time elapsed: 1.461 sec - in org.apache.hadoop.yarn.server.nodemanager.containermanager.localizer.TestLocalCacheDirectoryManager
Running org.apache.hadoop.yarn.server.nodemanager.containermanager.localizer.TestContainerLocalizer
Tests run: 3, Failures: 0, Errors: 0, Skipped: 0, Time elapsed: 1.454 sec - in org.apache.hadoop.yarn.server.nodemanager.containermanager.localizer.TestContainerLocalizer
Running org.apache.hadoop.yarn.server.nodemanager.containermanager.localizer.TestLocalResourcesTrackerImpl
Tests run: 8, Failures: 0, Errors: 0, Skipped: 0, Time elapsed: 1.402 sec - in org.apache.hadoop.yarn.server.nodemanager.containermanager.localizer.TestLocalResourcesTrackerImpl
Running org.apache.hadoop.yarn.server.nodemanager.containermanager.localizer.sharedcache.TestSharedCacheUploadService
Tests run: 2, Failures: 0, Errors: 0, Skipped: 0, Time elapsed: 0.795 sec - in org.apache.hadoop.yarn.server.nodemanager.containermanager.localizer.sharedcache.TestSharedCacheUploadService
Running org.apache.hadoop.yarn.server.nodemanager.containermanager.localizer.sharedcache.TestSharedCacheUploader
Tests run: 6, Failures: 0, Errors: 0, Skipped: 0, Time elapsed: 1.136 sec - in org.apache.hadoop.yarn.server.nodemanager.containermanager.localizer.sharedcache.TestSharedCacheUploader
Running org.apache.hadoop.yarn.server.nodemanager.containermanager.localizer.TestLocalResource
Tests run: 2, Failures: 0, Errors: 0, Skipped: 0, Time elapsed: 0.395 sec - in org.apache.hadoop.yarn.server.nodemanager.containermanager.localizer.TestLocalResource
Running org.apache.hadoop.yarn.server.nodemanager.containermanager.localizer.TestResourceRetention
Tests run: 1, Failures: 0, Errors: 0, Skipped: 0, Time elapsed: 0.918 sec - in org.apache.hadoop.yarn.server.nodemanager.containermanager.localizer.TestResourceRetention
Running org.apache.hadoop.yarn.server.nodemanager.containermanager.localizer.TestLocalizedResource
Tests run: 1, Failures: 0, Errors: 0, Skipped: 0, Time elapsed: 0.642 sec - in org.apache.hadoop.yarn.server.nodemanager.containermanager.localizer.TestLocalizedResource
Running org.apache.hadoop.yarn.server.nodemanager.containermanager.localizer.TestResourceLocalizationService
Tests run: 13, Failures: 0, Errors: 0, Skipped: 0, Time elapsed: 5.946 sec - in org.apache.hadoop.yarn.server.nodemanager.containermanager.localizer.TestResourceLocalizationService
Running org.apache.hadoop.yarn.server.nodemanager.containermanager.application.TestApplication
Tests run: 8, Failures: 0, Errors: 0, Skipped: 0, Time elapsed: 5.492 sec - in org.apache.hadoop.yarn.server.nodemanager.containermanager.application.TestApplication
Running org.apache.hadoop.yarn.server.nodemanager.TestDirectoryCollection
Tests run: 6, Failures: 0, Errors: 0, Skipped: 0, Time elapsed: 0.911 sec - in org.apache.hadoop.yarn.server.nodemanager.TestDirectoryCollection
Running org.apache.hadoop.yarn.server.nodemanager.TestNMAuditLogger
Tests run: 3, Failures: 0, Errors: 0, Skipped: 0, Time elapsed: 1.065 sec - in org.apache.hadoop.yarn.server.nodemanager.TestNMAuditLogger
Running org.apache.hadoop.yarn.server.nodemanager.TestNodeStatusUpdaterForLabels
Tests run: 1, Failures: 0, Errors: 0, Skipped: 0, Time elapsed: 3.967 sec - in org.apache.hadoop.yarn.server.nodemanager.TestNodeStatusUpdaterForLabels
Running org.apache.hadoop.yarn.server.nodemanager.TestDeletionService
Tests run: 6, Failures: 0, Errors: 0, Skipped: 0, Time elapsed: 22.884 sec - in org.apache.hadoop.yarn.server.nodemanager.TestDeletionService
Running org.apache.hadoop.yarn.server.nodemanager.TestDockerContainerExecutorWithMocks
Tests run: 4, Failures: 0, Errors: 0, Skipped: 0, Time elapsed: 1.271 sec - in org.apache.hadoop.yarn.server.nodemanager.TestDockerContainerExecutorWithMocks
Running org.apache.hadoop.yarn.server.nodemanager.TestEventFlow
Tests run: 1, Failures: 0, Errors: 0, Skipped: 0, Time elapsed: 5.735 sec - in org.apache.hadoop.yarn.server.nodemanager.TestEventFlow
Running org.apache.hadoop.yarn.server.nodemanager.webapp.TestNMWebServices
Tests run: 11, Failures: 0, Errors: 0, Skipped: 0, Time elapsed: 6.227 sec - in org.apache.hadoop.yarn.server.nodemanager.webapp.TestNMWebServices
Running org.apache.hadoop.yarn.server.nodemanager.webapp.TestNMWebServicesContainers
Tests run: 12, Failures: 0, Errors: 0, Skipped: 0, Time elapsed: 6.594 sec - in org.apache.hadoop.yarn.server.nodemanager.webapp.TestNMWebServicesContainers
Running org.apache.hadoop.yarn.server.nodemanager.webapp.TestContainerLogsPage
Tests run: 4, Failures: 0, Errors: 0, Skipped: 1, Time elapsed: 1.227 sec - in org.apache.hadoop.yarn.server.nodemanager.webapp.TestContainerLogsPage
Running org.apache.hadoop.yarn.server.nodemanager.webapp.TestNMWebServicesApps
Tests run: 19, Failures: 0, Errors: 0, Skipped: 0, Time elapsed: 8.387 sec - in org.apache.hadoop.yarn.server.nodemanager.webapp.TestNMWebServicesApps
Running org.apache.hadoop.yarn.server.nodemanager.webapp.TestNMWebServer
Tests run: 3, Failures: 0, Errors: 0, Skipped: 0, Time elapsed: 2.465 sec - in org.apache.hadoop.yarn.server.nodemanager.webapp.TestNMWebServer

Results :

Tests in error: 
  TestNodeManagerResync.testNMshutdownWhenResyncThrowException:194 » YarnRuntime
  TestNodeManagerResync.testPreserveContainersOnResyncKeepingContainers:122->testContainerPreservationOnResyncImpl:135 » YarnRuntime
  TestNodeManagerResync.testBlockNewContainerRequestsOnStartAndResync:170 » YarnRuntime
  TestNodeManagerResync.testKillContainersOnResync:113->testContainerPreservationOnResyncImpl:135 » YarnRuntime
  TestNodeManagerResync.testNMSentContainerStatusOnResync:299 » YarnRuntime java...
  TestNodeStatusUpdater.testStopReentrant:1098 » YarnRuntime java.net.BindExcept...
  TestNodeStatusUpdater.testRMVersionLessThanMinimum:1460 » YarnRuntime java.net...
  TestNodeStatusUpdater.testNMConnectionToRM:1227  NM should have tried re-conne...
  TestNodeStatusUpdater.testNMShutdownForRegistrationFailure:1184->verifyNodeStartFailure:1612 » YarnRuntime
  TestNodeStatusUpdater.testApplicationKeepAlive:1320 » YarnRuntime java.net.Bin...
  TestNodeStatusUpdater.testNodeStatusUpdaterRetryAndNMShutdown:1405 » YarnRuntime
  TestPBLocalizerRPC.testLocalizerRPC:85 » YarnRuntime java.net.BindException: P...

Tests run: 291, Failures: 0, Errors: 12, Skipped: 16

[INFO] ------------------------------------------------------------------------
[INFO] Reactor Summary:
[INFO] 
[INFO] hadoop-yarn ....................................... SUCCESS [  3.102 s]
[INFO] hadoop-yarn-api ................................... SUCCESS [03:35 min]
[INFO] hadoop-yarn-common ................................ SUCCESS [02:55 min]
[INFO] hadoop-yarn-server ................................ SUCCESS [  0.105 s]
[INFO] hadoop-yarn-server-common ......................... SUCCESS [ 40.700 s]
[INFO] hadoop-yarn-server-nodemanager .................... FAILURE [04:31 min]
[INFO] hadoop-yarn-server-web-proxy ...................... SKIPPED
[INFO] hadoop-yarn-server-applicationhistoryservice ...... SKIPPED
[INFO] hadoop-yarn-server-resourcemanager ................ SKIPPED
[INFO] hadoop-yarn-server-tests .......................... SKIPPED
[INFO] hadoop-yarn-client ................................ SKIPPED
[INFO] hadoop-yarn-server-sharedcachemanager ............. SKIPPED
[INFO] hadoop-yarn-applications .......................... SKIPPED
[INFO] hadoop-yarn-applications-distributedshell ......... SKIPPED
[INFO] hadoop-yarn-applications-unmanaged-am-launcher .... SKIPPED
[INFO] hadoop-yarn-site .................................. SKIPPED
[INFO] hadoop-yarn-registry .............................. SKIPPED
[INFO] hadoop-yarn-project ............................... SKIPPED
[INFO] ------------------------------------------------------------------------
[INFO] BUILD FAILURE
[INFO] ------------------------------------------------------------------------
[INFO] Total time: 11:48 min
[INFO] Finished at: 2015-04-07T10:43:43+00:00
[INFO] Final Memory: 77M/1151M
[INFO] ------------------------------------------------------------------------
[ERROR] Failed to execute goal org.apache.maven.plugins:maven-surefire-plugin:2.17:test (default-test) on project hadoop-yarn-server-nodemanager: There are test failures.
[ERROR] 
[ERROR] Please refer to <https://builds.apache.org/job/Hadoop-Yarn-trunk/ws/hadoop-yarn-project/hadoop-yarn/hadoop-yarn-server/hadoop-yarn-server-nodemanager/target/surefire-reports> for the individual test results.
[ERROR] -> [Help 1]
[ERROR] 
[ERROR] To see the full stack trace of the errors, re-run Maven with the -e switch.
[ERROR] Re-run Maven using the -X switch to enable full debug logging.
[ERROR] 
[ERROR] For more information about the errors and possible solutions, please read the following articles:
[ERROR] [Help 1] http://cwiki.apache.org/confluence/display/MAVEN/MojoFailureException
[ERROR] 
[ERROR] After correcting the problems, you can resume the build with the command
[ERROR]   mvn <goals> -rf :hadoop-yarn-server-nodemanager
Build step 'Execute shell' marked build as failure
Archiving artifacts
Recording test results
Updating HDFS-8071
Updating YARN-3273
Updating HDFS-7999
Updating YARN-2429

Hadoop-Yarn-trunk - Build # 891 - Still Failing

Posted by Apache Jenkins Server <je...@builds.apache.org>.
See https://builds.apache.org/job/Hadoop-Yarn-trunk/891/

###################################################################################
########################## LAST 60 LINES OF THE CONSOLE ###########################
[...truncated 9870 lines...]
[INFO] ------------------------------------------------------------------------
[INFO] Reactor Summary:
[INFO] 
[INFO] hadoop-yarn ....................................... SUCCESS [  3.176 s]
[INFO] hadoop-yarn-api ................................... SUCCESS [03:14 min]
[INFO] hadoop-yarn-common ................................ SUCCESS [02:57 min]
[INFO] hadoop-yarn-server ................................ SUCCESS [  0.094 s]
[INFO] hadoop-yarn-server-common ......................... SUCCESS [ 39.795 s]
[INFO] hadoop-yarn-server-nodemanager .................... SUCCESS [06:06 min]
[INFO] hadoop-yarn-server-web-proxy ...................... SUCCESS [ 23.511 s]
[INFO] hadoop-yarn-server-applicationhistoryservice ...... SUCCESS [02:52 min]
[INFO] hadoop-yarn-server-resourcemanager ................ SUCCESS [48:38 min]
[INFO] hadoop-yarn-server-tests .......................... SUCCESS [02:16 min]
[INFO] hadoop-yarn-client ................................ FAILURE [06:31 min]
[INFO] hadoop-yarn-server-sharedcachemanager ............. SKIPPED
[INFO] hadoop-yarn-applications .......................... SKIPPED
[INFO] hadoop-yarn-applications-distributedshell ......... SKIPPED
[INFO] hadoop-yarn-applications-unmanaged-am-launcher .... SKIPPED
[INFO] hadoop-yarn-site .................................. SKIPPED
[INFO] hadoop-yarn-registry .............................. SKIPPED
[INFO] hadoop-yarn-project ............................... SKIPPED
[INFO] ------------------------------------------------------------------------
[INFO] BUILD FAILURE
[INFO] ------------------------------------------------------------------------
[INFO] Total time: 01:13 h
[INFO] Finished at: 2015-04-08T11:45:44+00:00
[INFO] Final Memory: 72M/927M
[INFO] ------------------------------------------------------------------------
[ERROR] Failed to execute goal org.apache.maven.plugins:maven-surefire-plugin:2.17:test (default-test) on project hadoop-yarn-client: ExecutionException: java.lang.RuntimeException: The forked VM terminated without properly saying goodbye. VM crash or System.exit called?
[ERROR] Command was /bin/sh -c cd /home/jenkins/jenkins-slave/workspace/Hadoop-Yarn-trunk/hadoop-yarn-project/hadoop-yarn/hadoop-yarn-client && /home/jenkins/tools/java/jdk1.7.0_55/jre/bin/java -Xmx4096m -XX:MaxPermSize=768m -XX:+HeapDumpOnOutOfMemoryError -jar /home/jenkins/jenkins-slave/workspace/Hadoop-Yarn-trunk/hadoop-yarn-project/hadoop-yarn/hadoop-yarn-client/target/surefire/surefirebooter7059300463778829015.jar /home/jenkins/jenkins-slave/workspace/Hadoop-Yarn-trunk/hadoop-yarn-project/hadoop-yarn/hadoop-yarn-client/target/surefire/surefire6013390029598605560tmp /home/jenkins/jenkins-slave/workspace/Hadoop-Yarn-trunk/hadoop-yarn-project/hadoop-yarn/hadoop-yarn-client/target/surefire/surefire_2712382416913460720718tmp
[ERROR] -> [Help 1]
[ERROR] 
[ERROR] To see the full stack trace of the errors, re-run Maven with the -e switch.
[ERROR] Re-run Maven using the -X switch to enable full debug logging.
[ERROR] 
[ERROR] For more information about the errors and possible solutions, please read the following articles:
[ERROR] [Help 1] http://cwiki.apache.org/confluence/display/MAVEN/MojoFailureException
[ERROR] 
[ERROR] After correcting the problems, you can resume the build with the command
[ERROR]   mvn <goals> -rf :hadoop-yarn-client
Build step 'Execute shell' marked build as failure
Archiving artifacts
Recording test results
Updating HADOOP-11801
Updating HDFS-8080
Updating YARN-3110
Updating HDFS-8038
Updating YARN-3457
Updating HDFS-8079
Updating YARN-3294
Updating HDFS-8073
Updating HADOOP-11717
Updating HDFS-8049
Updating HDFS-5215
Updating YARN-3429
Updating HADOOP-11796
Sending e-mails to: yarn-dev@hadoop.apache.org
Email was triggered for: Failure
Sending email for trigger: Failure



###################################################################################
############################## FAILED TESTS (if any) ##############################
All tests passed

Jenkins build is back to normal : Hadoop-Yarn-trunk #892

Posted by Apache Jenkins Server <je...@builds.apache.org>.
See <https://builds.apache.org/job/Hadoop-Yarn-trunk/892/changes>


Build failed in Jenkins: Hadoop-Yarn-trunk #891

Posted by Apache Jenkins Server <je...@builds.apache.org>.
See <https://builds.apache.org/job/Hadoop-Yarn-trunk/891/changes>

Changes:

[omalley] HADOOP-11717. Support JWT tokens for web single sign on to the Hadoop

[xgong] YARN-3110. Few issues in ApplicationHistory web ui. Contributed by Naganarasimha G R

[xgong] YARN-3294. Allow dumping of Capacity Scheduler debug logs via web UI for

[szetszwo] HDFS-8049. Add @InterfaceAudience.Private annotation to hdfs client implementation. Contributed by Takuya Fukudome

[cnauroth] HDFS-8038. PBImageDelimitedTextWriter#getEntry output HDFS path in platform-specific format. Contributed by Xiaoyu Yao.

[cnauroth] HADOOP-11796. Skip TestShellBasedIdMapping.testStaticMapUpdate on Windows. Contributed by Xiaoyu Yao.

[rkanter] YARN-3429. Fix incorrect CHANGES.txt

[arp] HADOOP-11801. Update BUILDING.txt for Ubuntu. (Contributed by Gabor Liptak)

[yzhang] HDFS-5215. dfs.datanode.du.reserved is not considered while computing

[szetszwo] HDFS-8079. Move dfs.client.retry.* confs from DFSConfigKeys to HdfsClientConfigKeys.Retry.

[vinayakumarb] HDFS-8073. Split BlockPlacementPolicyDefault.chooseTarget(..) so it can be easily overrided. (Contributed by Walter Su)

[wheat9] HDFS-8080. Separate JSON related routines used by WebHdfsFileSystem to a package local class. Contributed by Haohui Mai.

[ozawa] YARN-3457. NPE when NodeManager.serviceInit fails and stopRecoveryStore called. Contributed by Bibin A Chundatt.

------------------------------------------
[...truncated 9677 lines...]
[INFO] 
[INFO] --- hadoop-maven-plugins:3.0.0-SNAPSHOT:protoc (compile-protoc) @ hadoop-yarn-server-tests ---
[INFO] 
[INFO] --- maven-resources-plugin:2.6:resources (default-resources) @ hadoop-yarn-server-tests ---
[INFO] Using 'UTF-8' encoding to copy filtered resources.
[INFO] skip non existing resourceDirectory <https://builds.apache.org/job/Hadoop-Yarn-trunk/ws/hadoop-yarn-project/hadoop-yarn/hadoop-yarn-server/hadoop-yarn-server-tests/src/main/resources>
[INFO] 
[INFO] --- maven-compiler-plugin:3.1:compile (default-compile) @ hadoop-yarn-server-tests ---
[INFO] Changes detected - recompiling the module!
[INFO] Compiling 1 source file to <https://builds.apache.org/job/Hadoop-Yarn-trunk/ws/hadoop-yarn-project/hadoop-yarn/hadoop-yarn-server/hadoop-yarn-server-tests/target/classes>
[INFO] 
[INFO] --- maven-resources-plugin:2.6:testResources (default-testResources) @ hadoop-yarn-server-tests ---
[INFO] Using 'UTF-8' encoding to copy filtered resources.
[INFO] Copying 4 resources
[INFO] 
[INFO] --- maven-compiler-plugin:3.1:testCompile (default-testCompile) @ hadoop-yarn-server-tests ---
[INFO] Changes detected - recompiling the module!
[INFO] Compiling 7 source files to <https://builds.apache.org/job/Hadoop-Yarn-trunk/ws/hadoop-yarn-project/hadoop-yarn/hadoop-yarn-server/hadoop-yarn-server-tests/target/test-classes>
[INFO] 
[INFO] --- maven-jar-plugin:2.5:test-jar (default) @ hadoop-yarn-server-tests ---
[INFO] Building jar: <https://builds.apache.org/job/Hadoop-Yarn-trunk/ws/hadoop-yarn-project/hadoop-yarn/hadoop-yarn-server/hadoop-yarn-server-tests/target/hadoop-yarn-server-tests-3.0.0-SNAPSHOT-tests.jar>
[INFO] 
[INFO] --- maven-surefire-plugin:2.17:test (default-test) @ hadoop-yarn-server-tests ---
[INFO] Surefire report directory: <https://builds.apache.org/job/Hadoop-Yarn-trunk/ws/hadoop-yarn-project/hadoop-yarn/hadoop-yarn-server/hadoop-yarn-server-tests/target/surefire-reports>

-------------------------------------------------------
 T E S T S
-------------------------------------------------------

-------------------------------------------------------
 T E S T S
-------------------------------------------------------
Running org.apache.hadoop.yarn.server.TestDiskFailures
Tests run: 3, Failures: 0, Errors: 0, Skipped: 0, Time elapsed: 19.782 sec - in org.apache.hadoop.yarn.server.TestDiskFailures
Running org.apache.hadoop.yarn.server.TestContainerManagerSecurity
Tests run: 4, Failures: 0, Errors: 0, Skipped: 0, Time elapsed: 88.534 sec - in org.apache.hadoop.yarn.server.TestContainerManagerSecurity
Running org.apache.hadoop.yarn.server.TestRMNMSecretKeys
Tests run: 1, Failures: 0, Errors: 0, Skipped: 0, Time elapsed: 2.263 sec - in org.apache.hadoop.yarn.server.TestRMNMSecretKeys
Running org.apache.hadoop.yarn.server.TestMiniYARNClusterForHA
Tests run: 1, Failures: 0, Errors: 0, Skipped: 0, Time elapsed: 6.247 sec - in org.apache.hadoop.yarn.server.TestMiniYARNClusterForHA

Results :

Tests run: 9, Failures: 0, Errors: 0, Skipped: 0

[INFO] 
[INFO] --- maven-jar-plugin:2.5:jar (default-jar) @ hadoop-yarn-server-tests ---
[INFO] Building jar: <https://builds.apache.org/job/Hadoop-Yarn-trunk/ws/hadoop-yarn-project/hadoop-yarn/hadoop-yarn-server/hadoop-yarn-server-tests/target/hadoop-yarn-server-tests-3.0.0-SNAPSHOT.jar>
[INFO] 
[INFO] --- maven-source-plugin:2.3:jar-no-fork (hadoop-java-sources) @ hadoop-yarn-server-tests ---
[INFO] Building jar: <https://builds.apache.org/job/Hadoop-Yarn-trunk/ws/hadoop-yarn-project/hadoop-yarn/hadoop-yarn-server/hadoop-yarn-server-tests/target/hadoop-yarn-server-tests-3.0.0-SNAPSHOT-sources.jar>
[INFO] 
[INFO] --- maven-source-plugin:2.3:test-jar-no-fork (hadoop-java-sources) @ hadoop-yarn-server-tests ---
[INFO] Building jar: <https://builds.apache.org/job/Hadoop-Yarn-trunk/ws/hadoop-yarn-project/hadoop-yarn/hadoop-yarn-server/hadoop-yarn-server-tests/target/hadoop-yarn-server-tests-3.0.0-SNAPSHOT-test-sources.jar>
[INFO] 
[INFO] --- maven-enforcer-plugin:1.3.1:enforce (dist-enforce) @ hadoop-yarn-server-tests ---
[INFO] 
[INFO] --- maven-site-plugin:3.4:attach-descriptor (attach-descriptor) @ hadoop-yarn-server-tests ---
[INFO] 
[INFO] --- maven-javadoc-plugin:2.8.1:jar (module-javadocs) @ hadoop-yarn-server-tests ---
[INFO] 
Loading source files for package org.apache.hadoop.yarn.proto...
Constructing Javadoc information...
Standard Doclet version 1.7.0_55
Building tree for all the packages and classes...
Generating <https://builds.apache.org/job/Hadoop-Yarn-trunk/ws/hadoop-yarn-project/hadoop-yarn/hadoop-yarn-server/hadoop-yarn-server-tests/target/org/apache/hadoop/yarn/proto/YarnSecurityTestTokenProtos.html...>
Generating <https://builds.apache.org/job/Hadoop-Yarn-trunk/ws/hadoop-yarn-project/hadoop-yarn/hadoop-yarn-server/hadoop-yarn-server-tests/target/org/apache/hadoop/yarn/proto/YarnSecurityTestTokenProtos.ContainerTokenIdentifierForTestProto.html...>
Generating <https://builds.apache.org/job/Hadoop-Yarn-trunk/ws/hadoop-yarn-project/hadoop-yarn/hadoop-yarn-server/hadoop-yarn-server-tests/target/org/apache/hadoop/yarn/proto/YarnSecurityTestTokenProtos.ContainerTokenIdentifierForTestProto.Builder.html...>
Generating <https://builds.apache.org/job/Hadoop-Yarn-trunk/ws/hadoop-yarn-project/hadoop-yarn/hadoop-yarn-server/hadoop-yarn-server-tests/target/org/apache/hadoop/yarn/proto/YarnSecurityTestTokenProtos.ContainerTokenIdentifierForTestProtoOrBuilder.html...>
Generating <https://builds.apache.org/job/Hadoop-Yarn-trunk/ws/hadoop-yarn-project/hadoop-yarn/hadoop-yarn-server/hadoop-yarn-server-tests/target/org/apache/hadoop/yarn/proto/YarnSecurityTestTokenProtos.NMTokenIdentifierNewProto.html...>
Generating <https://builds.apache.org/job/Hadoop-Yarn-trunk/ws/hadoop-yarn-project/hadoop-yarn/hadoop-yarn-server/hadoop-yarn-server-tests/target/org/apache/hadoop/yarn/proto/YarnSecurityTestTokenProtos.NMTokenIdentifierNewProto.Builder.html...>
Generating <https://builds.apache.org/job/Hadoop-Yarn-trunk/ws/hadoop-yarn-project/hadoop-yarn/hadoop-yarn-server/hadoop-yarn-server-tests/target/org/apache/hadoop/yarn/proto/YarnSecurityTestTokenProtos.NMTokenIdentifierNewProtoOrBuilder.html...>
Generating <https://builds.apache.org/job/Hadoop-Yarn-trunk/ws/hadoop-yarn-project/hadoop-yarn/hadoop-yarn-server/hadoop-yarn-server-tests/target/org/apache/hadoop/yarn/proto/package-frame.html...>
Generating <https://builds.apache.org/job/Hadoop-Yarn-trunk/ws/hadoop-yarn-project/hadoop-yarn/hadoop-yarn-server/hadoop-yarn-server-tests/target/org/apache/hadoop/yarn/proto/package-summary.html...>
Generating <https://builds.apache.org/job/Hadoop-Yarn-trunk/ws/hadoop-yarn-project/hadoop-yarn/hadoop-yarn-server/hadoop-yarn-server-tests/target/org/apache/hadoop/yarn/proto/package-tree.html...>
Generating <https://builds.apache.org/job/Hadoop-Yarn-trunk/ws/hadoop-yarn-project/hadoop-yarn/hadoop-yarn-server/hadoop-yarn-server-tests/target/constant-values.html...>
Generating <https://builds.apache.org/job/Hadoop-Yarn-trunk/ws/hadoop-yarn-project/hadoop-yarn/hadoop-yarn-server/hadoop-yarn-server-tests/target/serialized-form.html...>
Generating <https://builds.apache.org/job/Hadoop-Yarn-trunk/ws/hadoop-yarn-project/hadoop-yarn/hadoop-yarn-server/hadoop-yarn-server-tests/target/org/apache/hadoop/yarn/proto/class-use/YarnSecurityTestTokenProtos.html...>
Generating <https://builds.apache.org/job/Hadoop-Yarn-trunk/ws/hadoop-yarn-project/hadoop-yarn/hadoop-yarn-server/hadoop-yarn-server-tests/target/org/apache/hadoop/yarn/proto/class-use/YarnSecurityTestTokenProtos.NMTokenIdentifierNewProtoOrBuilder.html...>
Generating <https://builds.apache.org/job/Hadoop-Yarn-trunk/ws/hadoop-yarn-project/hadoop-yarn/hadoop-yarn-server/hadoop-yarn-server-tests/target/org/apache/hadoop/yarn/proto/class-use/YarnSecurityTestTokenProtos.NMTokenIdentifierNewProto.html...>
Generating <https://builds.apache.org/job/Hadoop-Yarn-trunk/ws/hadoop-yarn-project/hadoop-yarn/hadoop-yarn-server/hadoop-yarn-server-tests/target/org/apache/hadoop/yarn/proto/class-use/YarnSecurityTestTokenProtos.NMTokenIdentifierNewProto.Builder.html...>
Generating <https://builds.apache.org/job/Hadoop-Yarn-trunk/ws/hadoop-yarn-project/hadoop-yarn/hadoop-yarn-server/hadoop-yarn-server-tests/target/org/apache/hadoop/yarn/proto/class-use/YarnSecurityTestTokenProtos.ContainerTokenIdentifierForTestProtoOrBuilder.html...>
Generating <https://builds.apache.org/job/Hadoop-Yarn-trunk/ws/hadoop-yarn-project/hadoop-yarn/hadoop-yarn-server/hadoop-yarn-server-tests/target/org/apache/hadoop/yarn/proto/class-use/YarnSecurityTestTokenProtos.ContainerTokenIdentifierForTestProto.html...>
Generating <https://builds.apache.org/job/Hadoop-Yarn-trunk/ws/hadoop-yarn-project/hadoop-yarn/hadoop-yarn-server/hadoop-yarn-server-tests/target/org/apache/hadoop/yarn/proto/class-use/YarnSecurityTestTokenProtos.ContainerTokenIdentifierForTestProto.Builder.html...>
Generating <https://builds.apache.org/job/Hadoop-Yarn-trunk/ws/hadoop-yarn-project/hadoop-yarn/hadoop-yarn-server/hadoop-yarn-server-tests/target/org/apache/hadoop/yarn/proto/package-use.html...>
Building index for all the packages and classes...
Generating <https://builds.apache.org/job/Hadoop-Yarn-trunk/ws/hadoop-yarn-project/hadoop-yarn/hadoop-yarn-server/hadoop-yarn-server-tests/target/overview-tree.html...>
Generating <https://builds.apache.org/job/Hadoop-Yarn-trunk/ws/hadoop-yarn-project/hadoop-yarn/hadoop-yarn-server/hadoop-yarn-server-tests/target/index-all.html...>
Generating <https://builds.apache.org/job/Hadoop-Yarn-trunk/ws/hadoop-yarn-project/hadoop-yarn/hadoop-yarn-server/hadoop-yarn-server-tests/target/deprecated-list.html...>
Building index for all classes...
Generating <https://builds.apache.org/job/Hadoop-Yarn-trunk/ws/hadoop-yarn-project/hadoop-yarn/hadoop-yarn-server/hadoop-yarn-server-tests/target/allclasses-frame.html...>
Generating <https://builds.apache.org/job/Hadoop-Yarn-trunk/ws/hadoop-yarn-project/hadoop-yarn/hadoop-yarn-server/hadoop-yarn-server-tests/target/allclasses-noframe.html...>
Generating <https://builds.apache.org/job/Hadoop-Yarn-trunk/ws/hadoop-yarn-project/hadoop-yarn/hadoop-yarn-server/hadoop-yarn-server-tests/target/index.html...>
Generating <https://builds.apache.org/job/Hadoop-Yarn-trunk/ws/hadoop-yarn-project/hadoop-yarn/hadoop-yarn-server/hadoop-yarn-server-tests/target/help-doc.html...>
[INFO] Building jar: <https://builds.apache.org/job/Hadoop-Yarn-trunk/ws/hadoop-yarn-project/hadoop-yarn/hadoop-yarn-server/hadoop-yarn-server-tests/target/hadoop-yarn-server-tests-3.0.0-SNAPSHOT-javadoc.jar>
[INFO] 
[INFO] --- maven-enforcer-plugin:1.3.1:enforce (depcheck) @ hadoop-yarn-server-tests ---
[INFO] 
[INFO] --- maven-checkstyle-plugin:2.12.1:checkstyle (default-cli) @ hadoop-yarn-server-tests ---
[INFO] 
[INFO] 
[INFO] --- findbugs-maven-plugin:3.0.0:findbugs (default-cli) @ hadoop-yarn-server-tests ---
[INFO] Fork Value is true
[INFO] Done FindBugs Analysis....
[INFO]                                                                         
[INFO] ------------------------------------------------------------------------
[INFO] Building hadoop-yarn-client 3.0.0-SNAPSHOT
[INFO] ------------------------------------------------------------------------
[WARNING] The POM for org.eclipse.m2e:lifecycle-mapping:jar:1.0.0 is missing, no dependency information available
[WARNING] Failed to retrieve plugin descriptor for org.eclipse.m2e:lifecycle-mapping:1.0.0: Plugin org.eclipse.m2e:lifecycle-mapping:1.0.0 or one of its dependencies could not be resolved: Failure to find org.eclipse.m2e:lifecycle-mapping:jar:1.0.0 in http://repo.maven.apache.org/maven2 was cached in the local repository, resolution will not be reattempted until the update interval of central has elapsed or updates are forced
[INFO] 
[INFO] --- maven-clean-plugin:2.5:clean (default-clean) @ hadoop-yarn-client ---
[INFO] Deleting <https://builds.apache.org/job/Hadoop-Yarn-trunk/ws/hadoop-yarn-project/hadoop-yarn/hadoop-yarn-client/target>
[INFO] 
[INFO] --- maven-antrun-plugin:1.7:run (create-testdirs) @ hadoop-yarn-client ---
[INFO] Executing tasks

main:
    [mkdir] Created dir: <https://builds.apache.org/job/Hadoop-Yarn-trunk/ws/hadoop-yarn-project/hadoop-yarn/hadoop-yarn-client/target/test-dir>
[INFO] Executed tasks
[INFO] 
[INFO] --- hadoop-maven-plugins:3.0.0-SNAPSHOT:protoc (compile-protoc) @ hadoop-yarn-client ---
[INFO] 
[INFO] --- maven-resources-plugin:2.6:resources (default-resources) @ hadoop-yarn-client ---
[INFO] Using 'UTF-8' encoding to copy filtered resources.
[INFO] skip non existing resourceDirectory <https://builds.apache.org/job/Hadoop-Yarn-trunk/ws/hadoop-yarn-project/hadoop-yarn/hadoop-yarn-client/src/main/resources>
[INFO] 
[INFO] --- maven-compiler-plugin:3.1:compile (default-compile) @ hadoop-yarn-client ---
[INFO] Changes detected - recompiling the module!
[INFO] Compiling 32 source files to <https://builds.apache.org/job/Hadoop-Yarn-trunk/ws/hadoop-yarn-project/hadoop-yarn/hadoop-yarn-client/target/classes>
[INFO] 
[INFO] --- maven-resources-plugin:2.6:testResources (default-testResources) @ hadoop-yarn-client ---
[INFO] Using 'UTF-8' encoding to copy filtered resources.
[INFO] Copying 2 resources
[INFO] 
[INFO] --- maven-compiler-plugin:3.1:testCompile (default-testCompile) @ hadoop-yarn-client ---
[INFO] Changes detected - recompiling the module!
[INFO] Compiling 23 source files to <https://builds.apache.org/job/Hadoop-Yarn-trunk/ws/hadoop-yarn-project/hadoop-yarn/hadoop-yarn-client/target/test-classes>
[INFO] 
[INFO] --- maven-surefire-plugin:2.17:test (default-test) @ hadoop-yarn-client ---
[INFO] Surefire report directory: <https://builds.apache.org/job/Hadoop-Yarn-trunk/ws/hadoop-yarn-project/hadoop-yarn/hadoop-yarn-client/target/surefire-reports>

-------------------------------------------------------
 T E S T S
-------------------------------------------------------

-------------------------------------------------------
 T E S T S
-------------------------------------------------------
Running org.apache.hadoop.yarn.client.TestApplicationClientProtocolOnHA
Tests run: 17, Failures: 0, Errors: 0, Skipped: 0, Time elapsed: 122.203 sec - in org.apache.hadoop.yarn.client.TestApplicationClientProtocolOnHA
Running org.apache.hadoop.yarn.client.TestResourceTrackerOnHA
Running org.apache.hadoop.yarn.client.api.impl.TestSharedCacheClientImpl
Tests run: 6, Failures: 0, Errors: 0, Skipped: 0, Time elapsed: 1.154 sec - in org.apache.hadoop.yarn.client.api.impl.TestSharedCacheClientImpl
Running org.apache.hadoop.yarn.client.api.impl.TestNMClient
Tests run: 2, Failures: 0, Errors: 0, Skipped: 0, Time elapsed: 72.712 sec - in org.apache.hadoop.yarn.client.api.impl.TestNMClient
Running org.apache.hadoop.yarn.client.api.impl.TestAMRMClient
Tests run: 10, Failures: 0, Errors: 0, Skipped: 0, Time elapsed: 50.442 sec - in org.apache.hadoop.yarn.client.api.impl.TestAMRMClient
Running org.apache.hadoop.yarn.client.api.impl.TestYarnClient
Tests run: 19, Failures: 0, Errors: 0, Skipped: 0, Time elapsed: 24.979 sec - in org.apache.hadoop.yarn.client.api.impl.TestYarnClient
Running org.apache.hadoop.yarn.client.api.impl.TestAHSClient
Tests run: 7, Failures: 0, Errors: 0, Skipped: 0, Time elapsed: 1.309 sec - in org.apache.hadoop.yarn.client.api.impl.TestAHSClient
Running org.apache.hadoop.yarn.client.api.impl.TestAMRMClientOnRMRestart
Tests run: 3, Failures: 0, Errors: 0, Skipped: 0, Time elapsed: 28.916 sec - in org.apache.hadoop.yarn.client.api.impl.TestAMRMClientOnRMRestart
Running org.apache.hadoop.yarn.client.api.impl.TestAMRMClientContainerRequest
Tests run: 5, Failures: 0, Errors: 0, Skipped: 0, Time elapsed: 1.526 sec - in org.apache.hadoop.yarn.client.api.impl.TestAMRMClientContainerRequest
Running org.apache.hadoop.yarn.client.api.async.impl.TestNMClientAsync
Tests run: 2, Failures: 0, Errors: 0, Skipped: 0, Time elapsed: 1.042 sec - in org.apache.hadoop.yarn.client.api.async.impl.TestNMClientAsync
Running org.apache.hadoop.yarn.client.api.async.impl.TestAMRMClientAsync
Tests run: 9, Failures: 0, Errors: 0, Skipped: 0, Time elapsed: 2.976 sec - in org.apache.hadoop.yarn.client.api.async.impl.TestAMRMClientAsync
Running org.apache.hadoop.yarn.client.TestApplicationMasterServiceProtocolOnHA
Tests run: 3, Failures: 0, Errors: 0, Skipped: 0, Time elapsed: 16.814 sec - in org.apache.hadoop.yarn.client.TestApplicationMasterServiceProtocolOnHA
Running org.apache.hadoop.yarn.client.TestGetGroups
Tests run: 6, Failures: 0, Errors: 0, Skipped: 0, Time elapsed: 3.059 sec - in org.apache.hadoop.yarn.client.TestGetGroups
Running org.apache.hadoop.yarn.client.TestYarnApiClasses
Tests run: 3, Failures: 0, Errors: 0, Skipped: 0, Time elapsed: 0.391 sec - in org.apache.hadoop.yarn.client.TestYarnApiClasses
Running org.apache.hadoop.yarn.client.TestResourceManagerAdministrationProtocolPBClientImpl
Tests run: 7, Failures: 0, Errors: 0, Skipped: 0, Time elapsed: 3.085 sec - in org.apache.hadoop.yarn.client.TestResourceManagerAdministrationProtocolPBClientImpl
Running org.apache.hadoop.yarn.client.TestRMFailover
Tests run: 5, Failures: 0, Errors: 0, Skipped: 0, Time elapsed: 41.28 sec - in org.apache.hadoop.yarn.client.TestRMFailover
Running org.apache.hadoop.yarn.client.cli.TestClusterCLI
Tests run: 4, Failures: 0, Errors: 0, Skipped: 0, Time elapsed: 1.425 sec - in org.apache.hadoop.yarn.client.cli.TestClusterCLI
Running org.apache.hadoop.yarn.client.cli.TestLogsCLI
Tests run: 5, Failures: 0, Errors: 0, Skipped: 0, Time elapsed: 1.44 sec - in org.apache.hadoop.yarn.client.cli.TestLogsCLI
Running org.apache.hadoop.yarn.client.cli.TestYarnCLI
Tests run: 25, Failures: 0, Errors: 0, Skipped: 0, Time elapsed: 2.137 sec - in org.apache.hadoop.yarn.client.cli.TestYarnCLI
Running org.apache.hadoop.yarn.client.cli.TestRMAdminCLI
Tests run: 20, Failures: 0, Errors: 0, Skipped: 0, Time elapsed: 1.886 sec - in org.apache.hadoop.yarn.client.cli.TestRMAdminCLI

Results :

Tests run: 158, Failures: 0, Errors: 0, Skipped: 0

[INFO] ------------------------------------------------------------------------
[INFO] Reactor Summary:
[INFO] 
[INFO] hadoop-yarn ....................................... SUCCESS [  3.176 s]
[INFO] hadoop-yarn-api ................................... SUCCESS [03:14 min]
[INFO] hadoop-yarn-common ................................ SUCCESS [02:57 min]
[INFO] hadoop-yarn-server ................................ SUCCESS [  0.094 s]
[INFO] hadoop-yarn-server-common ......................... SUCCESS [ 39.795 s]
[INFO] hadoop-yarn-server-nodemanager .................... SUCCESS [06:06 min]
[INFO] hadoop-yarn-server-web-proxy ...................... SUCCESS [ 23.511 s]
[INFO] hadoop-yarn-server-applicationhistoryservice ...... SUCCESS [02:52 min]
[INFO] hadoop-yarn-server-resourcemanager ................ SUCCESS [48:38 min]
[INFO] hadoop-yarn-server-tests .......................... SUCCESS [02:16 min]
[INFO] hadoop-yarn-client ................................ FAILURE [06:31 min]
[INFO] hadoop-yarn-server-sharedcachemanager ............. SKIPPED
[INFO] hadoop-yarn-applications .......................... SKIPPED
[INFO] hadoop-yarn-applications-distributedshell ......... SKIPPED
[INFO] hadoop-yarn-applications-unmanaged-am-launcher .... SKIPPED
[INFO] hadoop-yarn-site .................................. SKIPPED
[INFO] hadoop-yarn-registry .............................. SKIPPED
[INFO] hadoop-yarn-project ............................... SKIPPED
[INFO] ------------------------------------------------------------------------
[INFO] BUILD FAILURE
[INFO] ------------------------------------------------------------------------
[INFO] Total time: 01:13 h
[INFO] Finished at: 2015-04-08T11:45:44+00:00
[INFO] Final Memory: 72M/927M
[INFO] ------------------------------------------------------------------------
[ERROR] Failed to execute goal org.apache.maven.plugins:maven-surefire-plugin:2.17:test (default-test) on project hadoop-yarn-client: ExecutionException: java.lang.RuntimeException: The forked VM terminated without properly saying goodbye. VM crash or System.exit called?
[ERROR] Command was /bin/sh -c cd <https://builds.apache.org/job/Hadoop-Yarn-trunk/ws/hadoop-yarn-project/hadoop-yarn/hadoop-yarn-client> && /home/jenkins/tools/java/jdk1.7.0_55/jre/bin/java -Xmx4096m -XX:MaxPermSize=768m -XX:+HeapDumpOnOutOfMemoryError -jar <https://builds.apache.org/job/Hadoop-Yarn-trunk/ws/hadoop-yarn-project/hadoop-yarn/hadoop-yarn-client/target/surefire/surefirebooter7059300463778829015.jar> <https://builds.apache.org/job/Hadoop-Yarn-trunk/ws/hadoop-yarn-project/hadoop-yarn/hadoop-yarn-client/target/surefire/surefire6013390029598605560tmp> <https://builds.apache.org/job/Hadoop-Yarn-trunk/ws/hadoop-yarn-project/hadoop-yarn/hadoop-yarn-client/target/surefire/surefire_2712382416913460720718tmp>
[ERROR] -> [Help 1]
[ERROR] 
[ERROR] To see the full stack trace of the errors, re-run Maven with the -e switch.
[ERROR] Re-run Maven using the -X switch to enable full debug logging.
[ERROR] 
[ERROR] For more information about the errors and possible solutions, please read the following articles:
[ERROR] [Help 1] http://cwiki.apache.org/confluence/display/MAVEN/MojoFailureException
[ERROR] 
[ERROR] After correcting the problems, you can resume the build with the command
[ERROR]   mvn <goals> -rf :hadoop-yarn-client
Build step 'Execute shell' marked build as failure
Archiving artifacts
Recording test results
Updating HADOOP-11801
Updating HDFS-8080
Updating YARN-3110
Updating HDFS-8038
Updating YARN-3457
Updating HDFS-8079
Updating YARN-3294
Updating HDFS-8073
Updating HADOOP-11717
Updating HDFS-8049
Updating HDFS-5215
Updating YARN-3429
Updating HADOOP-11796