You are viewing a plain text version of this content. The canonical link for it is here.
Posted to builds@hbase.apache.org by Apache Jenkins Server <je...@builds.apache.org> on 2014/03/27 06:03:50 UTC

Build failed in Jenkins: HBase-0.98-on-Hadoop-1.1 #237

See <https://builds.apache.org/job/HBase-0.98-on-Hadoop-1.1/237/changes>

Changes:

[jeffreyz] HBASE-10833: Region assignment may fail during cluster start up

------------------------------------------
[...truncated 4789 lines...]
[INFO] HBase - Hadoop One Compatibility .................. SUCCESS [4.031s]
[INFO] HBase - Prefix Tree ............................... SUCCESS [8.872s]
[INFO] HBase - Server .................................... FAILURE [2:46:36.805s]
[INFO] HBase - Testing Util .............................. SKIPPED
[INFO] HBase - Thrift .................................... SKIPPED
[INFO] HBase - Shell ..................................... SKIPPED
[INFO] HBase - Integration Tests ......................... SKIPPED
[INFO] HBase - Examples .................................. SKIPPED
[INFO] HBase - Assembly .................................. SKIPPED
[INFO] ------------------------------------------------------------------------
[INFO] BUILD FAILURE
[INFO] ------------------------------------------------------------------------
[INFO] Total time: 2:49:07.840s
[INFO] Finished at: Thu Mar 27 05:00:12 UTC 2014
[INFO] Final Memory: 35M/982M
[INFO] ------------------------------------------------------------------------
[ERROR] Failed to execute goal org.apache.maven.plugins:maven-surefire-plugin:2.12-TRUNK-HBASE-2:test (secondPartTestsExecution) on project hbase-server: There are test failures.
[ERROR] 
[ERROR] Please refer to <https://builds.apache.org/job/HBase-0.98-on-Hadoop-1.1/ws/0.98-hadoop1.1/hbase-server/target/surefire-reports> for the individual test results.
[ERROR] -> [Help 1]
[ERROR] 
[ERROR] To see the full stack trace of the errors, re-run Maven with the -e switch.
[ERROR] Re-run Maven using the -X switch to enable full debug logging.
[ERROR] 
[ERROR] For more information about the errors and possible solutions, please read the following articles:
[ERROR] [Help 1] http://cwiki.apache.org/confluence/display/MAVEN/MojoFailureException
[ERROR] 
[ERROR] After correcting the problems, you can resume the build with the command
[ERROR]   mvn <goals> -rf :hbase-server
Build step 'Invoke top-level Maven targets' marked build as failure
Performing Post build task...
Match found for :.* : True
Logical operation result is TRUE
Running script  :   ZOMBIE_TESTS_COUNT=`jps | grep surefirebooter | wc -l`
  if [[ $ZOMBIE_TESTS_COUNT != 0 ]] ; then
    #It seems sometimes the tests are not dying immediately. Let's give them 10s
    echo "Suspicious java process found - waiting 10s to see if there are just slow to stop"
    sleep 10
    ZOMBIE_TESTS_COUNT=`jps | grep surefirebooter | wc -l`
    if [[ $ZOMBIE_TESTS_COUNT != 0 ]] ; then
      echo "There are $ZOMBIE_TESTS_COUNT zombie tests, they should have been killed by surefire but survived"
      echo "************ BEGIN zombies jstack extract"
      ZB_STACK=`jps | grep surefirebooter | cut -d ' ' -f 1 | xargs -n 1 jstack | grep ".test" | grep "\.java"`
      jps | grep surefirebooter | cut -d ' ' -f 1 | xargs -n 1 jstack
      echo "************ END  zombies jstack extract"
      JIRA_COMMENT="$JIRA_COMMENT

     {color:red}-1 core zombie tests{color}.  There are ${ZOMBIE_TESTS_COUNT} zombie test(s): ${ZB_STACK}"
      BAD=1
      jps | grep surefirebooter | cut -d ' ' -f 1 | xargs kill -9
    else
      echo "We're ok: there is no zombie test, but some tests took some time to stop"
    fi
  else
    echo "We're ok: there is no zombie test"
  fi
[HBase-0.98-on-Hadoop-1.1] $ /bin/bash -xe /tmp/hudson817256624199185715.sh
++ jps
++ grep surefirebooter
++ wc -l
+ ZOMBIE_TESTS_COUNT=3
+ [[ 3 != 0 ]]
+ echo 'Suspicious java process found - waiting 10s to see if there are just slow to stop'
Suspicious java process found - waiting 10s to see if there are just slow to stop
+ sleep 10
++ grep surefirebooter
++ wc -l
++ jps
+ ZOMBIE_TESTS_COUNT=3
+ [[ 3 != 0 ]]
+ echo 'There are 3 zombie tests, they should have been killed by surefire but survived'
There are 3 zombie tests, they should have been killed by surefire but survived
+ echo '************ BEGIN zombies jstack extract'
************ BEGIN zombies jstack extract
++ jps
++ cut -d ' ' -f 1
++ xargs -n 1 jstack
++ grep .test
++ grep '\.java'
++ grep surefirebooter
15097: Unable to open socket file: target process not responding or HotSpot VM not loaded
The -F option can be used when the target process is not responding
20747: Unable to open socket file: target process not responding or HotSpot VM not loaded
The -F option can be used when the target process is not responding
+ ZB_STACK='	at org.apache.james.smtpserver.SMTPServerTest.testEhloResolv(SMTPServerTest.java:865)'
+ xargs -n 1 jstack
+ jps
+ grep surefirebooter
+ cut -d ' ' -f 1
2014-03-27 05:00:40
Full thread dump OpenJDK 64-Bit Server VM (20.0-b12 mixed mode):

"Attach Listener" daemon prio=10 tid=0x00007ff540001000 nid=0x2334 waiting on condition [0x0000000000000000]
   java.lang.Thread.State: RUNNABLE

"New I/O server worker #10-1" prio=10 tid=0x00007ff4f8010000 nid=0x119b runnable [0x00007ff5831d0000]
   java.lang.Thread.State: RUNNABLE
	at sun.nio.ch.EPollArrayWrapper.epollWait(Native Method)
	at sun.nio.ch.EPollArrayWrapper.poll(EPollArrayWrapper.java:228)
	at sun.nio.ch.EPollSelectorImpl.doSelect(EPollSelectorImpl.java:83)
	at sun.nio.ch.SelectorImpl.lockAndDoSelect(SelectorImpl.java:87)
	- locked <0x00000000f71c8838> (a sun.nio.ch.Util$1)
	- locked <0x00000000f71c8828> (a java.util.Collections$UnmodifiableSet)
	- locked <0x00000000f71c8620> (a sun.nio.ch.EPollSelectorImpl)
	at sun.nio.ch.SelectorImpl.select(SelectorImpl.java:98)
	at org.jboss.netty.channel.socket.nio.SelectorUtil.select(SelectorUtil.java:33)
	at org.jboss.netty.channel.socket.nio.NioWorker.run(NioWorker.java:157)
	at org.jboss.netty.util.ThreadRenamingRunnable.run(ThreadRenamingRunnable.java:102)
	at org.jboss.netty.util.internal.DeadLockProofWorker$1.run(DeadLockProofWorker.java:42)
	at java.util.concurrent.ThreadPoolExecutor.runWorker(ThreadPoolExecutor.java:1146)
	at java.util.concurrent.ThreadPoolExecutor$Worker.run(ThreadPoolExecutor.java:615)
	at java.lang.Thread.run(Thread.java:701)

"Hashed wheel timer #10" prio=10 tid=0x00007ff4f8001000 nid=0x1199 sleeping[0x00007ff582ccb000]
   java.lang.Thread.State: TIMED_WAITING (sleeping)
	at java.lang.Thread.sleep(Native Method)
	at org.jboss.netty.util.HashedWheelTimer$Worker.waitForNextTick(HashedWheelTimer.java:455)
	at org.jboss.netty.util.HashedWheelTimer$Worker.run(HashedWheelTimer.java:372)
	at org.jboss.netty.util.ThreadRenamingRunnable.run(ThreadRenamingRunnable.java:102)
	at java.lang.Thread.run(Thread.java:701)

"New I/O server boss #10 ([id: 0x79b66b06, /127.0.0.1:8010])" prio=10 tid=0x00007ff58c3de000 nid=0x1198 runnable [0x00007ff5827c6000]
   java.lang.Thread.State: RUNNABLE
	at sun.nio.ch.EPollArrayWrapper.epollWait(Native Method)
	at sun.nio.ch.EPollArrayWrapper.poll(EPollArrayWrapper.java:228)
	at sun.nio.ch.EPollSelectorImpl.doSelect(EPollSelectorImpl.java:83)
	at sun.nio.ch.SelectorImpl.lockAndDoSelect(SelectorImpl.java:87)
	- locked <0x00000000f712b3f0> (a sun.nio.ch.Util$1)
	- locked <0x00000000f712b3e0> (a java.util.Collections$UnmodifiableSet)
	- locked <0x00000000f712b1d8> (a sun.nio.ch.EPollSelectorImpl)
	at sun.nio.ch.SelectorImpl.select(SelectorImpl.java:98)
	at org.jboss.netty.channel.socket.nio.NioServerSocketPipelineSink$Boss.run(NioServerSocketPipelineSink.java:232)
	at org.jboss.netty.util.ThreadRenamingRunnable.run(ThreadRenamingRunnable.java:102)
	at org.jboss.netty.util.internal.DeadLockProofWorker$1.run(DeadLockProofWorker.java:42)
	at java.util.concurrent.ThreadPoolExecutor.runWorker(ThreadPoolExecutor.java:1146)
	at java.util.concurrent.ThreadPoolExecutor$Worker.run(ThreadPoolExecutor.java:615)
	at java.lang.Thread.run(Thread.java:701)

"Low Memory Detector" daemon prio=10 tid=0x00007ff58c0a6800 nid=0x1100 runnable [0x0000000000000000]
   java.lang.Thread.State: RUNNABLE

"C2 CompilerThread1" daemon prio=10 tid=0x00007ff58c0a4800 nid=0x10ff waiting on condition [0x0000000000000000]
   java.lang.Thread.State: RUNNABLE

"C2 CompilerThread0" daemon prio=10 tid=0x00007ff58c09f800 nid=0x10fe waiting on condition [0x0000000000000000]
   java.lang.Thread.State: RUNNABLE

"Signal Dispatcher" daemon prio=10 tid=0x00007ff58c09e000 nid=0x10fd runnable [0x0000000000000000]
   java.lang.Thread.State: RUNNABLE

"Finalizer" daemon prio=10 tid=0x00007ff58c080000 nid=0x10fc in Object.wait() [0x00007ff58835f000]
   java.lang.Thread.State: WAITING (on object monitor)
	at java.lang.Object.wait(Native Method)
	- waiting on <0x00000000fe078dd0> (a java.lang.ref.ReferenceQueue$Lock)
	at java.lang.ref.ReferenceQueue.remove(ReferenceQueue.java:133)
	- locked <0x00000000fe078dd0> (a java.lang.ref.ReferenceQueue$Lock)
	at java.lang.ref.ReferenceQueue.remove(ReferenceQueue.java:149)
	at java.lang.ref.Finalizer$FinalizerThread.run(Finalizer.java:189)

"Reference Handler" daemon prio=10 tid=0x00007ff58c07e000 nid=0x10fb in Object.wait() [0x00007ff588460000]
   java.lang.Thread.State: WAITING (on object monitor)
	at java.lang.Object.wait(Native Method)
	- waiting on <0x00000000fe0480b0> (a java.lang.ref.Reference$Lock)
	at java.lang.Object.wait(Object.java:502)
	at java.lang.ref.Reference$ReferenceHandler.run(Reference.java:133)
	- locked <0x00000000fe0480b0> (a java.lang.ref.Reference$Lock)

"main" prio=10 tid=0x00007ff58c008000 nid=0x10f1 runnable [0x00007ff593dce000]
   java.lang.Thread.State: RUNNABLE
	at java.net.SocketInputStream.socketRead0(Native Method)
	at java.net.SocketInputStream.read(SocketInputStream.java:146)
	at sun.nio.cs.StreamDecoder.readBytes(StreamDecoder.java:282)
	at sun.nio.cs.StreamDecoder.implRead(StreamDecoder.java:324)
	at sun.nio.cs.StreamDecoder.read(StreamDecoder.java:176)
	- locked <0x00000000f712d7f0> (a java.io.InputStreamReader)
	at java.io.InputStreamReader.read(InputStreamReader.java:184)
	at java.io.BufferedReader.fill(BufferedReader.java:153)
	at java.io.BufferedReader.read(BufferedReader.java:174)
	- locked <0x00000000f712d7f0> (a java.io.InputStreamReader)
	at org.apache.commons.net.io.CRLFLineReader.readLine(CRLFLineReader.java:58)
	- locked <0x00000000f712d7f0> (a java.io.InputStreamReader)
	at org.apache.commons.net.smtp.SMTP.__getReply(SMTP.java:196)
	at org.apache.commons.net.smtp.SMTP.__sendCommand(SMTP.java:171)
	at org.apache.commons.net.smtp.SMTP.sendCommand(SMTP.java:315)
	at org.apache.james.smtpserver.SMTPServerTest.doTestHeloEhloResolv(SMTPServerTest.java:622)
	at org.apache.james.smtpserver.SMTPServerTest.testEhloResolv(SMTPServerTest.java:865)
	at sun.reflect.NativeMethodAccessorImpl.invoke0(Native Method)
	at sun.reflect.NativeMethodAccessorImpl.invoke(NativeMethodAccessorImpl.java:57)
	at sun.reflect.DelegatingMethodAccessorImpl.invoke(DelegatingMethodAccessorImpl.java:43)
	at java.lang.reflect.Method.invoke(Method.java:622)
	at org.junit.runners.model.FrameworkMethod$1.runReflectiveCall(FrameworkMethod.java:47)
	at org.junit.internal.runners.model.ReflectiveCallable.run(ReflectiveCallable.java:12)
	at org.junit.runners.model.FrameworkMethod.invokeExplosively(FrameworkMethod.java:44)
	at org.junit.internal.runners.statements.InvokeMethod.evaluate(InvokeMethod.java:17)
	at org.junit.internal.runners.statements.RunBefores.evaluate(RunBefores.java:26)
	at org.junit.internal.runners.statements.RunAfters.evaluate(RunAfters.java:27)
	at org.junit.runners.ParentRunner.runLeaf(ParentRunner.java:271)
	at org.junit.runners.BlockJUnit4ClassRunner.runChild(BlockJUnit4ClassRunner.java:70)
	at org.junit.runners.BlockJUnit4ClassRunner.runChild(BlockJUnit4ClassRunner.java:50)
	at org.junit.runners.ParentRunner$3.run(ParentRunner.java:238)
	at org.junit.runners.ParentRunner$1.schedule(ParentRunner.java:63)
	at org.junit.runners.ParentRunner.runChildren(ParentRunner.java:236)
	at org.junit.runners.ParentRunner.access$000(ParentRunner.java:53)
	at org.junit.runners.ParentRunner$2.evaluate(ParentRunner.java:229)
	at org.junit.runners.ParentRunner.run(ParentRunner.java:309)
	at org.apache.maven.surefire.junit4.JUnit4Provider.execute(JUnit4Provider.java:264)
	at org.apache.maven.surefire.junit4.JUnit4Provider.executeTestSet(JUnit4Provider.java:153)
	at org.apache.maven.surefire.junit4.JUnit4Provider.invoke(JUnit4Provider.java:124)
	at sun.reflect.NativeMethodAccessorImpl.invoke0(Native Method)
	at sun.reflect.NativeMethodAccessorImpl.invoke(NativeMethodAccessorImpl.java:57)
	at sun.reflect.DelegatingMethodAccessorImpl.invoke(DelegatingMethodAccessorImpl.java:43)
	at java.lang.reflect.Method.invoke(Method.java:622)
	at org.apache.maven.surefire.util.ReflectionUtils.invokeMethodWithArray2(ReflectionUtils.java:208)
	at org.apache.maven.surefire.booter.ProviderFactory$ProviderProxy.invoke(ProviderFactory.java:158)
	at org.apache.maven.surefire.booter.ProviderFactory.invokeProvider(ProviderFactory.java:86)
	at org.apache.maven.surefire.booter.ForkedBooter.runSuitesInProcess(ForkedBooter.java:153)
	at org.apache.maven.surefire.booter.ForkedBooter.main(ForkedBooter.java:95)

"VM Thread" prio=10 tid=0x00007ff58c079800 nid=0x10fa runnable 

"GC task thread#0 (ParallelGC)" prio=10 tid=0x00007ff58c013000 nid=0x10f2 runnable 

"GC task thread#1 (ParallelGC)" prio=10 tid=0x00007ff58c014800 nid=0x10f3 runnable 

"GC task thread#2 (ParallelGC)" prio=10 tid=0x00007ff58c016800 nid=0x10f4 runnable 

"GC task thread#3 (ParallelGC)" prio=10 tid=0x00007ff58c018800 nid=0x10f5 runnable 

"GC task thread#4 (ParallelGC)" prio=10 tid=0x00007ff58c01a000 nid=0x10f6 runnable 

"GC task thread#5 (ParallelGC)" prio=10 tid=0x00007ff58c01c000 nid=0x10f7 runnable 

"GC task thread#6 (ParallelGC)" prio=10 tid=0x00007ff58c01e000 nid=0x10f8 runnable 

"GC task thread#7 (ParallelGC)" prio=10 tid=0x00007ff58c01f800 nid=0x10f9 runnable 

"VM Periodic Task Thread" prio=10 tid=0x00007ff58c0b1000 nid=0x1101 waiting on condition 

JNI global references: 1200

15097: Unable to open socket file: target process not responding or HotSpot VM not loaded
The -F option can be used when the target process is not responding
20747: Unable to open socket file: target process not responding or HotSpot VM not loaded
The -F option can be used when the target process is not responding
POST BUILD TASK : FAILURE
END OF POST BUILD TASK : 0
Archiving artifacts
Recording test results
Updating HBASE-10833