You are viewing a plain text version of this content. The canonical link for it is here.
Posted to issues@bookkeeper.apache.org by Apache Jenkins Server <je...@builds.apache.org> on 2019/06/30 14:21:05 UTC
Build failed in Jenkins: bookkeeper_release_branch_48_java9 #318
See <https://builds.apache.org/job/bookkeeper_release_branch_48_java9/318/display/redirect>
------------------------------------------
[...truncated 917.28 KB...]
2019-06-30T14:18:19.134 [INFO]
2019-06-30T14:18:19.134 [INFO] >>> maven-source-plugin:2.2.1:jar (attach-sources) > generate-sources @ distributedlog-core >>>
2019-06-30T14:18:19.176 [INFO]
2019-06-30T14:18:19.176 [INFO] --- maven-checkstyle-plugin:3.0.0:check (checkstyle) @ distributedlog-core ---
2019-06-30T14:18:33.259 [INFO] Starting audit...
Audit done.
[WARNING] Failed to getClass for org.apache.maven.plugin.source.SourceJarMojo
2019-06-30T14:18:33.583 [INFO]
2019-06-30T14:18:33.583 [INFO] <<< maven-source-plugin:2.2.1:jar (attach-sources) < generate-sources @ distributedlog-core <<<
2019-06-30T14:18:33.583 [INFO]
2019-06-30T14:18:33.584 [INFO]
2019-06-30T14:18:33.584 [INFO] --- maven-source-plugin:2.2.1:jar (attach-sources) @ distributedlog-core ---
2019-06-30T14:18:33.660 [INFO] Building jar: <https://builds.apache.org/job/bookkeeper_release_branch_48_java9/ws/stream/distributedlog/core/target/distributedlog-core-4.8.3-SNAPSHOT-sources.jar>
2019-06-30T14:18:34.011 [INFO]
2019-06-30T14:18:34.011 [INFO] --- maven-shade-plugin:3.1.0:shade (shade-thrift) @ distributedlog-core ---
2019-06-30T14:18:34.016 [INFO] Excluding org.apache.distributedlog:distributedlog-protocol:jar:4.8.3-SNAPSHOT from the shaded jar.
2019-06-30T14:18:34.016 [INFO] Excluding org.apache.distributedlog:distributedlog-common:jar:4.8.3-SNAPSHOT from the shaded jar.
2019-06-30T14:18:34.016 [INFO] Excluding org.apache.zookeeper:zookeeper:jar:3.4.13 from the shaded jar.
2019-06-30T14:18:34.016 [INFO] Excluding jline:jline:jar:0.9.94 from the shaded jar.
2019-06-30T14:18:34.016 [INFO] Excluding org.apache.yetus:audience-annotations:jar:0.5.0 from the shaded jar.
2019-06-30T14:18:34.016 [INFO] Including org.apache.thrift:libthrift:jar:0.9.3 in the shaded jar.
2019-06-30T14:18:34.016 [INFO] Excluding org.apache.httpcomponents:httpclient:jar:4.4.1 from the shaded jar.
2019-06-30T14:18:34.016 [INFO] Excluding org.apache.httpcomponents:httpcore:jar:4.4.1 from the shaded jar.
2019-06-30T14:18:34.016 [INFO] Excluding org.apache.bookkeeper:bookkeeper-server:jar:4.8.3-SNAPSHOT from the shaded jar.
2019-06-30T14:18:34.016 [INFO] Excluding org.apache.bookkeeper:bookkeeper-common:jar:4.8.3-SNAPSHOT from the shaded jar.
2019-06-30T14:18:34.016 [INFO] Excluding org.apache.bookkeeper:bookkeeper-proto:jar:4.8.3-SNAPSHOT from the shaded jar.
2019-06-30T14:18:34.016 [INFO] Excluding com.google.protobuf:protobuf-java:jar:3.5.1 from the shaded jar.
2019-06-30T14:18:34.016 [INFO] Excluding org.apache.bookkeeper:bookkeeper-tools-framework:jar:4.8.3-SNAPSHOT from the shaded jar.
2019-06-30T14:18:34.016 [INFO] Excluding org.rocksdb:rocksdbjni:jar:5.13.1 from the shaded jar.
2019-06-30T14:18:34.016 [INFO] Excluding io.netty:netty-all:jar:4.1.22.Final from the shaded jar.
2019-06-30T14:18:34.016 [INFO] Excluding io.netty:netty-tcnative-boringssl-static:jar:2.0.7.Final from the shaded jar.
2019-06-30T14:18:34.017 [INFO] Excluding org.apache.bookkeeper.http:http-server:jar:4.8.3-SNAPSHOT from the shaded jar.
2019-06-30T14:18:34.017 [INFO] Excluding org.apache.bookkeeper:circe-checksum:jar:4.8.3-SNAPSHOT from the shaded jar.
2019-06-30T14:18:34.017 [INFO] Excluding commons-cli:commons-cli:jar:1.2 from the shaded jar.
2019-06-30T14:18:34.017 [INFO] Excluding commons-codec:commons-codec:jar:1.6 from the shaded jar.
2019-06-30T14:18:34.017 [INFO] Excluding commons-io:commons-io:jar:2.4 from the shaded jar.
2019-06-30T14:18:34.017 [INFO] Excluding org.apache.commons:commons-lang3:jar:3.6 from the shaded jar.
2019-06-30T14:18:34.017 [INFO] Excluding org.apache.commons:commons-collections4:jar:4.1 from the shaded jar.
2019-06-30T14:18:34.017 [INFO] Excluding com.beust:jcommander:jar:1.48 from the shaded jar.
2019-06-30T14:18:34.017 [INFO] Excluding net.java.dev.jna:jna:jar:3.2.7 from the shaded jar.
2019-06-30T14:18:34.017 [INFO] Excluding org.apache.bookkeeper.stats:bookkeeper-stats-api:jar:4.8.3-SNAPSHOT from the shaded jar.
2019-06-30T14:18:34.017 [INFO] Excluding com.google.guava:guava:jar:21.0 from the shaded jar.
2019-06-30T14:18:34.017 [INFO] Excluding com.fasterxml.jackson.core:jackson-core:jar:2.8.9 from the shaded jar.
2019-06-30T14:18:34.017 [INFO] Excluding com.fasterxml.jackson.core:jackson-databind:jar:2.8.9 from the shaded jar.
2019-06-30T14:18:34.017 [INFO] Excluding com.fasterxml.jackson.core:jackson-annotations:jar:2.8.9 from the shaded jar.
2019-06-30T14:18:34.017 [INFO] Excluding commons-lang:commons-lang:jar:2.6 from the shaded jar.
2019-06-30T14:18:34.017 [INFO] Excluding net.jpountz.lz4:lz4:jar:1.3.0 from the shaded jar.
2019-06-30T14:18:34.017 [INFO] Excluding org.slf4j:slf4j-api:jar:1.7.25 from the shaded jar.
2019-06-30T14:18:34.017 [INFO] Excluding commons-configuration:commons-configuration:jar:1.10 from the shaded jar.
2019-06-30T14:18:34.017 [INFO] Excluding commons-logging:commons-logging:jar:1.1.1 from the shaded jar.
2019-06-30T14:18:34.017 [INFO] Minimizing jar org.apache.distributedlog:distributedlog-core:jar:4.8.3-SNAPSHOT
2019-06-30T14:18:38.550 [INFO] Minimized 751 -> 616 (82%)
2019-06-30T14:18:38.550 [INFO] Replacing original artifact with shaded artifact.
2019-06-30T14:18:38.550 [INFO] Replacing <https://builds.apache.org/job/bookkeeper_release_branch_48_java9/ws/stream/distributedlog/core/target/distributedlog-core-4.8.3-SNAPSHOT.jar> with <https://builds.apache.org/job/bookkeeper_release_branch_48_java9/ws/stream/distributedlog/core/target/distributedlog-core-4.8.3-SNAPSHOT-shaded.jar>
2019-06-30T14:18:38.550 [INFO] Dependency-reduced POM written at: <https://builds.apache.org/job/bookkeeper_release_branch_48_java9/ws/stream/distributedlog/core/dependency-reduced-pom.xml>
2019-06-30T14:18:38.857 [INFO]
2019-06-30T14:18:38.857 [INFO] --- license-maven-plugin:1.6:update-file-header (update-pom-license) @ distributedlog-core ---
2019-06-30T14:18:38.867 [INFO] Will search files to update from root <https://builds.apache.org/job/bookkeeper_release_branch_48_java9/ws/stream/distributedlog/core>
2019-06-30T14:18:38.951 [INFO] - adding license header on file <https://builds.apache.org/job/bookkeeper_release_branch_48_java9/ws/stream/distributedlog/core/dependency-reduced-pom.xml>
2019-06-30T14:18:38.953 [INFO] Scan 1 file header done in 8.49ms.
2019-06-30T14:18:38.953 [INFO]
* add header on 1 file.
2019-06-30T14:18:39.115 [INFO]
2019-06-30T14:18:39.115 [INFO] >>> spotbugs-maven-plugin:3.1.0-RC6:check (default-cli) > :spotbugs @ distributedlog-core >>>
2019-06-30T14:18:39.133 [INFO]
2019-06-30T14:18:39.133 [INFO] --- spotbugs-maven-plugin:3.1.0-RC6:spotbugs (spotbugs) @ distributedlog-core ---
2019-06-30T14:18:39.154 [INFO] Fork Value is true
[java] /usr/local/asfpackages/java/jdk-9.0.1/bin/java: error while loading shared libraries: libjli.so: cannot open shared object file: No such file or directory
[JENKINS] Archiving disabled
[JENKINS] Archiving disabled
[JENKINS] Archiving disabled
[JENKINS] Archiving disabled
[JENKINS] Archiving disabled
[JENKINS] Archiving disabled
[JENKINS] Archiving disabled
[JENKINS] Archiving disabled
[JENKINS] Archiving disabled
[JENKINS] Archiving disabled
[JENKINS] Archiving disabled
[JENKINS] Archiving disabled
[JENKINS] Archiving disabled
[JENKINS] Archiving disabled
[JENKINS] Archiving disabled
[JENKINS] Archiving disabled
[JENKINS] Archiving disabled
[JENKINS] Archiving disabled
[JENKINS] Archiving disabled
[JENKINS] Archiving disabled
[JENKINS] Archiving disabled
[JENKINS] Archiving disabled
[JENKINS] Archiving disabled
[JENKINS] Archiving disabled
[JENKINS] Archiving disabled
[JENKINS] Archiving disabled
[JENKINS] Archiving disabled
[JENKINS] Archiving disabled
[JENKINS] Archiving disabled
[JENKINS] Archiving disabled
[JENKINS] Archiving disabled
[JENKINS] Archiving disabled
[JENKINS] Archiving disabled
[JENKINS] Archiving disabled
[JENKINS] Archiving disabled
[JENKINS] Archiving disabled
[JENKINS] Archiving disabled
[JENKINS] Archiving disabled
[JENKINS] Archiving disabled
[JENKINS] Archiving disabled
[JENKINS] Archiving disabled
[JENKINS] Archiving disabled
[JENKINS] Archiving disabled
[JENKINS] Archiving disabled
[JENKINS] Archiving disabled
[JENKINS] Archiving disabled
[JENKINS] Archiving disabled
[JENKINS] Archiving disabled
[JENKINS] Archiving disabled
[JENKINS] Archiving disabled
[JENKINS] Archiving disabled
[JENKINS] Archiving disabled
[JENKINS] Archiving disabled
[JENKINS] Archiving disabled
[JENKINS] Archiving disabled
[JENKINS] Archiving disabled
[JENKINS] Archiving disabled
[JENKINS] Archiving disabled
[JENKINS] Archiving disabled
[JENKINS] Archiving disabled
[JENKINS] Archiving disabled
[JENKINS] Archiving disabled
[JENKINS] Archiving disabled
[JENKINS] Archiving disabled
[JENKINS] Archiving disabled
[JENKINS] Archiving disabled
[JENKINS] Archiving disabled
[JENKINS] Archiving disabled
[JENKINS] Archiving disabled
[JENKINS] Archiving disabled
[JENKINS] Archiving disabled
[JENKINS] Archiving disabled
[JENKINS] Archiving disabled
[JENKINS] Archiving disabled
[JENKINS] Archiving disabled
[JENKINS] Archiving disabled
[JENKINS] Archiving disabled
[JENKINS] Archiving disabled
[JENKINS] Archiving disabled
[JENKINS] Archiving disabled
2019-06-30T14:19:31.658 [INFO] ------------------------------------------------------------------------
2019-06-30T14:19:31.658 [INFO] Reactor Summary:
2019-06-30T14:19:31.658 [INFO]
2019-06-30T14:19:31.659 [INFO] Apache BookKeeper :: Parent ........................ SUCCESS [ 15.763 s]
2019-06-30T14:19:31.659 [INFO] Apache BookKeeper :: Build Tools ................... SUCCESS [ 6.234 s]
2019-06-30T14:19:31.659 [INFO] Apache BookKeeper :: Circe Checksum Library ........ SUCCESS [01:37 min]
2019-06-30T14:19:31.659 [INFO] Apache BookKeeper :: Stats API ..................... SUCCESS [ 12.972 s]
2019-06-30T14:19:31.659 [INFO] Apache BookKeeper :: Common ........................ SUCCESS [ 33.966 s]
2019-06-30T14:19:31.659 [INFO] Apache BookKeeper :: Protocols ..................... SUCCESS [ 24.074 s]
2019-06-30T14:19:31.659 [INFO] Apache BookKeeper :: Tools :: Parent ............... SUCCESS [ 2.245 s]
2019-06-30T14:19:31.659 [INFO] Apache BookKeeper :: Tools :: Framework ............ SUCCESS [ 12.848 s]
2019-06-30T14:19:31.659 [INFO] Apache BookKeeper :: Http :: Http Server ........... SUCCESS [ 8.637 s]
2019-06-30T14:19:31.659 [INFO] Apache BookKeeper :: Server ........................ SUCCESS [ 01:38 h]
2019-06-30T14:19:31.659 [INFO] Apache BookKeeper :: Benchmark ..................... SUCCESS [01:48 min]
2019-06-30T14:19:31.659 [INFO] Apache BookKeeper :: Stats Providers :: Twitter Finagle Stats SUCCESS [ 11.799 s]
2019-06-30T14:19:31.659 [INFO] Apache BookKeeper :: Stats Providers :: Twitter Science Stats SUCCESS [ 39.299 s]
2019-06-30T14:19:31.660 [INFO] Apache BookKeeper :: Stats Providers :: Twitter Ostrich Stats SUCCESS [ 11.400 s]
2019-06-30T14:19:31.660 [INFO] Apache BookKeeper :: Stats Providers :: Codahale Metrics SUCCESS [ 13.274 s]
2019-06-30T14:19:31.660 [INFO] Apache BookKeeper :: Stats Providers :: Prometheus . SUCCESS [ 14.854 s]
2019-06-30T14:19:31.660 [INFO] Apache BookKeeper :: Stats Providers ............... SUCCESS [ 2.153 s]
2019-06-30T14:19:31.660 [INFO] Apache BookKeeper :: Bookkeeper Http :: Twitter Http Server SUCCESS [ 17.442 s]
2019-06-30T14:19:31.660 [INFO] Apache BookKeeper :: Bookkeeper Http :: Vertx Http Server SUCCESS [ 13.974 s]
2019-06-30T14:19:31.660 [INFO] Apache BookKeeper :: Http .......................... SUCCESS [ 2.299 s]
2019-06-30T14:19:31.660 [INFO] Apache BookKeeper :: Shaded :: Parent .............. SUCCESS [ 2.258 s]
2019-06-30T14:19:31.660 [INFO] Apache BookKeeper :: Shaded :: bookkeeper-server-shaded SUCCESS [ 14.319 s]
2019-06-30T14:19:31.660 [INFO] Apache BookKeeper :: Shaded :: bookkeeper-server-tests-shaded SUCCESS [ 5.531 s]
2019-06-30T14:19:31.660 [INFO] Apache BookKeeper :: DistributedLog :: Parent ...... SUCCESS [ 2.257 s]
2019-06-30T14:19:31.660 [INFO] Apache BookKeeper :: DistributedLog :: Common ...... SUCCESS [ 16.497 s]
2019-06-30T14:19:31.660 [INFO] Apache BookKeeper :: DistributedLog :: Protocol .... SUCCESS [ 14.607 s]
2019-06-30T14:19:31.661 [INFO] Apache BookKeeper :: DistributedLog :: Core Library FAILURE [14:58 min]
2019-06-30T14:19:31.661 [INFO] Apache BookKeeper :: Shaded :: distributedlog-core-shaded SKIPPED
2019-06-30T14:19:31.661 [INFO] Apache BookKeeper :: Tests ......................... SKIPPED
2019-06-30T14:19:31.661 [INFO] Apache BookKeeper :: Tests :: Test Shaded Jars ..... SKIPPED
2019-06-30T14:19:31.661 [INFO] Apache BookKeeper :: Tests :: bookkeeper-server-shaded test SKIPPED
2019-06-30T14:19:31.661 [INFO] Apache BookKeeper :: Tests :: bookkeeper-server-tests-shaded test SKIPPED
2019-06-30T14:19:31.661 [INFO] Apache BookKeeper :: Tests :: distributedlog-core-shaded test SKIPPED
2019-06-30T14:19:31.661 [INFO] Apache BookKeeper :: Tests :: Docker Images ........ SKIPPED
2019-06-30T14:19:31.661 [INFO] Apache BookKeeper :: Tests :: Docker Images :: All Released Versions SKIPPED
2019-06-30T14:19:31.661 [INFO] Apache BookKeeper :: Tools :: Ledger ............... SKIPPED
2019-06-30T14:19:31.661 [INFO] Apache BookKeeper :: Stream Storage :: Parent ...... SKIPPED
2019-06-30T14:19:31.661 [INFO] Apache BookKeeper :: Stream Storage :: Common Classes for Tests SKIPPED
2019-06-30T14:19:31.661 [INFO] Apache BookKeeper :: Stream Storage :: Common ...... SKIPPED
2019-06-30T14:19:31.661 [INFO] Apache BookKeeper :: Stream Storage :: API ......... SKIPPED
2019-06-30T14:19:31.661 [INFO] Apache BookKeeper :: Stream Storage :: Proto ....... SKIPPED
2019-06-30T14:19:31.661 [INFO] Apache BookKeeper :: Stream Storage :: Clients :: Parent SKIPPED
2019-06-30T14:19:31.661 [INFO] Apache BookKeeper :: Stream Storage :: Clients :: Java Client :: Parent SKIPPED
2019-06-30T14:19:31.661 [INFO] Apache BookKeeper :: Stream Storage :: Clients :: Java Client :: Base SKIPPED
2019-06-30T14:19:31.661 [INFO] Apache BookKeeper :: Stream Storage :: Clients :: Java Client :: KV SKIPPED
2019-06-30T14:19:31.661 [INFO] Apache BookKeeper :: Stream Storage :: Clients :: Java Client SKIPPED
2019-06-30T14:19:31.661 [INFO] Apache BookKeeper :: Stream Storage :: Storage :: Parent SKIPPED
2019-06-30T14:19:31.661 [INFO] Apache BookKeeper :: Stream Storage :: Storage :: Api SKIPPED
2019-06-30T14:19:31.661 [INFO] Apache BookKeeper :: Stream Storage :: State Library SKIPPED
2019-06-30T14:19:31.661 [INFO] Apache BookKeeper :: Stream Storage :: Storage :: Impl SKIPPED
2019-06-30T14:19:31.661 [INFO] Apache BookKeeper :: Tools :: Stream ............... SKIPPED
2019-06-30T14:19:31.661 [INFO] Apache BookKeeper :: Tools ......................... SKIPPED
2019-06-30T14:19:31.662 [INFO] Apache BookKeeper :: Stream Storage :: Server ...... SKIPPED
2019-06-30T14:19:31.662 [INFO] Apache BookKeeper :: Dist (Parent) ................. SKIPPED
2019-06-30T14:19:31.662 [INFO] Apache BookKeeper :: Dist (Server) ................. SKIPPED
2019-06-30T14:19:31.662 [INFO] Apache BookKeeper :: Tests :: Docker Images :: All Versions SKIPPED
2019-06-30T14:19:31.662 [INFO] Apache BookKeeper :: Tests :: Docker Images :: Current Version SKIPPED
2019-06-30T14:19:31.662 [INFO] Apache BookKeeper :: Tests :: Utility module for Arquillian based integration tests SKIPPED
2019-06-30T14:19:31.662 [INFO] Apache BookKeeper :: Tests :: Common topologies for Docker based integration tests SKIPPED
2019-06-30T14:19:31.662 [INFO] Apache BookKeeper :: Tests :: Base module for Arquillian based integration tests SKIPPED
2019-06-30T14:19:31.662 [INFO] Apache BookKeeper :: Tests :: Base module for Arquillian based integration tests using groovy SKIPPED
2019-06-30T14:19:31.662 [INFO] Apache BookKeeper :: Tests :: Backward Compatibility SKIPPED
2019-06-30T14:19:31.662 [INFO] Apache BookKeeper :: Tests :: Backward Compatibility :: Test upgrade between all released versions and current version SKIPPED
2019-06-30T14:19:31.662 [INFO] Apache BookKeeper :: Tests :: Backward Compatibility :: Test upgrade between 4.1.0 and current version SKIPPED
2019-06-30T14:19:31.662 [INFO] Apache BookKeeper :: Tests :: Backward Compatibility :: Test compat between old version and new version of hierarchical ledger manager SKIPPED
2019-06-30T14:19:31.662 [INFO] Apache BookKeeper :: Tests :: Backward Compatibility :: Test upgrade between 4.1.0 and current version (with hostname bookie ID) SKIPPED
2019-06-30T14:19:31.662 [INFO] Apache BookKeeper :: Tests :: Backward Compatibility :: Test recovery does not work when password no in metadata SKIPPED
2019-06-30T14:19:31.662 [INFO] Apache BookKeeper :: Tests :: Backward Compatibility :: Test upgrade 4.1.0 to current in cluster with cookies SKIPPED
2019-06-30T14:19:31.662 [INFO] Apache BookKeeper :: Tests :: Backward Compatibility :: Test old clients working on current server SKIPPED
2019-06-30T14:19:31.662 [INFO] Apache BookKeeper :: Tests :: Backward Compatibility :: Test upgrade between yahoo custom version and current SKIPPED
2019-06-30T14:19:31.662 [INFO] Apache BookKeeper :: Tests :: Integration .......... SKIPPED
2019-06-30T14:19:31.662 [INFO] Apache BookKeeper :: Tests :: Integration :: Smoke test SKIPPED
2019-06-30T14:19:31.662 [INFO] Apache BookKeeper :: Tests :: Integration :: Standalone test SKIPPED
2019-06-30T14:19:31.662 [INFO] Apache BookKeeper :: Tests :: Integration :: Cluster test SKIPPED
2019-06-30T14:19:31.662 [INFO] Apache BookKeeper :: Tests :: Bash Scripts Test .... SKIPPED
2019-06-30T14:19:31.662 [INFO] Apache BookKeeper :: Dist (All) .................... SKIPPED
2019-06-30T14:19:31.662 [INFO] Apache BookKeeper :: microbenchmarks ............... SKIPPED
2019-06-30T14:19:31.662 [INFO] Apache BookKeeper :: DistributedLog :: IO :: FileSystem SKIPPED
2019-06-30T14:19:31.662 [INFO] Apache BookKeeper :: DistributedLog :: IO .......... SKIPPED
2019-06-30T14:19:31.663 [INFO] ------------------------------------------------------------------------
2019-06-30T14:19:31.663 [INFO] BUILD FAILURE
2019-06-30T14:19:31.663 [INFO] ------------------------------------------------------------------------
2019-06-30T14:19:31.663 [INFO] Total time: 02:04 h
2019-06-30T14:19:31.663 [INFO] Finished at: 2019-06-30T14:19:31Z
2019-06-30T14:19:32.801 [INFO] Final Memory: 130M/2048M
2019-06-30T14:19:32.801 [INFO] ------------------------------------------------------------------------
Waiting for Jenkins to finish collecting data
2019-06-30T14:19:33.544 [ERROR] Failed to execute goal com.github.spotbugs:spotbugs-maven-plugin:3.1.0-RC6:spotbugs (spotbugs) on project distributedlog-core: Execution spotbugs of goal com.github.spotbugs:spotbugs-maven-plugin:3.1.0-RC6:spotbugs failed: Java returned: 127 -> [Help 1]
2019-06-30T14:19:33.544 [ERROR]
2019-06-30T14:19:33.544 [ERROR] To see the full stack trace of the errors, re-run Maven with the -e switch.
2019-06-30T14:19:33.544 [ERROR] Re-run Maven using the -X switch to enable full debug logging.
2019-06-30T14:19:33.544 [ERROR]
2019-06-30T14:19:33.544 [ERROR] For more information about the errors and possible solutions, please read the following articles:
2019-06-30T14:19:33.544 [ERROR] [Help 1] http://cwiki.apache.org/confluence/display/MAVEN/PluginExecutionException
2019-06-30T14:19:33.545 [ERROR]
2019-06-30T14:19:33.545 [ERROR] After correcting the problems, you can resume the build with the command
2019-06-30T14:19:33.545 [ERROR] mvn <goals> -rf :distributedlog-core
channel stopped
Jenkins build is back to stable :
bookkeeper_release_branch_48_java9 #341
Posted by Apache Jenkins Server <je...@builds.apache.org>.
See <https://builds.apache.org/job/bookkeeper_release_branch_48_java9/341/display/redirect>
Jenkins build is still unstable: bookkeeper_release_branch_48_java9
#340
Posted by Apache Jenkins Server <je...@builds.apache.org>.
See <https://builds.apache.org/job/bookkeeper_release_branch_48_java9/340/display/redirect>
Jenkins build is unstable: bookkeeper_release_branch_48_java9 #339
Posted by Apache Jenkins Server <je...@builds.apache.org>.
See <https://builds.apache.org/job/bookkeeper_release_branch_48_java9/339/display/redirect>
Build failed in Jenkins: bookkeeper_release_branch_48_java9 #338
Posted by Apache Jenkins Server <je...@builds.apache.org>.
See <https://builds.apache.org/job/bookkeeper_release_branch_48_java9/338/display/redirect>
------------------------------------------
Started by timer
[EnvInject] - Loading node environment variables.
Building remotely on H38 (ubuntu xenial) in workspace <https://builds.apache.org/job/bookkeeper_release_branch_48_java9/ws/>
No credentials specified
> git rev-parse --is-inside-work-tree # timeout=10
Fetching changes from the remote Git repository
> git config remote.origin.url https://github.com/apache/bookkeeper.git # timeout=10
Fetching upstream changes from https://github.com/apache/bookkeeper.git
> git --version # timeout=10
> git fetch --tags --progress https://github.com/apache/bookkeeper.git +refs/heads/*:refs/remotes/origin/* +refs/pull/${ghprbPullId}/*:refs/remotes/origin/pr/${ghprbPullId}/*
> git rev-parse origin/branch-4.8^{commit} # timeout=10
Checking out Revision ba6e6f12588144eda6bcb4d3f16ae67f089d0d54 (origin/branch-4.8)
> git config core.sparsecheckout # timeout=10
> git checkout -f ba6e6f12588144eda6bcb4d3f16ae67f089d0d54
Commit message: "[DLOG] Delete empty inprogress segment on recovery"
> git rev-list --no-walk ba6e6f12588144eda6bcb4d3f16ae67f089d0d54 # timeout=10
Cleaning workspace
> git rev-parse --verify HEAD # timeout=10
Resetting working tree
> git reset --hard # timeout=10
> git clean -fdx # timeout=10
Parsing POMs
Downloaded artifact http://repo.maven.apache.org/maven2/org/apache/apache/18/apache-18.pom
Established TCP socket on 37688
maven35-agent.jar already up to date
maven35-interceptor.jar already up to date
maven3-interceptor-commons.jar already up to date
[bookkeeper_release_branch_48_java9] $ /home/jenkins/tools/java/latest1.9/bin/java -Dorg.slf4j.simpleLogger.showDateTime=true -Dorg.slf4j.simpleLogger.dateTimeFormat=yyyy-MM-dd'T'HH:mm:ss.SSS -XX:+TieredCompilation -XX:TieredStopAtLevel=1 -Xmx4096m -Xms2048m -cp /home/jenkins/jenkins-slave/maven35-agent.jar:/home/jenkins/tools/maven/apache-maven-3.5.0/boot/plexus-classworlds-2.5.2.jar:/home/jenkins/tools/maven/apache-maven-3.5.0/conf/logging jenkins.maven3.agent.Maven35Main /home/jenkins/tools/maven/apache-maven-3.5.0 /home/jenkins/jenkins-slave/remoting.jar /home/jenkins/jenkins-slave/maven35-interceptor.jar /home/jenkins/jenkins-slave/maven3-interceptor-commons.jar 37688
/home/jenkins/tools/java/latest1.9/bin/java: error while loading shared libraries: libjli.so: cannot open shared object file: No such file or directory
ERROR: Failed to launch Maven. Exit code = 127
Build failed in Jenkins: bookkeeper_release_branch_48_java9 #337
Posted by Apache Jenkins Server <je...@builds.apache.org>.
See <https://builds.apache.org/job/bookkeeper_release_branch_48_java9/337/display/redirect>
------------------------------------------
Started by timer
[EnvInject] - Loading node environment variables.
Building remotely on H38 (ubuntu xenial) in workspace <https://builds.apache.org/job/bookkeeper_release_branch_48_java9/ws/>
No credentials specified
> git rev-parse --is-inside-work-tree # timeout=10
Fetching changes from the remote Git repository
> git config remote.origin.url https://github.com/apache/bookkeeper.git # timeout=10
Fetching upstream changes from https://github.com/apache/bookkeeper.git
> git --version # timeout=10
> git fetch --tags --progress https://github.com/apache/bookkeeper.git +refs/heads/*:refs/remotes/origin/* +refs/pull/${ghprbPullId}/*:refs/remotes/origin/pr/${ghprbPullId}/*
> git rev-parse origin/branch-4.8^{commit} # timeout=10
Checking out Revision ba6e6f12588144eda6bcb4d3f16ae67f089d0d54 (origin/branch-4.8)
> git config core.sparsecheckout # timeout=10
> git checkout -f ba6e6f12588144eda6bcb4d3f16ae67f089d0d54
Commit message: "[DLOG] Delete empty inprogress segment on recovery"
> git rev-list --no-walk ba6e6f12588144eda6bcb4d3f16ae67f089d0d54 # timeout=10
Cleaning workspace
> git rev-parse --verify HEAD # timeout=10
Resetting working tree
> git reset --hard # timeout=10
> git clean -fdx # timeout=10
Parsing POMs
Downloaded artifact http://repo.maven.apache.org/maven2/org/apache/apache/18/apache-18.pom
Established TCP socket on 42559
maven35-agent.jar already up to date
maven35-interceptor.jar already up to date
maven3-interceptor-commons.jar already up to date
[bookkeeper_release_branch_48_java9] $ /home/jenkins/tools/java/latest1.9/bin/java -Dorg.slf4j.simpleLogger.showDateTime=true -Dorg.slf4j.simpleLogger.dateTimeFormat=yyyy-MM-dd'T'HH:mm:ss.SSS -XX:+TieredCompilation -XX:TieredStopAtLevel=1 -Xmx4096m -Xms2048m -cp /home/jenkins/jenkins-slave/maven35-agent.jar:/home/jenkins/tools/maven/apache-maven-3.5.0/boot/plexus-classworlds-2.5.2.jar:/home/jenkins/tools/maven/apache-maven-3.5.0/conf/logging jenkins.maven3.agent.Maven35Main /home/jenkins/tools/maven/apache-maven-3.5.0 /home/jenkins/jenkins-slave/remoting.jar /home/jenkins/jenkins-slave/maven35-interceptor.jar /home/jenkins/jenkins-slave/maven3-interceptor-commons.jar 42559
/home/jenkins/tools/java/latest1.9/bin/java: error while loading shared libraries: libjli.so: cannot open shared object file: No such file or directory
ERROR: Failed to launch Maven. Exit code = 127
Build failed in Jenkins: bookkeeper_release_branch_48_java9 #336
Posted by Apache Jenkins Server <je...@builds.apache.org>.
See <https://builds.apache.org/job/bookkeeper_release_branch_48_java9/336/display/redirect>
------------------------------------------
Started by timer
[EnvInject] - Loading node environment variables.
Building remotely on H40 (ubuntu xenial) in workspace <https://builds.apache.org/job/bookkeeper_release_branch_48_java9/ws/>
No credentials specified
> git rev-parse --is-inside-work-tree # timeout=10
Fetching changes from the remote Git repository
> git config remote.origin.url https://github.com/apache/bookkeeper.git # timeout=10
Fetching upstream changes from https://github.com/apache/bookkeeper.git
> git --version # timeout=10
> git fetch --tags --progress https://github.com/apache/bookkeeper.git +refs/heads/*:refs/remotes/origin/* +refs/pull/${ghprbPullId}/*:refs/remotes/origin/pr/${ghprbPullId}/*
> git rev-parse origin/branch-4.8^{commit} # timeout=10
Checking out Revision ba6e6f12588144eda6bcb4d3f16ae67f089d0d54 (origin/branch-4.8)
> git config core.sparsecheckout # timeout=10
> git checkout -f ba6e6f12588144eda6bcb4d3f16ae67f089d0d54
Commit message: "[DLOG] Delete empty inprogress segment on recovery"
> git rev-list --no-walk ba6e6f12588144eda6bcb4d3f16ae67f089d0d54 # timeout=10
Cleaning workspace
> git rev-parse --verify HEAD # timeout=10
Resetting working tree
> git reset --hard # timeout=10
> git clean -fdx # timeout=10
Parsing POMs
Downloaded artifact http://repo.maven.apache.org/maven2/org/apache/apache/18/apache-18.pom
Established TCP socket on 40508
maven35-agent.jar already up to date
maven35-interceptor.jar already up to date
maven3-interceptor-commons.jar already up to date
[bookkeeper_release_branch_48_java9] $ /home/jenkins/tools/java/latest1.9/bin/java -Dorg.slf4j.simpleLogger.showDateTime=true -Dorg.slf4j.simpleLogger.dateTimeFormat=yyyy-MM-dd'T'HH:mm:ss.SSS -XX:+TieredCompilation -XX:TieredStopAtLevel=1 -Xmx4096m -Xms2048m -cp /home/jenkins/jenkins-slave/maven35-agent.jar:/home/jenkins/tools/maven/apache-maven-3.5.0/boot/plexus-classworlds-2.5.2.jar:/home/jenkins/tools/maven/apache-maven-3.5.0/conf/logging jenkins.maven3.agent.Maven35Main /home/jenkins/tools/maven/apache-maven-3.5.0 /home/jenkins/jenkins-slave/remoting.jar /home/jenkins/jenkins-slave/maven35-interceptor.jar /home/jenkins/jenkins-slave/maven3-interceptor-commons.jar 40508
/home/jenkins/tools/java/latest1.9/bin/java: error while loading shared libraries: libjli.so: cannot open shared object file: No such file or directory
ERROR: Failed to launch Maven. Exit code = 127
Build failed in Jenkins: bookkeeper_release_branch_48_java9 #335
Posted by Apache Jenkins Server <je...@builds.apache.org>.
See <https://builds.apache.org/job/bookkeeper_release_branch_48_java9/335/display/redirect>
------------------------------------------
Started by timer
[EnvInject] - Loading node environment variables.
Building remotely on H36 (ubuntu xenial) in workspace <https://builds.apache.org/job/bookkeeper_release_branch_48_java9/ws/>
No credentials specified
> git rev-parse --is-inside-work-tree # timeout=10
Fetching changes from the remote Git repository
> git config remote.origin.url https://github.com/apache/bookkeeper.git # timeout=10
Fetching upstream changes from https://github.com/apache/bookkeeper.git
> git --version # timeout=10
> git fetch --tags --progress https://github.com/apache/bookkeeper.git +refs/heads/*:refs/remotes/origin/* +refs/pull/${ghprbPullId}/*:refs/remotes/origin/pr/${ghprbPullId}/*
> git rev-parse origin/branch-4.8^{commit} # timeout=10
Checking out Revision ba6e6f12588144eda6bcb4d3f16ae67f089d0d54 (origin/branch-4.8)
> git config core.sparsecheckout # timeout=10
> git checkout -f ba6e6f12588144eda6bcb4d3f16ae67f089d0d54
Commit message: "[DLOG] Delete empty inprogress segment on recovery"
> git rev-list --no-walk ba6e6f12588144eda6bcb4d3f16ae67f089d0d54 # timeout=10
Cleaning workspace
> git rev-parse --verify HEAD # timeout=10
Resetting working tree
> git reset --hard # timeout=10
> git clean -fdx # timeout=10
Parsing POMs
Downloaded artifact http://repo.maven.apache.org/maven2/org/apache/apache/18/apache-18.pom
Established TCP socket on 38230
maven35-agent.jar already up to date
maven35-interceptor.jar already up to date
maven3-interceptor-commons.jar already up to date
[bookkeeper_release_branch_48_java9] $ /home/jenkins/tools/java/latest1.9/bin/java -Dorg.slf4j.simpleLogger.showDateTime=true -Dorg.slf4j.simpleLogger.dateTimeFormat=yyyy-MM-dd'T'HH:mm:ss.SSS -XX:+TieredCompilation -XX:TieredStopAtLevel=1 -Xmx4096m -Xms2048m -cp /home/jenkins/jenkins-slave/maven35-agent.jar:/home/jenkins/tools/maven/apache-maven-3.5.0/boot/plexus-classworlds-2.5.2.jar:/home/jenkins/tools/maven/apache-maven-3.5.0/conf/logging jenkins.maven3.agent.Maven35Main /home/jenkins/tools/maven/apache-maven-3.5.0 /home/jenkins/jenkins-slave/remoting.jar /home/jenkins/jenkins-slave/maven35-interceptor.jar /home/jenkins/jenkins-slave/maven3-interceptor-commons.jar 38230
/home/jenkins/tools/java/latest1.9/bin/java: error while loading shared libraries: libjli.so: cannot open shared object file: No such file or directory
ERROR: Failed to launch Maven. Exit code = 127
Build failed in Jenkins: bookkeeper_release_branch_48_java9 #334
Posted by Apache Jenkins Server <je...@builds.apache.org>.
See <https://builds.apache.org/job/bookkeeper_release_branch_48_java9/334/display/redirect>
------------------------------------------
Started by timer
[EnvInject] - Loading node environment variables.
Building remotely on H30 (ubuntu xenial) in workspace <https://builds.apache.org/job/bookkeeper_release_branch_48_java9/ws/>
No credentials specified
Cloning the remote Git repository
Cloning repository https://github.com/apache/bookkeeper.git
> git init <https://builds.apache.org/job/bookkeeper_release_branch_48_java9/ws/> # timeout=10
Fetching upstream changes from https://github.com/apache/bookkeeper.git
> git --version # timeout=10
> git fetch --tags --progress https://github.com/apache/bookkeeper.git +refs/heads/*:refs/remotes/origin/*
> git config remote.origin.url https://github.com/apache/bookkeeper.git # timeout=10
> git config --add remote.origin.fetch +refs/heads/*:refs/remotes/origin/* # timeout=10
> git config remote.origin.url https://github.com/apache/bookkeeper.git # timeout=10
Fetching upstream changes from https://github.com/apache/bookkeeper.git
> git fetch --tags --progress https://github.com/apache/bookkeeper.git +refs/heads/*:refs/remotes/origin/* +refs/pull/${ghprbPullId}/*:refs/remotes/origin/pr/${ghprbPullId}/*
> git rev-parse origin/branch-4.8^{commit} # timeout=10
Checking out Revision ba6e6f12588144eda6bcb4d3f16ae67f089d0d54 (origin/branch-4.8)
> git config core.sparsecheckout # timeout=10
> git checkout -f ba6e6f12588144eda6bcb4d3f16ae67f089d0d54
Commit message: "[DLOG] Delete empty inprogress segment on recovery"
> git rev-list --no-walk ba6e6f12588144eda6bcb4d3f16ae67f089d0d54 # timeout=10
Cleaning workspace
> git rev-parse --verify HEAD # timeout=10
Resetting working tree
> git reset --hard # timeout=10
> git clean -fdx # timeout=10
Parsing POMs
Downloaded artifact http://repo.maven.apache.org/maven2/org/apache/apache/18/apache-18.pom
Established TCP socket on 44378
maven35-agent.jar already up to date
maven35-interceptor.jar already up to date
maven3-interceptor-commons.jar already up to date
[bookkeeper_release_branch_48_java9] $ /home/jenkins/tools/java/latest1.9/bin/java -Dorg.slf4j.simpleLogger.showDateTime=true -Dorg.slf4j.simpleLogger.dateTimeFormat=yyyy-MM-dd'T'HH:mm:ss.SSS -XX:+TieredCompilation -XX:TieredStopAtLevel=1 -Xmx4096m -Xms2048m -cp /home/jenkins/jenkins-slave/maven35-agent.jar:/home/jenkins/tools/maven/apache-maven-3.5.0/boot/plexus-classworlds-2.5.2.jar:/home/jenkins/tools/maven/apache-maven-3.5.0/conf/logging jenkins.maven3.agent.Maven35Main /home/jenkins/tools/maven/apache-maven-3.5.0 /home/jenkins/jenkins-slave/remoting.jar /home/jenkins/jenkins-slave/maven35-interceptor.jar /home/jenkins/jenkins-slave/maven3-interceptor-commons.jar 44378
/home/jenkins/tools/java/latest1.9/bin/java: error while loading shared libraries: libjli.so: cannot open shared object file: No such file or directory
ERROR: Failed to launch Maven. Exit code = 127
Build failed in Jenkins: bookkeeper_release_branch_48_java9 #333
Posted by Apache Jenkins Server <je...@builds.apache.org>.
See <https://builds.apache.org/job/bookkeeper_release_branch_48_java9/333/display/redirect>
------------------------------------------
Started by timer
[EnvInject] - Loading node environment variables.
Building remotely on H38 (ubuntu xenial) in workspace <https://builds.apache.org/job/bookkeeper_release_branch_48_java9/ws/>
No credentials specified
> git rev-parse --is-inside-work-tree # timeout=10
Fetching changes from the remote Git repository
> git config remote.origin.url https://github.com/apache/bookkeeper.git # timeout=10
Fetching upstream changes from https://github.com/apache/bookkeeper.git
> git --version # timeout=10
> git fetch --tags --progress https://github.com/apache/bookkeeper.git +refs/heads/*:refs/remotes/origin/* +refs/pull/${ghprbPullId}/*:refs/remotes/origin/pr/${ghprbPullId}/*
> git rev-parse origin/branch-4.8^{commit} # timeout=10
Checking out Revision ba6e6f12588144eda6bcb4d3f16ae67f089d0d54 (origin/branch-4.8)
> git config core.sparsecheckout # timeout=10
> git checkout -f ba6e6f12588144eda6bcb4d3f16ae67f089d0d54
Commit message: "[DLOG] Delete empty inprogress segment on recovery"
> git rev-list --no-walk ba6e6f12588144eda6bcb4d3f16ae67f089d0d54 # timeout=10
Cleaning workspace
> git rev-parse --verify HEAD # timeout=10
Resetting working tree
> git reset --hard # timeout=10
> git clean -fdx # timeout=10
Parsing POMs
Downloaded artifact http://repo.maven.apache.org/maven2/org/apache/apache/18/apache-18.pom
Established TCP socket on 34926
maven35-agent.jar already up to date
maven35-interceptor.jar already up to date
maven3-interceptor-commons.jar already up to date
[bookkeeper_release_branch_48_java9] $ /home/jenkins/tools/java/latest1.9/bin/java -Dorg.slf4j.simpleLogger.showDateTime=true -Dorg.slf4j.simpleLogger.dateTimeFormat=yyyy-MM-dd'T'HH:mm:ss.SSS -XX:+TieredCompilation -XX:TieredStopAtLevel=1 -Xmx4096m -Xms2048m -cp /home/jenkins/jenkins-slave/maven35-agent.jar:/home/jenkins/tools/maven/apache-maven-3.5.0/boot/plexus-classworlds-2.5.2.jar:/home/jenkins/tools/maven/apache-maven-3.5.0/conf/logging jenkins.maven3.agent.Maven35Main /home/jenkins/tools/maven/apache-maven-3.5.0 /home/jenkins/jenkins-slave/remoting.jar /home/jenkins/jenkins-slave/maven35-interceptor.jar /home/jenkins/jenkins-slave/maven3-interceptor-commons.jar 34926
/home/jenkins/tools/java/latest1.9/bin/java: error while loading shared libraries: libjli.so: cannot open shared object file: No such file or directory
ERROR: Failed to launch Maven. Exit code = 127
Build failed in Jenkins: bookkeeper_release_branch_48_java9 #332
Posted by Apache Jenkins Server <je...@builds.apache.org>.
See <https://builds.apache.org/job/bookkeeper_release_branch_48_java9/332/display/redirect>
------------------------------------------
Started by timer
[EnvInject] - Loading node environment variables.
Building remotely on H23 (ubuntu xenial) in workspace <https://builds.apache.org/job/bookkeeper_release_branch_48_java9/ws/>
No credentials specified
> git rev-parse --is-inside-work-tree # timeout=10
Fetching changes from the remote Git repository
> git config remote.origin.url https://github.com/apache/bookkeeper.git # timeout=10
Fetching upstream changes from https://github.com/apache/bookkeeper.git
> git --version # timeout=10
> git fetch --tags --progress https://github.com/apache/bookkeeper.git +refs/heads/*:refs/remotes/origin/* +refs/pull/${ghprbPullId}/*:refs/remotes/origin/pr/${ghprbPullId}/*
> git rev-parse origin/branch-4.8^{commit} # timeout=10
Checking out Revision ba6e6f12588144eda6bcb4d3f16ae67f089d0d54 (origin/branch-4.8)
> git config core.sparsecheckout # timeout=10
> git checkout -f ba6e6f12588144eda6bcb4d3f16ae67f089d0d54
Commit message: "[DLOG] Delete empty inprogress segment on recovery"
> git rev-list --no-walk ba6e6f12588144eda6bcb4d3f16ae67f089d0d54 # timeout=10
Cleaning workspace
> git rev-parse --verify HEAD # timeout=10
Resetting working tree
> git reset --hard # timeout=10
> git clean -fdx # timeout=10
Parsing POMs
Downloaded artifact http://repo.maven.apache.org/maven2/org/apache/apache/18/apache-18.pom
Established TCP socket on 45343
maven35-agent.jar already up to date
maven35-interceptor.jar already up to date
maven3-interceptor-commons.jar already up to date
[bookkeeper_release_branch_48_java9] $ /home/jenkins/tools/java/latest1.9/bin/java -Dorg.slf4j.simpleLogger.showDateTime=true -Dorg.slf4j.simpleLogger.dateTimeFormat=yyyy-MM-dd'T'HH:mm:ss.SSS -XX:+TieredCompilation -XX:TieredStopAtLevel=1 -Xmx4096m -Xms2048m -cp /home/jenkins/jenkins-slave/maven35-agent.jar:/home/jenkins/tools/maven/apache-maven-3.5.0/boot/plexus-classworlds-2.5.2.jar:/home/jenkins/tools/maven/apache-maven-3.5.0/conf/logging jenkins.maven3.agent.Maven35Main /home/jenkins/tools/maven/apache-maven-3.5.0 /home/jenkins/jenkins-slave/remoting.jar /home/jenkins/jenkins-slave/maven35-interceptor.jar /home/jenkins/jenkins-slave/maven3-interceptor-commons.jar 45343
/home/jenkins/tools/java/latest1.9/bin/java: error while loading shared libraries: libjli.so: cannot open shared object file: No such file or directory
ERROR: Failed to launch Maven. Exit code = 127
Build failed in Jenkins: bookkeeper_release_branch_48_java9 #331
Posted by Apache Jenkins Server <je...@builds.apache.org>.
See <https://builds.apache.org/job/bookkeeper_release_branch_48_java9/331/display/redirect>
------------------------------------------
Started by timer
[EnvInject] - Loading node environment variables.
Building remotely on H38 (ubuntu xenial) in workspace <https://builds.apache.org/job/bookkeeper_release_branch_48_java9/ws/>
No credentials specified
> git rev-parse --is-inside-work-tree # timeout=10
Fetching changes from the remote Git repository
> git config remote.origin.url https://github.com/apache/bookkeeper.git # timeout=10
Fetching upstream changes from https://github.com/apache/bookkeeper.git
> git --version # timeout=10
> git fetch --tags --progress https://github.com/apache/bookkeeper.git +refs/heads/*:refs/remotes/origin/* +refs/pull/${ghprbPullId}/*:refs/remotes/origin/pr/${ghprbPullId}/*
> git rev-parse origin/branch-4.8^{commit} # timeout=10
Checking out Revision ba6e6f12588144eda6bcb4d3f16ae67f089d0d54 (origin/branch-4.8)
> git config core.sparsecheckout # timeout=10
> git checkout -f ba6e6f12588144eda6bcb4d3f16ae67f089d0d54
Commit message: "[DLOG] Delete empty inprogress segment on recovery"
> git rev-list --no-walk ba6e6f12588144eda6bcb4d3f16ae67f089d0d54 # timeout=10
Cleaning workspace
> git rev-parse --verify HEAD # timeout=10
Resetting working tree
> git reset --hard # timeout=10
> git clean -fdx # timeout=10
Parsing POMs
Downloaded artifact http://repo.maven.apache.org/maven2/org/apache/apache/18/apache-18.pom
Established TCP socket on 33481
maven35-agent.jar already up to date
maven35-interceptor.jar already up to date
maven3-interceptor-commons.jar already up to date
[bookkeeper_release_branch_48_java9] $ /home/jenkins/tools/java/latest1.9/bin/java -Dorg.slf4j.simpleLogger.showDateTime=true -Dorg.slf4j.simpleLogger.dateTimeFormat=yyyy-MM-dd'T'HH:mm:ss.SSS -XX:+TieredCompilation -XX:TieredStopAtLevel=1 -Xmx4096m -Xms2048m -cp /home/jenkins/jenkins-slave/maven35-agent.jar:/home/jenkins/tools/maven/apache-maven-3.5.0/boot/plexus-classworlds-2.5.2.jar:/home/jenkins/tools/maven/apache-maven-3.5.0/conf/logging jenkins.maven3.agent.Maven35Main /home/jenkins/tools/maven/apache-maven-3.5.0 /home/jenkins/jenkins-slave/remoting.jar /home/jenkins/jenkins-slave/maven35-interceptor.jar /home/jenkins/jenkins-slave/maven3-interceptor-commons.jar 33481
/home/jenkins/tools/java/latest1.9/bin/java: error while loading shared libraries: libjli.so: cannot open shared object file: No such file or directory
ERROR: Failed to launch Maven. Exit code = 127
Build failed in Jenkins: bookkeeper_release_branch_48_java9 #330
Posted by Apache Jenkins Server <je...@builds.apache.org>.
See <https://builds.apache.org/job/bookkeeper_release_branch_48_java9/330/display/redirect>
------------------------------------------
Started by timer
[EnvInject] - Loading node environment variables.
Building remotely on H38 (ubuntu xenial) in workspace <https://builds.apache.org/job/bookkeeper_release_branch_48_java9/ws/>
No credentials specified
> git rev-parse --is-inside-work-tree # timeout=10
Fetching changes from the remote Git repository
> git config remote.origin.url https://github.com/apache/bookkeeper.git # timeout=10
Fetching upstream changes from https://github.com/apache/bookkeeper.git
> git --version # timeout=10
> git fetch --tags --progress https://github.com/apache/bookkeeper.git +refs/heads/*:refs/remotes/origin/* +refs/pull/${ghprbPullId}/*:refs/remotes/origin/pr/${ghprbPullId}/*
> git rev-parse origin/branch-4.8^{commit} # timeout=10
Checking out Revision ba6e6f12588144eda6bcb4d3f16ae67f089d0d54 (origin/branch-4.8)
> git config core.sparsecheckout # timeout=10
> git checkout -f ba6e6f12588144eda6bcb4d3f16ae67f089d0d54
Commit message: "[DLOG] Delete empty inprogress segment on recovery"
> git rev-list --no-walk ba6e6f12588144eda6bcb4d3f16ae67f089d0d54 # timeout=10
Cleaning workspace
> git rev-parse --verify HEAD # timeout=10
Resetting working tree
> git reset --hard # timeout=10
> git clean -fdx # timeout=10
Parsing POMs
Downloaded artifact http://repo.maven.apache.org/maven2/org/apache/apache/18/apache-18.pom
Established TCP socket on 40698
maven35-agent.jar already up to date
maven35-interceptor.jar already up to date
maven3-interceptor-commons.jar already up to date
[bookkeeper_release_branch_48_java9] $ /home/jenkins/tools/java/latest1.9/bin/java -Dorg.slf4j.simpleLogger.showDateTime=true -Dorg.slf4j.simpleLogger.dateTimeFormat=yyyy-MM-dd'T'HH:mm:ss.SSS -XX:+TieredCompilation -XX:TieredStopAtLevel=1 -Xmx4096m -Xms2048m -cp /home/jenkins/jenkins-slave/maven35-agent.jar:/home/jenkins/tools/maven/apache-maven-3.5.0/boot/plexus-classworlds-2.5.2.jar:/home/jenkins/tools/maven/apache-maven-3.5.0/conf/logging jenkins.maven3.agent.Maven35Main /home/jenkins/tools/maven/apache-maven-3.5.0 /home/jenkins/jenkins-slave/remoting.jar /home/jenkins/jenkins-slave/maven35-interceptor.jar /home/jenkins/jenkins-slave/maven3-interceptor-commons.jar 40698
/home/jenkins/tools/java/latest1.9/bin/java: error while loading shared libraries: libjli.so: cannot open shared object file: No such file or directory
ERROR: Failed to launch Maven. Exit code = 127
Build failed in Jenkins: bookkeeper_release_branch_48_java9 #329
Posted by Apache Jenkins Server <je...@builds.apache.org>.
See <https://builds.apache.org/job/bookkeeper_release_branch_48_java9/329/display/redirect>
------------------------------------------
Started by timer
[EnvInject] - Loading node environment variables.
Building remotely on H34 (ubuntu xenial) in workspace <https://builds.apache.org/job/bookkeeper_release_branch_48_java9/ws/>
No credentials specified
Cloning the remote Git repository
Cloning repository https://github.com/apache/bookkeeper.git
> git init <https://builds.apache.org/job/bookkeeper_release_branch_48_java9/ws/> # timeout=10
Fetching upstream changes from https://github.com/apache/bookkeeper.git
> git --version # timeout=10
> git fetch --tags --progress https://github.com/apache/bookkeeper.git +refs/heads/*:refs/remotes/origin/*
> git config remote.origin.url https://github.com/apache/bookkeeper.git # timeout=10
> git config --add remote.origin.fetch +refs/heads/*:refs/remotes/origin/* # timeout=10
> git config remote.origin.url https://github.com/apache/bookkeeper.git # timeout=10
Fetching upstream changes from https://github.com/apache/bookkeeper.git
> git fetch --tags --progress https://github.com/apache/bookkeeper.git +refs/heads/*:refs/remotes/origin/* +refs/pull/${ghprbPullId}/*:refs/remotes/origin/pr/${ghprbPullId}/*
> git rev-parse origin/branch-4.8^{commit} # timeout=10
Checking out Revision ba6e6f12588144eda6bcb4d3f16ae67f089d0d54 (origin/branch-4.8)
> git config core.sparsecheckout # timeout=10
> git checkout -f ba6e6f12588144eda6bcb4d3f16ae67f089d0d54
Commit message: "[DLOG] Delete empty inprogress segment on recovery"
> git rev-list --no-walk ba6e6f12588144eda6bcb4d3f16ae67f089d0d54 # timeout=10
Cleaning workspace
> git rev-parse --verify HEAD # timeout=10
Resetting working tree
> git reset --hard # timeout=10
> git clean -fdx # timeout=10
Parsing POMs
Downloaded artifact http://repo.maven.apache.org/maven2/org/apache/apache/18/apache-18.pom
Established TCP socket on 43711
maven35-agent.jar already up to date
maven35-interceptor.jar already up to date
maven3-interceptor-commons.jar already up to date
[bookkeeper_release_branch_48_java9] $ /home/jenkins/tools/java/latest1.9/bin/java -Dorg.slf4j.simpleLogger.showDateTime=true -Dorg.slf4j.simpleLogger.dateTimeFormat=yyyy-MM-dd'T'HH:mm:ss.SSS -XX:+TieredCompilation -XX:TieredStopAtLevel=1 -Xmx4096m -Xms2048m -cp /home/jenkins/jenkins-slave/maven35-agent.jar:/home/jenkins/tools/maven/apache-maven-3.5.0/boot/plexus-classworlds-2.5.2.jar:/home/jenkins/tools/maven/apache-maven-3.5.0/conf/logging jenkins.maven3.agent.Maven35Main /home/jenkins/tools/maven/apache-maven-3.5.0 /home/jenkins/jenkins-slave/remoting.jar /home/jenkins/jenkins-slave/maven35-interceptor.jar /home/jenkins/jenkins-slave/maven3-interceptor-commons.jar 43711
/home/jenkins/tools/java/latest1.9/bin/java: error while loading shared libraries: libjli.so: cannot open shared object file: No such file or directory
ERROR: Failed to launch Maven. Exit code = 127
Build failed in Jenkins: bookkeeper_release_branch_48_java9 #328
Posted by Apache Jenkins Server <je...@builds.apache.org>.
See <https://builds.apache.org/job/bookkeeper_release_branch_48_java9/328/display/redirect>
------------------------------------------
Started by timer
[EnvInject] - Loading node environment variables.
Building remotely on H26 (ubuntu xenial) in workspace <https://builds.apache.org/job/bookkeeper_release_branch_48_java9/ws/>
No credentials specified
Cloning the remote Git repository
Cloning repository https://github.com/apache/bookkeeper.git
> git init <https://builds.apache.org/job/bookkeeper_release_branch_48_java9/ws/> # timeout=10
Fetching upstream changes from https://github.com/apache/bookkeeper.git
> git --version # timeout=10
> git fetch --tags --progress https://github.com/apache/bookkeeper.git +refs/heads/*:refs/remotes/origin/*
> git config remote.origin.url https://github.com/apache/bookkeeper.git # timeout=10
> git config --add remote.origin.fetch +refs/heads/*:refs/remotes/origin/* # timeout=10
> git config remote.origin.url https://github.com/apache/bookkeeper.git # timeout=10
Fetching upstream changes from https://github.com/apache/bookkeeper.git
> git fetch --tags --progress https://github.com/apache/bookkeeper.git +refs/heads/*:refs/remotes/origin/* +refs/pull/${ghprbPullId}/*:refs/remotes/origin/pr/${ghprbPullId}/*
> git rev-parse origin/branch-4.8^{commit} # timeout=10
Checking out Revision ba6e6f12588144eda6bcb4d3f16ae67f089d0d54 (origin/branch-4.8)
> git config core.sparsecheckout # timeout=10
> git checkout -f ba6e6f12588144eda6bcb4d3f16ae67f089d0d54
Commit message: "[DLOG] Delete empty inprogress segment on recovery"
> git rev-list --no-walk ba6e6f12588144eda6bcb4d3f16ae67f089d0d54 # timeout=10
Cleaning workspace
> git rev-parse --verify HEAD # timeout=10
Resetting working tree
> git reset --hard # timeout=10
> git clean -fdx # timeout=10
Parsing POMs
Downloaded artifact http://repo.maven.apache.org/maven2/org/apache/apache/18/apache-18.pom
Established TCP socket on 36589
maven35-agent.jar already up to date
maven35-interceptor.jar already up to date
maven3-interceptor-commons.jar already up to date
[bookkeeper_release_branch_48_java9] $ /home/jenkins/tools/java/latest1.9/bin/java -Dorg.slf4j.simpleLogger.showDateTime=true -Dorg.slf4j.simpleLogger.dateTimeFormat=yyyy-MM-dd'T'HH:mm:ss.SSS -XX:+TieredCompilation -XX:TieredStopAtLevel=1 -Xmx4096m -Xms2048m -cp /home/jenkins/jenkins-slave/maven35-agent.jar:/home/jenkins/tools/maven/apache-maven-3.5.0/boot/plexus-classworlds-2.5.2.jar:/home/jenkins/tools/maven/apache-maven-3.5.0/conf/logging jenkins.maven3.agent.Maven35Main /home/jenkins/tools/maven/apache-maven-3.5.0 /home/jenkins/jenkins-slave/remoting.jar /home/jenkins/jenkins-slave/maven35-interceptor.jar /home/jenkins/jenkins-slave/maven3-interceptor-commons.jar 36589
/home/jenkins/tools/java/latest1.9/bin/java: error while loading shared libraries: libjli.so: cannot open shared object file: No such file or directory
ERROR: Failed to launch Maven. Exit code = 127
Build failed in Jenkins: bookkeeper_release_branch_48_java9 #327
Posted by Apache Jenkins Server <je...@builds.apache.org>.
See <https://builds.apache.org/job/bookkeeper_release_branch_48_java9/327/display/redirect>
------------------------------------------
Started by timer
[EnvInject] - Loading node environment variables.
Building remotely on H27 (ubuntu xenial) in workspace <https://builds.apache.org/job/bookkeeper_release_branch_48_java9/ws/>
No credentials specified
> git rev-parse --is-inside-work-tree # timeout=10
Fetching changes from the remote Git repository
> git config remote.origin.url https://github.com/apache/bookkeeper.git # timeout=10
Fetching upstream changes from https://github.com/apache/bookkeeper.git
> git --version # timeout=10
> git fetch --tags --progress https://github.com/apache/bookkeeper.git +refs/heads/*:refs/remotes/origin/* +refs/pull/${ghprbPullId}/*:refs/remotes/origin/pr/${ghprbPullId}/*
> git rev-parse origin/branch-4.8^{commit} # timeout=10
Checking out Revision ba6e6f12588144eda6bcb4d3f16ae67f089d0d54 (origin/branch-4.8)
> git config core.sparsecheckout # timeout=10
> git checkout -f ba6e6f12588144eda6bcb4d3f16ae67f089d0d54
Commit message: "[DLOG] Delete empty inprogress segment on recovery"
> git rev-list --no-walk ba6e6f12588144eda6bcb4d3f16ae67f089d0d54 # timeout=10
Cleaning workspace
> git rev-parse --verify HEAD # timeout=10
Resetting working tree
> git reset --hard # timeout=10
> git clean -fdx # timeout=10
Parsing POMs
Downloaded artifact http://repo.maven.apache.org/maven2/org/apache/apache/18/apache-18.pom
Established TCP socket on 45842
maven35-agent.jar already up to date
maven35-interceptor.jar already up to date
maven3-interceptor-commons.jar already up to date
[bookkeeper_release_branch_48_java9] $ /home/jenkins/tools/java/latest1.9/bin/java -Dorg.slf4j.simpleLogger.showDateTime=true -Dorg.slf4j.simpleLogger.dateTimeFormat=yyyy-MM-dd'T'HH:mm:ss.SSS -XX:+TieredCompilation -XX:TieredStopAtLevel=1 -Xmx4096m -Xms2048m -cp /home/jenkins/jenkins-slave/maven35-agent.jar:/home/jenkins/tools/maven/apache-maven-3.5.0/boot/plexus-classworlds-2.5.2.jar:/home/jenkins/tools/maven/apache-maven-3.5.0/conf/logging jenkins.maven3.agent.Maven35Main /home/jenkins/tools/maven/apache-maven-3.5.0 /home/jenkins/jenkins-slave/remoting.jar /home/jenkins/jenkins-slave/maven35-interceptor.jar /home/jenkins/jenkins-slave/maven3-interceptor-commons.jar 45842
/home/jenkins/tools/java/latest1.9/bin/java: error while loading shared libraries: libjli.so: cannot open shared object file: No such file or directory
ERROR: Failed to launch Maven. Exit code = 127
Build failed in Jenkins: bookkeeper_release_branch_48_java9 #326
Posted by Apache Jenkins Server <je...@builds.apache.org>.
See <https://builds.apache.org/job/bookkeeper_release_branch_48_java9/326/display/redirect>
------------------------------------------
Started by timer
[EnvInject] - Loading node environment variables.
Building remotely on H42 (ubuntu xenial) in workspace <https://builds.apache.org/job/bookkeeper_release_branch_48_java9/ws/>
No credentials specified
Cloning the remote Git repository
Cloning repository https://github.com/apache/bookkeeper.git
> git init <https://builds.apache.org/job/bookkeeper_release_branch_48_java9/ws/> # timeout=10
Fetching upstream changes from https://github.com/apache/bookkeeper.git
> git --version # timeout=10
> git fetch --tags --progress https://github.com/apache/bookkeeper.git +refs/heads/*:refs/remotes/origin/*
> git config remote.origin.url https://github.com/apache/bookkeeper.git # timeout=10
> git config --add remote.origin.fetch +refs/heads/*:refs/remotes/origin/* # timeout=10
> git config remote.origin.url https://github.com/apache/bookkeeper.git # timeout=10
Fetching upstream changes from https://github.com/apache/bookkeeper.git
> git fetch --tags --progress https://github.com/apache/bookkeeper.git +refs/heads/*:refs/remotes/origin/* +refs/pull/${ghprbPullId}/*:refs/remotes/origin/pr/${ghprbPullId}/*
> git rev-parse origin/branch-4.8^{commit} # timeout=10
Checking out Revision ba6e6f12588144eda6bcb4d3f16ae67f089d0d54 (origin/branch-4.8)
> git config core.sparsecheckout # timeout=10
> git checkout -f ba6e6f12588144eda6bcb4d3f16ae67f089d0d54
Commit message: "[DLOG] Delete empty inprogress segment on recovery"
> git rev-list --no-walk ba6e6f12588144eda6bcb4d3f16ae67f089d0d54 # timeout=10
Cleaning workspace
> git rev-parse --verify HEAD # timeout=10
Resetting working tree
> git reset --hard # timeout=10
> git clean -fdx # timeout=10
Parsing POMs
Downloaded artifact http://repo.maven.apache.org/maven2/org/apache/apache/18/apache-18.pom
Established TCP socket on 42743
maven35-agent.jar already up to date
maven35-interceptor.jar already up to date
maven3-interceptor-commons.jar already up to date
[bookkeeper_release_branch_48_java9] $ /home/jenkins/tools/java/latest1.9/bin/java -Dorg.slf4j.simpleLogger.showDateTime=true -Dorg.slf4j.simpleLogger.dateTimeFormat=yyyy-MM-dd'T'HH:mm:ss.SSS -XX:+TieredCompilation -XX:TieredStopAtLevel=1 -Xmx4096m -Xms2048m -cp /home/jenkins/jenkins-slave/maven35-agent.jar:/home/jenkins/tools/maven/apache-maven-3.5.0/boot/plexus-classworlds-2.5.2.jar:/home/jenkins/tools/maven/apache-maven-3.5.0/conf/logging jenkins.maven3.agent.Maven35Main /home/jenkins/tools/maven/apache-maven-3.5.0 /home/jenkins/jenkins-slave/remoting.jar /home/jenkins/jenkins-slave/maven35-interceptor.jar /home/jenkins/jenkins-slave/maven3-interceptor-commons.jar 42743
/home/jenkins/tools/java/latest1.9/bin/java: error while loading shared libraries: libjli.so: cannot open shared object file: No such file or directory
ERROR: Failed to launch Maven. Exit code = 127
Build failed in Jenkins: bookkeeper_release_branch_48_java9 #325
Posted by Apache Jenkins Server <je...@builds.apache.org>.
See <https://builds.apache.org/job/bookkeeper_release_branch_48_java9/325/display/redirect>
------------------------------------------
Started by timer
[EnvInject] - Loading node environment variables.
Building remotely on H23 (ubuntu xenial) in workspace <https://builds.apache.org/job/bookkeeper_release_branch_48_java9/ws/>
No credentials specified
> git rev-parse --is-inside-work-tree # timeout=10
Fetching changes from the remote Git repository
> git config remote.origin.url https://github.com/apache/bookkeeper.git # timeout=10
Fetching upstream changes from https://github.com/apache/bookkeeper.git
> git --version # timeout=10
> git fetch --tags --progress https://github.com/apache/bookkeeper.git +refs/heads/*:refs/remotes/origin/* +refs/pull/${ghprbPullId}/*:refs/remotes/origin/pr/${ghprbPullId}/*
> git rev-parse origin/branch-4.8^{commit} # timeout=10
Checking out Revision ba6e6f12588144eda6bcb4d3f16ae67f089d0d54 (origin/branch-4.8)
> git config core.sparsecheckout # timeout=10
> git checkout -f ba6e6f12588144eda6bcb4d3f16ae67f089d0d54
Commit message: "[DLOG] Delete empty inprogress segment on recovery"
> git rev-list --no-walk ba6e6f12588144eda6bcb4d3f16ae67f089d0d54 # timeout=10
Cleaning workspace
> git rev-parse --verify HEAD # timeout=10
Resetting working tree
> git reset --hard # timeout=10
> git clean -fdx # timeout=10
Parsing POMs
Downloaded artifact http://repo.maven.apache.org/maven2/org/apache/apache/18/apache-18.pom
Established TCP socket on 43322
maven35-agent.jar already up to date
maven35-interceptor.jar already up to date
maven3-interceptor-commons.jar already up to date
[bookkeeper_release_branch_48_java9] $ /home/jenkins/tools/java/latest1.9/bin/java -Dorg.slf4j.simpleLogger.showDateTime=true -Dorg.slf4j.simpleLogger.dateTimeFormat=yyyy-MM-dd'T'HH:mm:ss.SSS -XX:+TieredCompilation -XX:TieredStopAtLevel=1 -Xmx4096m -Xms2048m -cp /home/jenkins/jenkins-slave/maven35-agent.jar:/home/jenkins/tools/maven/apache-maven-3.5.0/boot/plexus-classworlds-2.5.2.jar:/home/jenkins/tools/maven/apache-maven-3.5.0/conf/logging jenkins.maven3.agent.Maven35Main /home/jenkins/tools/maven/apache-maven-3.5.0 /home/jenkins/jenkins-slave/remoting.jar /home/jenkins/jenkins-slave/maven35-interceptor.jar /home/jenkins/jenkins-slave/maven3-interceptor-commons.jar 43322
/home/jenkins/tools/java/latest1.9/bin/java: error while loading shared libraries: libjli.so: cannot open shared object file: No such file or directory
ERROR: Failed to launch Maven. Exit code = 127
Build failed in Jenkins: bookkeeper_release_branch_48_java9 #324
Posted by Apache Jenkins Server <je...@builds.apache.org>.
See <https://builds.apache.org/job/bookkeeper_release_branch_48_java9/324/display/redirect>
------------------------------------------
Started by timer
[EnvInject] - Loading node environment variables.
Building remotely on H23 (ubuntu xenial) in workspace <https://builds.apache.org/job/bookkeeper_release_branch_48_java9/ws/>
No credentials specified
> git rev-parse --is-inside-work-tree # timeout=10
Fetching changes from the remote Git repository
> git config remote.origin.url https://github.com/apache/bookkeeper.git # timeout=10
Fetching upstream changes from https://github.com/apache/bookkeeper.git
> git --version # timeout=10
> git fetch --tags --progress https://github.com/apache/bookkeeper.git +refs/heads/*:refs/remotes/origin/* +refs/pull/${ghprbPullId}/*:refs/remotes/origin/pr/${ghprbPullId}/*
> git rev-parse origin/branch-4.8^{commit} # timeout=10
Checking out Revision ba6e6f12588144eda6bcb4d3f16ae67f089d0d54 (origin/branch-4.8)
> git config core.sparsecheckout # timeout=10
> git checkout -f ba6e6f12588144eda6bcb4d3f16ae67f089d0d54
Commit message: "[DLOG] Delete empty inprogress segment on recovery"
> git rev-list --no-walk ba6e6f12588144eda6bcb4d3f16ae67f089d0d54 # timeout=10
Cleaning workspace
> git rev-parse --verify HEAD # timeout=10
Resetting working tree
> git reset --hard # timeout=10
> git clean -fdx # timeout=10
Parsing POMs
Downloaded artifact http://repo.maven.apache.org/maven2/org/apache/apache/18/apache-18.pom
Established TCP socket on 33744
maven35-agent.jar already up to date
maven35-interceptor.jar already up to date
maven3-interceptor-commons.jar already up to date
[bookkeeper_release_branch_48_java9] $ /home/jenkins/tools/java/latest1.9/bin/java -Dorg.slf4j.simpleLogger.showDateTime=true -Dorg.slf4j.simpleLogger.dateTimeFormat=yyyy-MM-dd'T'HH:mm:ss.SSS -XX:+TieredCompilation -XX:TieredStopAtLevel=1 -Xmx4096m -Xms2048m -cp /home/jenkins/jenkins-slave/maven35-agent.jar:/home/jenkins/tools/maven/apache-maven-3.5.0/boot/plexus-classworlds-2.5.2.jar:/home/jenkins/tools/maven/apache-maven-3.5.0/conf/logging jenkins.maven3.agent.Maven35Main /home/jenkins/tools/maven/apache-maven-3.5.0 /home/jenkins/jenkins-slave/remoting.jar /home/jenkins/jenkins-slave/maven35-interceptor.jar /home/jenkins/jenkins-slave/maven3-interceptor-commons.jar 33744
/home/jenkins/tools/java/latest1.9/bin/java: error while loading shared libraries: libjli.so: cannot open shared object file: No such file or directory
ERROR: Failed to launch Maven. Exit code = 127
Build failed in Jenkins: bookkeeper_release_branch_48_java9 #323
Posted by Apache Jenkins Server <je...@builds.apache.org>.
See <https://builds.apache.org/job/bookkeeper_release_branch_48_java9/323/display/redirect>
------------------------------------------
Started by timer
[EnvInject] - Loading node environment variables.
Building remotely on H24 (ubuntu xenial) in workspace <https://builds.apache.org/job/bookkeeper_release_branch_48_java9/ws/>
No credentials specified
> git rev-parse --is-inside-work-tree # timeout=10
Fetching changes from the remote Git repository
> git config remote.origin.url https://github.com/apache/bookkeeper.git # timeout=10
Fetching upstream changes from https://github.com/apache/bookkeeper.git
> git --version # timeout=10
> git fetch --tags --progress https://github.com/apache/bookkeeper.git +refs/heads/*:refs/remotes/origin/* +refs/pull/${ghprbPullId}/*:refs/remotes/origin/pr/${ghprbPullId}/*
> git rev-parse origin/branch-4.8^{commit} # timeout=10
Checking out Revision ba6e6f12588144eda6bcb4d3f16ae67f089d0d54 (origin/branch-4.8)
> git config core.sparsecheckout # timeout=10
> git checkout -f ba6e6f12588144eda6bcb4d3f16ae67f089d0d54
Commit message: "[DLOG] Delete empty inprogress segment on recovery"
> git rev-list --no-walk ba6e6f12588144eda6bcb4d3f16ae67f089d0d54 # timeout=10
Cleaning workspace
> git rev-parse --verify HEAD # timeout=10
Resetting working tree
> git reset --hard # timeout=10
> git clean -fdx # timeout=10
Parsing POMs
Downloaded artifact http://repo.maven.apache.org/maven2/org/apache/apache/18/apache-18.pom
Established TCP socket on 46633
maven35-agent.jar already up to date
maven35-interceptor.jar already up to date
maven3-interceptor-commons.jar already up to date
[bookkeeper_release_branch_48_java9] $ /home/jenkins/tools/java/latest1.9/bin/java -Dorg.slf4j.simpleLogger.showDateTime=true -Dorg.slf4j.simpleLogger.dateTimeFormat=yyyy-MM-dd'T'HH:mm:ss.SSS -XX:+TieredCompilation -XX:TieredStopAtLevel=1 -Xmx4096m -Xms2048m -cp /home/jenkins/jenkins-slave/maven35-agent.jar:/home/jenkins/tools/maven/apache-maven-3.5.0/boot/plexus-classworlds-2.5.2.jar:/home/jenkins/tools/maven/apache-maven-3.5.0/conf/logging jenkins.maven3.agent.Maven35Main /home/jenkins/tools/maven/apache-maven-3.5.0 /home/jenkins/jenkins-slave/remoting.jar /home/jenkins/jenkins-slave/maven35-interceptor.jar /home/jenkins/jenkins-slave/maven3-interceptor-commons.jar 46633
/home/jenkins/tools/java/latest1.9/bin/java: error while loading shared libraries: libjli.so: cannot open shared object file: No such file or directory
ERROR: Failed to launch Maven. Exit code = 127
Build failed in Jenkins: bookkeeper_release_branch_48_java9 #322
Posted by Apache Jenkins Server <je...@builds.apache.org>.
See <https://builds.apache.org/job/bookkeeper_release_branch_48_java9/322/display/redirect>
------------------------------------------
Started by timer
[EnvInject] - Loading node environment variables.
Building remotely on H24 (ubuntu xenial) in workspace <https://builds.apache.org/job/bookkeeper_release_branch_48_java9/ws/>
No credentials specified
> git rev-parse --is-inside-work-tree # timeout=10
Fetching changes from the remote Git repository
> git config remote.origin.url https://github.com/apache/bookkeeper.git # timeout=10
Fetching upstream changes from https://github.com/apache/bookkeeper.git
> git --version # timeout=10
> git fetch --tags --progress https://github.com/apache/bookkeeper.git +refs/heads/*:refs/remotes/origin/* +refs/pull/${ghprbPullId}/*:refs/remotes/origin/pr/${ghprbPullId}/*
> git rev-parse origin/branch-4.8^{commit} # timeout=10
Checking out Revision ba6e6f12588144eda6bcb4d3f16ae67f089d0d54 (origin/branch-4.8)
> git config core.sparsecheckout # timeout=10
> git checkout -f ba6e6f12588144eda6bcb4d3f16ae67f089d0d54
Commit message: "[DLOG] Delete empty inprogress segment on recovery"
> git rev-list --no-walk ba6e6f12588144eda6bcb4d3f16ae67f089d0d54 # timeout=10
Cleaning workspace
> git rev-parse --verify HEAD # timeout=10
Resetting working tree
> git reset --hard # timeout=10
> git clean -fdx # timeout=10
Parsing POMs
Downloaded artifact http://repo.maven.apache.org/maven2/org/apache/apache/18/apache-18.pom
Established TCP socket on 38533
maven35-agent.jar already up to date
maven35-interceptor.jar already up to date
maven3-interceptor-commons.jar already up to date
[bookkeeper_release_branch_48_java9] $ /home/jenkins/tools/java/latest1.9/bin/java -Dorg.slf4j.simpleLogger.showDateTime=true -Dorg.slf4j.simpleLogger.dateTimeFormat=yyyy-MM-dd'T'HH:mm:ss.SSS -XX:+TieredCompilation -XX:TieredStopAtLevel=1 -Xmx4096m -Xms2048m -cp /home/jenkins/jenkins-slave/maven35-agent.jar:/home/jenkins/tools/maven/apache-maven-3.5.0/boot/plexus-classworlds-2.5.2.jar:/home/jenkins/tools/maven/apache-maven-3.5.0/conf/logging jenkins.maven3.agent.Maven35Main /home/jenkins/tools/maven/apache-maven-3.5.0 /home/jenkins/jenkins-slave/remoting.jar /home/jenkins/jenkins-slave/maven35-interceptor.jar /home/jenkins/jenkins-slave/maven3-interceptor-commons.jar 38533
/home/jenkins/tools/java/latest1.9/bin/java: error while loading shared libraries: libjli.so: cannot open shared object file: No such file or directory
ERROR: Failed to launch Maven. Exit code = 127
Build failed in Jenkins: bookkeeper_release_branch_48_java9 #321
Posted by Apache Jenkins Server <je...@builds.apache.org>.
See <https://builds.apache.org/job/bookkeeper_release_branch_48_java9/321/display/redirect>
------------------------------------------
Started by timer
[EnvInject] - Loading node environment variables.
Building remotely on H32 (ubuntu xenial) in workspace <https://builds.apache.org/job/bookkeeper_release_branch_48_java9/ws/>
No credentials specified
> git rev-parse --is-inside-work-tree # timeout=10
Fetching changes from the remote Git repository
> git config remote.origin.url https://github.com/apache/bookkeeper.git # timeout=10
Fetching upstream changes from https://github.com/apache/bookkeeper.git
> git --version # timeout=10
> git fetch --tags --progress https://github.com/apache/bookkeeper.git +refs/heads/*:refs/remotes/origin/* +refs/pull/${ghprbPullId}/*:refs/remotes/origin/pr/${ghprbPullId}/*
> git rev-parse origin/branch-4.8^{commit} # timeout=10
Checking out Revision ba6e6f12588144eda6bcb4d3f16ae67f089d0d54 (origin/branch-4.8)
> git config core.sparsecheckout # timeout=10
> git checkout -f ba6e6f12588144eda6bcb4d3f16ae67f089d0d54
Commit message: "[DLOG] Delete empty inprogress segment on recovery"
> git rev-list --no-walk ba6e6f12588144eda6bcb4d3f16ae67f089d0d54 # timeout=10
Cleaning workspace
> git rev-parse --verify HEAD # timeout=10
Resetting working tree
> git reset --hard # timeout=10
> git clean -fdx # timeout=10
Parsing POMs
Downloaded artifact http://repo.maven.apache.org/maven2/org/apache/apache/18/apache-18.pom
Established TCP socket on 40596
maven35-agent.jar already up to date
maven35-interceptor.jar already up to date
maven3-interceptor-commons.jar already up to date
[bookkeeper_release_branch_48_java9] $ /home/jenkins/tools/java/latest1.9/bin/java -Dorg.slf4j.simpleLogger.showDateTime=true -Dorg.slf4j.simpleLogger.dateTimeFormat=yyyy-MM-dd'T'HH:mm:ss.SSS -XX:+TieredCompilation -XX:TieredStopAtLevel=1 -Xmx4096m -Xms2048m -cp /home/jenkins/jenkins-slave/maven35-agent.jar:/home/jenkins/tools/maven/apache-maven-3.5.0/boot/plexus-classworlds-2.5.2.jar:/home/jenkins/tools/maven/apache-maven-3.5.0/conf/logging jenkins.maven3.agent.Maven35Main /home/jenkins/tools/maven/apache-maven-3.5.0 /home/jenkins/jenkins-slave/remoting.jar /home/jenkins/jenkins-slave/maven35-interceptor.jar /home/jenkins/jenkins-slave/maven3-interceptor-commons.jar 40596
/home/jenkins/tools/java/latest1.9/bin/java: error while loading shared libraries: libjli.so: cannot open shared object file: No such file or directory
ERROR: Failed to launch Maven. Exit code = 127
Build failed in Jenkins: bookkeeper_release_branch_48_java9 #320
Posted by Apache Jenkins Server <je...@builds.apache.org>.
See <https://builds.apache.org/job/bookkeeper_release_branch_48_java9/320/display/redirect>
------------------------------------------
Started by timer
[EnvInject] - Loading node environment variables.
Building remotely on H32 (ubuntu xenial) in workspace <https://builds.apache.org/job/bookkeeper_release_branch_48_java9/ws/>
No credentials specified
> git rev-parse --is-inside-work-tree # timeout=10
Fetching changes from the remote Git repository
> git config remote.origin.url https://github.com/apache/bookkeeper.git # timeout=10
Fetching upstream changes from https://github.com/apache/bookkeeper.git
> git --version # timeout=10
> git fetch --tags --progress https://github.com/apache/bookkeeper.git +refs/heads/*:refs/remotes/origin/* +refs/pull/${ghprbPullId}/*:refs/remotes/origin/pr/${ghprbPullId}/*
> git rev-parse origin/branch-4.8^{commit} # timeout=10
Checking out Revision ba6e6f12588144eda6bcb4d3f16ae67f089d0d54 (origin/branch-4.8)
> git config core.sparsecheckout # timeout=10
> git checkout -f ba6e6f12588144eda6bcb4d3f16ae67f089d0d54
Commit message: "[DLOG] Delete empty inprogress segment on recovery"
> git rev-list --no-walk ba6e6f12588144eda6bcb4d3f16ae67f089d0d54 # timeout=10
Cleaning workspace
> git rev-parse --verify HEAD # timeout=10
Resetting working tree
> git reset --hard # timeout=10
> git clean -fdx # timeout=10
Parsing POMs
Downloaded artifact http://repo.maven.apache.org/maven2/org/apache/apache/18/apache-18.pom
Established TCP socket on 43388
maven35-agent.jar already up to date
maven35-interceptor.jar already up to date
maven3-interceptor-commons.jar already up to date
[bookkeeper_release_branch_48_java9] $ /home/jenkins/tools/java/latest1.9/bin/java -Dorg.slf4j.simpleLogger.showDateTime=true -Dorg.slf4j.simpleLogger.dateTimeFormat=yyyy-MM-dd'T'HH:mm:ss.SSS -XX:+TieredCompilation -XX:TieredStopAtLevel=1 -Xmx4096m -Xms2048m -cp /home/jenkins/jenkins-slave/maven35-agent.jar:/home/jenkins/tools/maven/apache-maven-3.5.0/boot/plexus-classworlds-2.5.2.jar:/home/jenkins/tools/maven/apache-maven-3.5.0/conf/logging jenkins.maven3.agent.Maven35Main /home/jenkins/tools/maven/apache-maven-3.5.0 /home/jenkins/jenkins-slave/remoting.jar /home/jenkins/jenkins-slave/maven35-interceptor.jar /home/jenkins/jenkins-slave/maven3-interceptor-commons.jar 43388
/home/jenkins/tools/java/latest1.9/bin/java: error while loading shared libraries: libjli.so: cannot open shared object file: No such file or directory
ERROR: Failed to launch Maven. Exit code = 127
Build failed in Jenkins: bookkeeper_release_branch_48_java9 #319
Posted by Apache Jenkins Server <je...@builds.apache.org>.
See <https://builds.apache.org/job/bookkeeper_release_branch_48_java9/319/display/redirect>
------------------------------------------
Started by timer
[EnvInject] - Loading node environment variables.
Building remotely on H24 (ubuntu xenial) in workspace <https://builds.apache.org/job/bookkeeper_release_branch_48_java9/ws/>
No credentials specified
Cloning the remote Git repository
Cloning repository https://github.com/apache/bookkeeper.git
> git init <https://builds.apache.org/job/bookkeeper_release_branch_48_java9/ws/> # timeout=10
Fetching upstream changes from https://github.com/apache/bookkeeper.git
> git --version # timeout=10
> git fetch --tags --progress https://github.com/apache/bookkeeper.git +refs/heads/*:refs/remotes/origin/*
> git config remote.origin.url https://github.com/apache/bookkeeper.git # timeout=10
> git config --add remote.origin.fetch +refs/heads/*:refs/remotes/origin/* # timeout=10
> git config remote.origin.url https://github.com/apache/bookkeeper.git # timeout=10
Fetching upstream changes from https://github.com/apache/bookkeeper.git
> git fetch --tags --progress https://github.com/apache/bookkeeper.git +refs/heads/*:refs/remotes/origin/* +refs/pull/${ghprbPullId}/*:refs/remotes/origin/pr/${ghprbPullId}/*
> git rev-parse origin/branch-4.8^{commit} # timeout=10
Checking out Revision ba6e6f12588144eda6bcb4d3f16ae67f089d0d54 (origin/branch-4.8)
> git config core.sparsecheckout # timeout=10
> git checkout -f ba6e6f12588144eda6bcb4d3f16ae67f089d0d54
Commit message: "[DLOG] Delete empty inprogress segment on recovery"
> git rev-list --no-walk ba6e6f12588144eda6bcb4d3f16ae67f089d0d54 # timeout=10
Cleaning workspace
> git rev-parse --verify HEAD # timeout=10
Resetting working tree
> git reset --hard # timeout=10
> git clean -fdx # timeout=10
Parsing POMs
Downloaded artifact http://repo.maven.apache.org/maven2/org/apache/apache/18/apache-18.pom
Established TCP socket on 45152
maven35-agent.jar already up to date
maven35-interceptor.jar already up to date
maven3-interceptor-commons.jar already up to date
[bookkeeper_release_branch_48_java9] $ /home/jenkins/tools/java/latest1.9/bin/java -Dorg.slf4j.simpleLogger.showDateTime=true -Dorg.slf4j.simpleLogger.dateTimeFormat=yyyy-MM-dd'T'HH:mm:ss.SSS -XX:+TieredCompilation -XX:TieredStopAtLevel=1 -Xmx4096m -Xms2048m -cp /home/jenkins/jenkins-slave/maven35-agent.jar:/home/jenkins/tools/maven/apache-maven-3.5.0/boot/plexus-classworlds-2.5.2.jar:/home/jenkins/tools/maven/apache-maven-3.5.0/conf/logging jenkins.maven3.agent.Maven35Main /home/jenkins/tools/maven/apache-maven-3.5.0 /home/jenkins/jenkins-slave/remoting.jar /home/jenkins/jenkins-slave/maven35-interceptor.jar /home/jenkins/jenkins-slave/maven3-interceptor-commons.jar 45152
/home/jenkins/tools/java/latest1.9/bin/java: error while loading shared libraries: libjli.so: cannot open shared object file: No such file or directory
ERROR: Failed to launch Maven. Exit code = 127