You are viewing a plain text version of this content. The canonical link for it is here.
Posted to builds@mesos.apache.org by Apache Jenkins Server <je...@builds.apache.org> on 2018/03/26 19:03:07 UTC
Build failed in Jenkins: Mesos-Reviewbot #22008
See <https://builds.apache.org/job/Mesos-Reviewbot/22008/display/redirect?page=changes>
Changes:
[yujie.jay] Made network addition docs consistent.
[alexr] Removed SlaveTest.ChangeDomain.
------------------------------------------
[...truncated 35.34 MB...]
I0326 19:02:59.050763 5325 http.cpp:936] Authorizing principal 'test-principal' to GET the '/monitor/statistics' endpoint
I0326 19:02:59.054921 5323 slave.cpp:919] Agent terminating
[ OK ] Endpoint/SlaveEndpointTest.AuthorizedRequest/0 (57 ms)
[ RUN ] Endpoint/SlaveEndpointTest.AuthorizedRequest/1
I0326 19:02:59.070925 5321 containerizer.cpp:304] Using isolation { environment_secret, posix/cpu, posix/mem, filesystem/posix, network/cni }
W0326 19:02:59.071699 5321 backend.cpp:76] Failed to create 'aufs' backend: AufsBackend requires root privileges
W0326 19:02:59.071728 5321 backend.cpp:76] Failed to create 'bind' backend: BindBackend requires root privileges
I0326 19:02:59.071821 5321 provisioner.cpp:299] Using default backend 'copy'
I0326 19:02:59.077096 5324 slave.cpp:261] Mesos agent started on (948)@172.17.0.2:54002
I0326 19:02:59.077205 5324 slave.cpp:262] Flags at startup: --acls="" --appc_simple_discovery_uri_prefix="http://" --appc_store_dir="/tmp/Endpoint_SlaveEndpointTest_AuthorizedRequest_1_9tBGux/store/appc" --authenticate_http_readonly="true" --authenticate_http_readwrite="false" --authenticatee="crammd5" --authentication_backoff_factor="1secs" --authorizer="local" --cgroups_cpu_enable_pids_and_tids_count="false" --cgroups_enable_cfs="false" --cgroups_hierarchy="/sys/fs/cgroup" --cgroups_limit_swap="false" --cgroups_root="mesos" --container_disk_watch_interval="15secs" --containerizers="mesos" --credential="/tmp/Endpoint_SlaveEndpointTest_AuthorizedRequest_1_9tBGux/credential" --default_role="*" --disallow_sharing_agent_pid_namespace="false" --disk_watch_interval="1mins" --docker="docker" --docker_kill_orphans="true" --docker_registry="https://registry-1.docker.io" --docker_remove_delay="6hrs" --docker_socket="/var/run/docker.sock" --docker_stop_timeout="0ns" --docker_store_dir="/tmp/Endpoint_SlaveEndpointTest_AuthorizedRequest_1_9tBGux/store/docker" --docker_volume_checkpoint_dir="/var/run/mesos/isolators/docker/volume" --enforce_container_disk_quota="false" --executor_registration_timeout="1mins" --executor_reregistration_timeout="2secs" --executor_shutdown_grace_period="5secs" --fetcher_cache_dir="/tmp/Endpoint_SlaveEndpointTest_AuthorizedRequest_1_9tBGux/fetch" --fetcher_cache_size="2GB" --frameworks_home="" --gc_delay="1weeks" --gc_disk_headroom="0.1" --hadoop_home="" --help="false" --hostname_lookup="true" --http_command_executor="false" --http_credentials="/tmp/Endpoint_SlaveEndpointTest_AuthorizedRequest_1_9tBGux/http_credentials" --http_heartbeat_interval="30secs" --initialize_driver_logging="true" --isolation="posix/cpu,posix/mem" --launcher="posix" --launcher_dir="/tmp/SRC/build/mesos-1.6.0/_build/sub/src" --logbufsecs="0" --logging_level="INFO" --max_completed_executors_per_framework="150" --oversubscribed_resources_interval="15secs" --perf_duration="10secs" --perf_interval="1mins" --port="5051" --qos_correction_interval_min="0ns" --quiet="false" --reconfiguration_policy="equal" --recover="reconnect" --recovery_timeout="15mins" --registration_backoff_factor="10ms" --resources="cpus:2;gpus:0;mem:1024;disk:1024;ports:[31000-32000]" --revocable_cpu_low_priority="true" --runtime_dir="/tmp/Endpoint_SlaveEndpointTest_AuthorizedRequest_1_9tBGux" --sandbox_directory="/mnt/mesos/sandbox" --strict="true" --switch_user="true" --systemd_enable_support="true" --systemd_runtime_directory="/run/systemd/system" --version="false" --work_dir="/tmp/Endpoint_SlaveEndpointTest_AuthorizedRequest_1_cIMCd4" --zk_session_timeout="10secs"
I0326 19:02:59.077998 5324 credentials.hpp:86] Loading credential for authentication from '/tmp/Endpoint_SlaveEndpointTest_AuthorizedRequest_1_9tBGux/credential'
I0326 19:02:59.078310 5324 slave.cpp:294] Agent using credential for: test-principal
I0326 19:02:59.078416 5324 credentials.hpp:37] Loading credentials for authentication from '/tmp/Endpoint_SlaveEndpointTest_AuthorizedRequest_1_9tBGux/http_credentials'
I0326 19:02:59.078845 5324 http.cpp:959] Creating default 'basic' HTTP authenticator for realm 'mesos-agent-readonly'
I0326 19:02:59.079358 5324 disk_profile_adaptor.cpp:80] Creating default disk profile adaptor module
I0326 19:02:59.081660 5324 slave.cpp:609] Agent resources: [{"name":"cpus","scalar":{"value":2.0},"type":"SCALAR"},{"name":"mem","scalar":{"value":1024.0},"type":"SCALAR"},{"name":"disk","scalar":{"value":1024.0},"type":"SCALAR"},{"name":"ports","ranges":{"range":[{"begin":31000,"end":32000}]},"type":"RANGES"}]
I0326 19:02:59.082036 5324 slave.cpp:617] Agent attributes: [ ]
I0326 19:02:59.082056 5324 slave.cpp:626] Agent hostname: 9ca693f8aa79
I0326 19:02:59.083091 5328 task_status_update_manager.cpp:181] Pausing sending task status updates
I0326 19:02:59.084478 5327 state.cpp:66] Recovering state from '/tmp/Endpoint_SlaveEndpointTest_AuthorizedRequest_1_cIMCd4/meta'
I0326 19:02:59.084983 5322 task_status_update_manager.cpp:207] Recovering task status update manager
I0326 19:02:59.085250 5322 containerizer.cpp:674] Recovering containerizer
I0326 19:02:59.087054 5327 provisioner.cpp:495] Provisioner recovery complete
I0326 19:02:59.087579 5327 slave.cpp:7212] Finished recovery
I0326 19:02:59.091976 5335 process.cpp:3564] Handling HTTP event for process 'slave(948)' with path: '/slave(948)/monitor/statistics.json'
I0326 19:02:59.094595 5322 http.cpp:1099] HTTP GET for /slave(948)/monitor/statistics.json from 172.17.0.2:60554
I0326 19:02:59.094689 5322 http.cpp:936] Authorizing principal 'test-principal' to GET the '/monitor/statistics.json' endpoint
I0326 19:02:59.098378 5336 slave.cpp:919] Agent terminating
[ OK ] Endpoint/SlaveEndpointTest.AuthorizedRequest/1 (64 ms)
[ RUN ] Endpoint/SlaveEndpointTest.AuthorizedRequest/2
I0326 19:02:59.135540 5321 containerizer.cpp:304] Using isolation { environment_secret, posix/cpu, posix/mem, filesystem/posix, network/cni }
W0326 19:02:59.136404 5321 backend.cpp:76] Failed to create 'aufs' backend: AufsBackend requires root privileges
W0326 19:02:59.136430 5321 backend.cpp:76] Failed to create 'bind' backend: BindBackend requires root privileges
I0326 19:02:59.136459 5321 provisioner.cpp:299] Using default backend 'copy'
I0326 19:02:59.142151 5337 slave.cpp:261] Mesos agent started on (949)@172.17.0.2:54002
I0326 19:02:59.142343 5337 slave.cpp:262] Flags at startup: --acls="" --appc_simple_discovery_uri_prefix="http://" --appc_store_dir="/tmp/Endpoint_SlaveEndpointTest_AuthorizedRequest_2_fTRf9q/store/appc" --authenticate_http_readonly="true" --authenticate_http_readwrite="false" --authenticatee="crammd5" --authentication_backoff_factor="1secs" --authorizer="local" --cgroups_cpu_enable_pids_and_tids_count="false" --cgroups_enable_cfs="false" --cgroups_hierarchy="/sys/fs/cgroup" --cgroups_limit_swap="false" --cgroups_root="mesos" --container_disk_watch_interval="15secs" --containerizers="mesos" --credential="/tmp/Endpoint_SlaveEndpointTest_AuthorizedRequest_2_fTRf9q/credential" --default_role="*" --disallow_sharing_agent_pid_namespace="false" --disk_watch_interval="1mins" --docker="docker" --docker_kill_orphans="true" --docker_registry="https://registry-1.docker.io" --docker_remove_delay="6hrs" --docker_socket="/var/run/docker.sock" --docker_stop_timeout="0ns" --docker_store_dir="/tmp/Endpoint_SlaveEndpointTest_AuthorizedRequest_2_fTRf9q/store/docker" --docker_volume_checkpoint_dir="/var/run/mesos/isolators/docker/volume" --enforce_container_disk_quota="false" --executor_registration_timeout="1mins" --executor_reregistration_timeout="2secs" --executor_shutdown_grace_period="5secs" --fetcher_cache_dir="/tmp/Endpoint_SlaveEndpointTest_AuthorizedRequest_2_fTRf9q/fetch" --fetcher_cache_size="2GB" --frameworks_home="" --gc_delay="1weeks" --gc_disk_headroom="0.1" --hadoop_home="" --help="false" --hostname_lookup="true" --http_command_executor="false" --http_credentials="/tmp/Endpoint_SlaveEndpointTest_AuthorizedRequest_2_fTRf9q/http_credentials" --http_heartbeat_interval="30secs" --initialize_driver_logging="true" --isolation="posix/cpu,posix/mem" --launcher="posix" --launcher_dir="/tmp/SRC/build/mesos-1.6.0/_build/sub/src" --logbufsecs="0" --logging_level="INFO" --max_completed_executors_per_framework="150" --oversubscribed_resources_interval="15secs" --perf_duration="10secs" --perf_interval="1mins" --port="5051" --qos_correction_interval_min="0ns" --quiet="false" --reconfiguration_policy="equal" --recover="reconnect" --recovery_timeout="15mins" --registration_backoff_factor="10ms" --resources="cpus:2;gpus:0;mem:1024;disk:1024;ports:[31000-32000]" --revocable_cpu_low_priority="true" --runtime_dir="/tmp/Endpoint_SlaveEndpointTest_AuthorizedRequest_2_fTRf9q" --sandbox_directory="/mnt/mesos/sandbox" --strict="true" --switch_user="true" --systemd_enable_support="true" --systemd_runtime_directory="/run/systemd/system" --version="false" --work_dir="/tmp/Endpoint_SlaveEndpointTest_AuthorizedRequest_2_ThPHHX" --zk_session_timeout="10secs"
I0326 19:02:59.143143 5337 credentials.hpp:86] Loading credential for authentication from '/tmp/Endpoint_SlaveEndpointTest_AuthorizedRequest_2_fTRf9q/credential'
I0326 19:02:59.143455 5337 slave.cpp:294] Agent using credential for: test-principal
I0326 19:02:59.143545 5337 credentials.hpp:37] Loading credentials for authentication from '/tmp/Endpoint_SlaveEndpointTest_AuthorizedRequest_2_fTRf9q/http_credentials'
I0326 19:02:59.143939 5337 http.cpp:959] Creating default 'basic' HTTP authenticator for realm 'mesos-agent-readonly'
I0326 19:02:59.144539 5337 disk_profile_adaptor.cpp:80] Creating default disk profile adaptor module
I0326 19:02:59.147064 5337 slave.cpp:609] Agent resources: [{"name":"cpus","scalar":{"value":2.0},"type":"SCALAR"},{"name":"mem","scalar":{"value":1024.0},"type":"SCALAR"},{"name":"disk","scalar":{"value":1024.0},"type":"SCALAR"},{"name":"ports","ranges":{"range":[{"begin":31000,"end":32000}]},"type":"RANGES"}]
I0326 19:02:59.147508 5337 slave.cpp:617] Agent attributes: [ ]
I0326 19:02:59.147578 5337 slave.cpp:626] Agent hostname: 9ca693f8aa79
I0326 19:02:59.147848 5336 task_status_update_manager.cpp:181] Pausing sending task status updates
I0326 19:02:59.150295 5337 state.cpp:66] Recovering state from '/tmp/Endpoint_SlaveEndpointTest_AuthorizedRequest_2_ThPHHX/meta'
I0326 19:02:59.150709 5325 task_status_update_manager.cpp:207] Recovering task status update manager
I0326 19:02:59.151134 5333 containerizer.cpp:674] Recovering containerizer
I0326 19:02:59.153142 5329 provisioner.cpp:495] Provisioner recovery complete
I0326 19:02:59.153704 5329 slave.cpp:7212] Finished recovery
I0326 19:02:59.157977 5334 process.cpp:3564] Handling HTTP event for process 'slave(949)' with path: '/slave(949)/containers'
I0326 19:02:59.160140 5330 http.cpp:1099] HTTP GET for /slave(949)/containers from 172.17.0.2:60555
I0326 19:02:59.160235 5330 http.cpp:936] Authorizing principal 'test-principal' to GET the '/containers' endpoint
I0326 19:02:59.165421 5336 slave.cpp:919] Agent terminating
[ OK ] Endpoint/SlaveEndpointTest.AuthorizedRequest/2 (51 ms)
[ RUN ] Endpoint/SlaveEndpointTest.UnauthorizedRequest/0
I0326 19:02:59.190358 5321 containerizer.cpp:304] Using isolation { environment_secret, posix/cpu, posix/mem, filesystem/posix, network/cni }
W0326 19:02:59.191177 5321 backend.cpp:76] Failed to create 'aufs' backend: AufsBackend requires root privileges
W0326 19:02:59.191215 5321 backend.cpp:76] Failed to create 'bind' backend: BindBackend requires root privileges
I0326 19:02:59.191260 5321 provisioner.cpp:299] Using default backend 'copy'
I0326 19:02:59.198468 5329 slave.cpp:261] Mesos agent started on (950)@172.17.0.2:54002
I0326 19:02:59.198583 5329 slave.cpp:262] Flags at startup: --acls="" --appc_simple_discovery_uri_prefix="http://" --appc_store_dir="/tmp/Endpoint_SlaveEndpointTest_UnauthorizedRequest_0_tNRool/store/appc" --authenticate_http_readonly="true" --authenticate_http_readwrite="false" --authenticatee="crammd5" --authentication_backoff_factor="1secs" --authorizer="local" --cgroups_cpu_enable_pids_and_tids_count="false" --cgroups_enable_cfs="false" --cgroups_hierarchy="/sys/fs/cgroup" --cgroups_limit_swap="false" --cgroups_root="mesos" --container_disk_watch_interval="15secs" --containerizers="mesos" --credential="/tmp/Endpoint_SlaveEndpointTest_UnauthorizedRequest_0_tNRool/credential" --default_role="*" --disallow_sharing_agent_pid_namespace="false" --disk_watch_interval="1mins" --docker="docker" --docker_kill_orphans="true" --docker_registry="https://registry-1.docker.io" --docker_remove_delay="6hrs" --docker_socket="/var/run/docker.sock" --docker_stop_timeout="0ns" --docker_store_dir="/tmp/Endpoint_SlaveEndpointTest_UnauthorizedRequest_0_tNRool/store/docker" --docker_volume_checkpoint_dir="/var/run/mesos/isolators/docker/volume" --enforce_container_disk_quota="false" --executor_registration_timeout="1mins" --executor_reregistration_timeout="2secs" --executor_shutdown_grace_period="5secs" --fetcher_cache_dir="/tmp/Endpoint_SlaveEndpointTest_UnauthorizedRequest_0_tNRool/fetch" --fetcher_cache_size="2GB" --frameworks_home="" --gc_delay="1weeks" --gc_disk_headroom="0.1" --hadoop_home="" --help="false" --hostname_lookup="true" --http_command_executor="false" --http_credentials="/tmp/Endpoint_SlaveEndpointTest_UnauthorizedRequest_0_tNRool/http_credentials" --http_heartbeat_interval="30secs" --initialize_driver_logging="true" --isolation="posix/cpu,posix/mem" --launcher="posix" --launcher_dir="/tmp/SRC/build/mesos-1.6.0/_build/sub/src" --logbufsecs="0" --logging_level="INFO" --max_completed_executors_per_framework="150" --oversubscribed_resources_interval="15secs" --perf_duration="10secs" --perf_interval="1mins" --port="5051" --qos_correction_interval_min="0ns" --quiet="false" --reconfiguration_policy="equal" --recover="reconnect" --recovery_timeout="15mins" --registration_backoff_factor="10ms" --resources="cpus:2;gpus:0;mem:1024;disk:1024;ports:[31000-32000]" --revocable_cpu_low_priority="true" --runtime_dir="/tmp/Endpoint_SlaveEndpointTest_UnauthorizedRequest_0_tNRool" --sandbox_directory="/mnt/mesos/sandbox" --strict="true" --switch_user="true" --systemd_enable_support="true" --systemd_runtime_directory="/run/systemd/system" --version="false" --work_dir="/tmp/Endpoint_SlaveEndpointTest_UnauthorizedRequest_0_72QaOR" --zk_session_timeout="10secs"
I0326 19:02:59.199347 5329 credentials.hpp:86] Loading credential for authentication from '/tmp/Endpoint_SlaveEndpointTest_UnauthorizedRequest_0_tNRool/credential'
I0326 19:02:59.199746 5329 slave.cpp:294] Agent using credential for: test-principal
I0326 19:02:59.199857 5329 credentials.hpp:37] Loading credentials for authentication from '/tmp/Endpoint_SlaveEndpointTest_UnauthorizedRequest_0_tNRool/http_credentials'
I0326 19:02:59.200331 5329 http.cpp:959] Creating default 'basic' HTTP authenticator for realm 'mesos-agent-readonly'
I0326 19:02:59.200944 5329 disk_profile_adaptor.cpp:80] Creating default disk profile adaptor module
I0326 19:02:59.203178 5329 slave.cpp:609] Agent resources: [{"name":"cpus","scalar":{"value":2.0},"type":"SCALAR"},{"name":"mem","scalar":{"value":1024.0},"type":"SCALAR"},{"name":"disk","scalar":{"value":1024.0},"type":"SCALAR"},{"name":"ports","ranges":{"range":[{"begin":31000,"end":32000}]},"type":"RANGES"}]
I0326 19:02:59.203573 5329 slave.cpp:617] Agent attributes: [ ]
I0326 19:02:59.203637 5329 slave.cpp:626] Agent hostname: 9ca693f8aa79
I0326 19:02:59.203990 5331 task_status_update_manager.cpp:181] Pausing sending task status updates
I0326 19:02:59.206449 5322 state.cpp:66] Recovering state from '/tmp/Endpoint_SlaveEndpointTest_UnauthorizedRequest_0_72QaOR/meta'
I0326 19:02:59.207031 5322 task_status_update_manager.cpp:207] Recovering task status update manager
I0326 19:02:59.207448 5324 containerizer.cpp:674] Recovering containerizer
I0326 19:02:59.209925 5327 provisioner.cpp:495] Provisioner recovery complete
I0326 19:02:59.210819 5327 slave.cpp:7212] Finished recovery
I0326 19:02:59.215489 5325 process.cpp:3564] Handling HTTP event for process 'slave(950)' with path: '/slave(950)/monitor/statistics'
I0326 19:02:59.218272 5324 http.cpp:1099] HTTP GET for /slave(950)/monitor/statistics from 172.17.0.2:60560
I0326 19:02:59.218559 5324 http.cpp:936] Authorizing principal 'test-principal' to GET the '/monitor/statistics' endpoint
I0326 19:02:59.221217 5321 slave.cpp:919] Agent terminating
[ OK ] Endpoint/SlaveEndpointTest.UnauthorizedRequest/0 (89 ms)
[ RUN ] Endpoint/SlaveEndpointTest.UnauthorizedRequest/1
I0326 19:02:59.280287 5321 containerizer.cpp:304] Using isolation { environment_secret, posix/cpu, posix/mem, filesystem/posix, network/cni }
W0326 19:02:59.281137 5321 backend.cpp:76] Failed to create 'aufs' backend: AufsBackend requires root privileges
W0326 19:02:59.281175 5321 backend.cpp:76] Failed to create 'bind' backend: BindBackend requires root privileges
I0326 19:02:59.281317 5321 provisioner.cpp:299] Using default backend 'copy'
I0326 19:02:59.289214 5335 slave.cpp:261] Mesos agent started on (951)@172.17.0.2:54002
I0326 19:02:59.289371 5335 slave.cpp:262] Flags at startup: --acls="" --appc_simple_discovery_uri_prefix="http://" --appc_store_dir="/tmp/Endpoint_SlaveEndpointTest_UnauthorizedRequest_1_5pazug/store/appc" --authenticate_http_readonly="true" --authenticate_http_readwrite="false" --authenticatee="crammd5" --authentication_backoff_factor="1secs" --authorizer="local" --cgroups_cpu_enable_pids_and_tids_count="false" --cgroups_enable_cfs="false" --cgroups_hierarchy="/sys/fs/cgroup" --cgroups_limit_swap="false" --cgroups_root="mesos" --container_disk_watch_interval="15secs" --containerizers="mesos" --credential="/tmp/Endpoint_SlaveEndpointTest_UnauthorizedRequest_1_5pazug/credential" --default_role="*" --disallow_sharing_agent_pid_namespace="false" --disk_watch_interval="1mins" --docker="docker" --docker_kill_orphans="true" --docker_registry="https://registry-1.docker.io" --docker_remove_delay="6hrs" --docker_socket="/var/run/docker.sock" --docker_stop_timeout="0ns" --docker_store_dir="/tmp/Endpoint_SlaveEndpointTest_UnauthorizedRequest_1_5pazug/store/docker" --docker_volume_checkpoint_dir="/var/run/mesos/isolators/docker/volume" --enforce_container_disk_quota="false" --executor_registration_timeout="1mins" --executor_reregistration_timeout="2secs" --executor_shutdown_grace_period="5secs" --fetcher_cache_dir="/tmp/Endpoint_SlaveEndpointTest_UnauthorizedRequest_1_5pazug/fetch" --fetcher_cache_size="2GB" --frameworks_home="" --gc_delay="1weeks" --gc_disk_headroom="0.1" --hadoop_home="" --help="false" --hostname_lookup="true" --http_command_executor="false" --http_credentials="/tmp/Endpoint_SlaveEndpointTest_UnauthorizedRequest_1_5pazug/http_credentials" --http_heartbeat_interval="30secs" --initialize_driver_logging="true" --isolation="posix/cpu,posix/mem" --launcher="posix" --launcher_dir="/tmp/SRC/build/mesos-1.6.0/_build/sub/src" --logbufsecs="0" --logging_level="INFO" --max_completed_executors_per_framework="150" --oversubscribed_resources_interval="15secs" --perf_duration="10secs" --perf_interval="1mins" --port="5051" --qos_correction_interval_min="0ns" --quiet="false" --reconfiguration_policy="equal" --recover="reconnect" --recovery_timeout="15mins" --registration_backoff_factor="10ms" --resources="cpus:2;gpus:0;mem:1024;disk:1024;ports:[31000-32000]" --revocable_cpu_low_priority="true" --runtime_dir="/tmp/Endpoint_SlaveEndpointTest_UnauthorizedRequest_1_5pazug" --sandbox_directory="/mnt/mesos/sandbox" --strict="true" --switch_user="true" --systemd_enable_support="true" --systemd_runtime_directory="/run/systemd/system" --version="false" --work_dir="/tmp/Endpoint_SlaveEndpointTest_UnauthorizedRequest_1_xdpLFM" --zk_session_timeout="10secs"
I0326 19:02:59.290132 5335 credentials.hpp:86] Loading credential for authentication from '/tmp/Endpoint_SlaveEndpointTest_UnauthorizedRequest_1_5pazug/credential'
I0326 19:02:59.290451 5335 slave.cpp:294] Agent using credential for: test-principal
I0326 19:02:59.290539 5335 credentials.hpp:37] Loading credentials for authentication from '/tmp/Endpoint_SlaveEndpointTest_UnauthorizedRequest_1_5pazug/http_credentials'
I0326 19:02:59.290933 5335 http.cpp:959] Creating default 'basic' HTTP authenticator for realm 'mesos-agent-readonly'
I0326 19:02:59.291481 5335 disk_profile_adaptor.cpp:80] Creating default disk profile adaptor module
I0326 19:02:59.293983 5335 slave.cpp:609] Agent resources: [{"name":"cpus","scalar":{"value":2.0},"type":"SCALAR"},{"name":"mem","scalar":{"value":1024.0},"type":"SCALAR"},{"name":"disk","scalar":{"value":1024.0},"type":"SCALAR"},{"name":"ports","ranges":{"range":[{"begin":31000,"end":32000}]},"type":"RANGES"}]
I0326 19:02:59.294425 5335 slave.cpp:617] Agent attributes: [ ]
I0326 19:02:59.294503 5335 slave.cpp:626] Agent hostname: 9ca693f8aa79
I0326 19:02:59.295683 5337 task_status_update_manager.cpp:181] Pausing sending task status updates
I0326 19:02:59.297214 5323 state.cpp:66] Recovering state from '/tmp/Endpoint_SlaveEndpointTest_UnauthorizedRequest_1_xdpLFM/meta'
I0326 19:02:59.298034 5323 task_status_update_manager.cpp:207] Recovering task status update manager
I0326 19:02:59.298411 5332 containerizer.cpp:674] Recovering containerizer
I0326 19:02:59.301354 5322 provisioner.cpp:495] Provisioner recovery complete
I0326 19:02:59.302243 5322 slave.cpp:7212] Finished recovery
I0326 19:02:59.308331 5329 process.cpp:3564] Handling HTTP event for process 'slave(951)' with path: '/slave(951)/monitor/statistics.json'
I0326 19:02:59.311417 5334 http.cpp:1099] HTTP GET for /slave(951)/monitor/statistics.json from 172.17.0.2:60561
I0326 19:02:59.311533 5334 http.cpp:936] Authorizing principal 'test-principal' to GET the '/monitor/statistics.json' endpoint
I0326 19:02:59.337455 5321 slave.cpp:919] Agent terminating
[ OK ] Endpoint/SlaveEndpointTest.UnauthorizedRequest/1 (155 ms)
[ RUN ] Endpoint/SlaveEndpointTest.UnauthorizedRequest/2
I0326 19:02:59.437813 5321 containerizer.cpp:304] Using isolation { environment_secret, posix/cpu, posix/mem, filesystem/posix, network/cni }
W0326 19:02:59.438681 5321 backend.cpp:76] Failed to create 'aufs' backend: AufsBackend requires root privileges
W0326 19:02:59.438716 5321 backend.cpp:76] Failed to create 'bind' backend: BindBackend requires root privileges
I0326 19:02:59.438762 5321 provisioner.cpp:299] Using default backend 'copy'
I0326 19:02:59.446210 5334 slave.cpp:261] Mesos agent started on (952)@172.17.0.2:54002
I0326 19:02:59.446440 5334 slave.cpp:262] Flags at startup: --acls="" --appc_simple_discovery_uri_prefix="http://" --appc_store_dir="/tmp/Endpoint_SlaveEndpointTest_UnauthorizedRequest_2_ky9n3c/store/appc" --authenticate_http_readonly="true" --authenticate_http_readwrite="false" --authenticatee="crammd5" --authentication_backoff_factor="1secs" --authorizer="local" --cgroups_cpu_enable_pids_and_tids_count="false" --cgroups_enable_cfs="false" --cgroups_hierarchy="/sys/fs/cgroup" --cgroups_limit_swap="false" --cgroups_root="mesos" --container_disk_watch_interval="15secs" --containerizers="mesos" --credential="/tmp/Endpoint_SlaveEndpointTest_UnauthorizedRequest_2_ky9n3c/credential" --default_role="*" --disallow_sharing_agent_pid_namespace="false" --disk_watch_interval="1mins" --docker="docker" --docker_kill_orphans="true" --docker_registry="https://registry-1.docker.io" --docker_remove_delay="6hrs" --docker_socket="/var/run/docker.sock" --docker_stop_timeout="0ns" --docker_store_dir="/tmp/Endpoint_SlaveEndpointTest_UnauthorizedRequest_2_ky9n3c/store/docker" --docker_volume_checkpoint_dir="/var/run/mesos/isolators/docker/volume" --enforce_container_disk_quota="false" --executor_registration_timeout="1mins" --executor_reregistration_timeout="2secs" --executor_shutdown_grace_period="5secs" --fetcher_cache_dir="/tmp/Endpoint_SlaveEndpointTest_UnauthorizedRequest_2_ky9n3c/fetch" --fetcher_cache_size="2GB" --frameworks_home="" --gc_delay="1weeks" --gc_disk_headroom="0.1" --hadoop_home="" --help="false" --hostname_lookup="true" --http_command_executor="false" --http_credentials="/tmp/Endpoint_SlaveEndpointTest_UnauthorizedRequest_2_ky9n3c/http_credentials" --http_heartbeat_interval="30secs" --initialize_driver_logging="true" --isolation="posix/cpu,posix/mem" --launcher="posix" --launcher_dir="/tmp/SRC/build/mesos-1.6.0/_build/sub/src" --logbufsecs="0" --logging_level="INFO" --max_completed_executors_per_framework="150" --oversubscribed_resources_interval="15secs" --perf_duration="10secs" --perf_interval="1mins" --port="5051" --qos_correction_interval_min="0ns" --quiet="false" --reconfiguration_policy="equal" --recover="reconnect" --recovery_timeout="15mins" --registration_backoff_factor="10ms" --resources="cpus:2;gpus:0;mem:1024;disk:1024;ports:[31000-32000]" --revocable_cpu_low_priority="true" --runtime_dir="/tmp/Endpoint_SlaveEndpointTest_UnauthorizedRequest_2_ky9n3c" --sandbox_directory="/mnt/mesos/sandbox" --strict="true" --switch_user="true" --systemd_enable_support="true" --systemd_runtime_directory="/run/systemd/system" --version="false" --work_dir="/tmp/Endpoint_SlaveEndpointTest_UnauthorizedRequest_2_WBSjPI" --zk_session_timeout="10secs"
I0326 19:02:59.447464 5334 credentials.hpp:86] Loading credential for authentication from '/tmp/Endpoint_SlaveEndpointTest_UnauthorizedRequest_2_ky9n3c/credential'
I0326 19:02:59.447921 5334 slave.cpp:294] Agent using credential for: test-principal
I0326 19:02:59.448081 5334 credentials.hpp:37] Loading credentials for authentication from '/tmp/Endpoint_SlaveEndpointTest_UnauthorizedRequest_2_ky9n3c/http_credentials'
I0326 19:02:59.448568 5334 http.cpp:959] Creating default 'basic' HTTP authenticator for realm 'mesos-agent-readonly'
I0326 19:02:59.449280 5334 disk_profile_adaptor.cpp:80] Creating default disk profile adaptor module
I0326 19:02:59.451871 5334 slave.cpp:609] Agent resources: [{"name":"cpus","scalar":{"value":2.0},"type":"SCALAR"},{"name":"mem","scalar":{"value":1024.0},"type":"SCALAR"},{"name":"disk","scalar":{"value":1024.0},"type":"SCALAR"},{"name":"ports","ranges":{"range":[{"begin":31000,"end":32000}]},"type":"RANGES"}]
I0326 19:02:59.452366 5334 slave.cpp:617] Agent attributes: [ ]
I0326 19:02:59.452472 5334 slave.cpp:626] Agent hostname: 9ca693f8aa79
I0326 19:02:59.452889 5336 task_status_update_manager.cpp:181] Pausing sending task status updates
I0326 19:02:59.456995 5337 state.cpp:66] Recovering state from '/tmp/Endpoint_SlaveEndpointTest_UnauthorizedRequest_2_WBSjPI/meta'
I0326 19:02:59.465586 5323 task_status_update_manager.cpp:207] Recovering task status update manager
I0326 19:02:59.465963 5329 containerizer.cpp:674] Recovering containerizer
I0326 19:02:59.468536 5331 provisioner.cpp:495] Provisioner recovery complete
I0326 19:02:59.469278 5328 slave.cpp:7212] Finished recovery
I0326 19:02:59.480862 5337 process.cpp:3564] Handling HTTP event for process 'slave(952)' with path: '/slave(952)/containers'
I0326 19:02:59.483180 5328 http.cpp:1099] HTTP GET for /slave(952)/containers from 172.17.0.2:60562
I0326 19:02:59.483345 5328 http.cpp:936] Authorizing principal 'test-principal' to GET the '/containers' endpoint
I0326 19:02:59.486143 5330 slave.cpp:919] Agent terminating
[ OK ] Endpoint/SlaveEndpointTest.UnauthorizedRequest/2 (87 ms)
[ RUN ] Endpoint/SlaveEndpointTest.NoAuthorizer/0
I0326 19:02:59.522400 5321 containerizer.cpp:304] Using isolation { environment_secret, posix/cpu, posix/mem, filesystem/posix, network/cni }
W0326 19:02:59.523125 5321 backend.cpp:76] Failed to create 'aufs' backend: AufsBackend requires root privileges
W0326 19:02:59.523154 5321 backend.cpp:76] Failed to create 'bind' backend: BindBackend requires root privileges
I0326 19:02:59.523191 5321 provisioner.cpp:299] Using default backend 'copy'
I0326 19:02:59.526244 5321 cluster.cpp:460] Creating default 'local' authorizer
I0326 19:02:59.530309 5332 slave.cpp:261] Mesos agent started on (953)@172.17.0.2:54002
I0326 19:02:59.530341 5332 slave.cpp:262] Flags at startup: --acls="" --appc_simple_discovery_uri_prefix="http://" --appc_store_dir="/tmp/Endpoint_SlaveEndpointTest_NoAuthorizer_0_lE9PJa/store/appc" --authenticate_http_readonly="true" --authenticate_http_readwrite="false" --authenticatee="crammd5" --authentication_backoff_factor="1secs" --authorizer="local" --cgroups_cpu_enable_pids_and_tids_count="false" --cgroups_enable_cfs="false" --cgroups_hierarchy="/sys/fs/cgroup" --cgroups_limit_swap="false" --cgroups_root="mesos" --container_disk_watch_interval="15secs" --containerizers="mesos" --credential="/tmp/Endpoint_SlaveEndpointTest_NoAuthorizer_0_lE9PJa/credential" --default_role="*" --disallow_sharing_agent_pid_namespace="false" --disk_watch_interval="1mins" --docker="docker" --docker_kill_orphans="true" --docker_registry="https://registry-1.docker.io" --docker_remove_delay="6hrs" --docker_socket="/var/run/docker.sock" --docker_stop_timeout="0ns" --docker_store_dir="/tmp/Endpoint_SlaveEndpointTest_NoAuthorizer_0_lE9PJa/store/docker" --docker_volume_checkpoint_dir="/var/run/mesos/isolators/docker/volume" --enforce_container_disk_quota="false" --executor_registration_timeout="1mins" --executor_reregistration_timeout="2secs" --executor_shutdown_grace_period="5secs" --fetcher_cache_dir="/tmp/Endpoint_SlaveEndpointTest_NoAuthorizer_0_lE9PJa/fetch" --fetcher_cache_size="2GB" --frameworks_home="" --gc_delay="1weeks" --gc_disk_headroom="0.1" --hadoop_home="" --help="false" --hostname_lookup="true" --http_command_executor="false" --http_credentials="/tmp/Endpoint_SlaveEndpointTest_NoAuthorizer_0_lE9PJa/http_credentials" --http_heartbeat_interval="30secs" --initialize_driver_logging="true" --isolation="posix/cpu,posix/mem" --launcher="posix" --launcher_dir="/tmp/SRC/build/mesos-1.6.0/_build/sub/src" --logbufsecs="0" --logging_level="INFO" --max_completed_executors_per_framework="150" --oversubscribed_resources_interval="15secs" --perf_duration="10secs" --perf_interval="1mins" --port="5051" --qos_correction_interval_min="0ns" --quiet="false" --reconfiguration_policy="equal" --recover="reconnect" --recovery_timeout="15mins" --registration_backoff_factor="10ms" --resources="cpus:2;gpus:0;mem:1024;disk:1024;ports:[31000-32000]" --revocable_cpu_low_priority="true" --runtime_dir="/tmp/Endpoint_SlaveEndpointTest_NoAuthorizer_0_lE9PJa" --sandbox_directory="/mnt/mesos/sandbox" --strict="true" --switch_user="true" --systemd_enable_support="true" --systemd_runtime_directory="/run/systemd/system" --version="false" --work_dir="/tmp/Endpoint_SlaveEndpointTest_NoAuthorizer_0_6fzDhG" --zk_session_timeout="10secs"
I0326 19:02:59.531005 5332 credentials.hpp:86] Loading credential for authentication from '/tmp/Endpoint_SlaveEndpointTest_NoAuthorizer_0_lE9PJa/credential'
I0326 19:02:59.531301 5332 slave.cpp:294] Agent using credential for: test-principal
I0326 19:02:59.531349 5332 credentials.hpp:37] Loading credentials for authentication from '/tmp/Endpoint_SlaveEndpointTest_NoAuthorizer_0_lE9PJa/http_credentials'
I0326 19:02:59.531759 5332 http.cpp:959] Creating default 'basic' HTTP authenticator for realm 'mesos-agent-readonly'
I0326 19:02:59.532220 5332 disk_profile_adaptor.cpp:80] Creating default disk profile adaptor module
I0326 19:02:59.534437 5332 slave.cpp:609] Agent resources: [{"name":"cpus","scalar":{"value":2.0},"type":"SCALAR"},{"name":"mem","scalar":{"value":1024.0},"type":"SCALAR"},{"name":"disk","scalar":{"value":1024.0},"type":"SCALAR"},{"name":"ports","ranges":{"range":[{"begin":31000,"end":32000}]},"type":"RANGES"}]
I0326 19:02:59.534777 5332 slave.cpp:617] Agent attributes: [ ]
I0326 19:02:59.534801 5332 slave.cpp:626] Agent hostname: 9ca693f8aa79
I0326 19:02:59.535130 5333 task_status_update_manager.cpp:181] Pausing sending task status updates
I0326 19:02:59.537412 5331 state.cpp:66] Recovering state from '/tmp/Endpoint_SlaveEndpointTest_NoAuthorizer_0_6fzDhG/meta'
I0326 19:02:59.537850 5329 task_status_update_manager.cpp:207] Recovering task status update manager
I0326 19:02:59.538115 5336 containerizer.cpp:674] Recovering containerizer
I0326 19:02:59.540259 5331 provisioner.cpp:495] Provisioner recovery complete
I0326 19:02:59.540925 5329 slave.cpp:7212] Finished recovery
I0326 19:02:59.547154 5332 process.cpp:3564] Handling HTTP event for process 'slave(953)' with path: '/slave(953)/monitor/statistics'
I0326 19:02:59.549458 5324 http.cpp:1099] HTTP GET for /slave(953)/monitor/statistics from 172.17.0.2:60563
I0326 19:02:59.549566 5324 http.cpp:936] Authorizing principal 'test-principal' to GET the '/monitor/statistics' endpoint
I0326 19:02:59.553704 5325 slave.cpp:919] Agent terminating
[ OK ] Endpoint/SlaveEndpointTest.NoAuthorizer/0 (71 ms)
[ RUN ] Endpoint/SlaveEndpointTest.NoAuthorizer/1
I0326 19:02:59.595374 5321 containerizer.cpp:304] Using isolation { environment_secret, posix/cpu, posix/mem, filesystem/posix, network/cni }
W0326 19:02:59.596129 5321 backend.cpp:76] Failed to create 'aufs' backend: AufsBackend requires root privileges
W0326 19:02:59.596156 5321 backend.cpp:76] Failed to create 'bind' backend: BindBackend requires root privileges
I0326 19:02:59.596194 5321 provisioner.cpp:299] Using default backend 'copy'
I0326 19:02:59.598915 5321 cluster.cpp:460] Creating default 'local' authorizer
I0326 19:02:59.602108 5329 slave.cpp:261] Mesos agent started on (954)@172.17.0.2:54002
I0326 19:02:59.602138 5329 slave.cpp:262] Flags at startup: --acls="" --appc_simple_discovery_uri_prefix="http://" --appc_store_dir="/tmp/Endpoint_SlaveEndpointTest_NoAuthorizer_1_VWDTa9/store/appc" --authenticate_http_readonly="true" --authenticate_http_readwrite="false" --authenticatee="crammd5" --authentication_backoff_factor="1secs" --authorizer="local" --cgroups_cpu_enable_pids_and_tids_count="false" --cgroups_enable_cfs="false" --cgroups_hierarchy="/sys/fs/cgroup" --cgroups_limit_swap="false" --cgroups_root="mesos" --container_disk_watch_interval="15secs" --containerizers="mesos" --credential="/tmp/Endpoint_SlaveEndpointTest_NoAuthorizer_1_VWDTa9/credential" --default_role="*" --disallow_sharing_agent_pid_namespace="false" --disk_watch_interval="1mins" --docker="docker" --docker_kill_orphans="true" --docker_registry="https://registry-1.docker.io" --docker_remove_delay="6hrs" --docker_socket="/var/run/docker.sock" --docker_stop_timeout="0ns" --docker_store_dir="/tmp/Endpoint_SlaveEndpointTest_NoAuthorizer_1_VWDTa9/store/docker" --docker_volume_checkpoint_dir="/var/run/mesos/isolators/docker/volume" --enforce_container_disk_quota="false" --executor_registration_timeout="1mins" --executor_reregistration_timeout="2secs" --executor_shutdown_grace_period="5secs" --fetcher_cache_dir="/tmp/Endpoint_SlaveEndpointTest_NoAuthorizer_1_VWDTa9/fetch" --fetcher_cache_size="2GB" --frameworks_home="" --gc_delay="1weeks" --gc_disk_headroom="0.1" --hadoop_home="" --help="false" --hostname_lookup="true" --http_command_executor="false" --http_credentials="/tmp/Endpoint_SlaveEndpointTest_NoAuthorizer_1_VWDTa9/http_credentials" --http_heartbeat_interval="30secs" --initialize_driver_logging="true" --isolation="posix/cpu,posix/mem" --launcher="posix" --launcher_dir="/tmp/SRC/build/mesos-1.6.0/_build/sub/src" --logbufsecs="0" --logging_level="INFO" --max_completed_executors_per_framework="150" --oversubscribed_resources_interval="15secs" --perf_duration="10secs" --perf_interval="1mins" --port="5051" --qos_correction_interval_min="0ns" --quiet="false" --reconfiguration_policy="equal" --recover="reconnect" --recovery_timeout="15mins" --registration_backoff_factor="10ms" --resources="cpus:2;gpus:0;mem:1024;disk:1024;ports:[31000-32000]" --revocable_cpu_low_priority="true" --runtime_dir="/tmp/Endpoint_SlaveEndpointTest_NoAuthorizer_1_VWDTa9" --sandbox_directory="/mnt/mesos/sandbox" --strict="true" --switch_user="true" --systemd_enable_support="true" --systemd_runtime_directory="/run/systemd/system" --version="false" --work_dir="/tmp/Endpoint_SlaveEndpointTest_NoAuthorizer_1_m9r2wE" --zk_session_timeout="10secs"
I0326 19:02:59.602797 5329 credentials.hpp:86] Loading credential for authentication from '/tmp/Endpoint_SlaveEndpointTest_NoAuthorizer_1_VWDTa9/credential'
I0326 19:02:59.603142 5329 slave.cpp:294] Agent using credential for: test-principal
I0326 19:02:59.603224 5329 credentials.hpp:37] Loading credentials for authentication from '/tmp/Endpoint_SlaveEndpointTest_NoAuthorizer_1_VWDTa9/http_credentials'
I0326 19:02:59.603667 5329 http.cpp:959] Creating default 'basic' HTTP authenticator for realm 'mesos-agent-readonly'
I0326 19:02:59.604202 5329 disk_profile_adaptor.cpp:80] Creating default disk profile adaptor module
I0326 19:02:59.606528 5329 slave.cpp:609] Agent resources: [{"name":"cpus","scalar":{"value":2.0},"type":"SCALAR"},{"name":"mem","scalar":{"value":1024.0},"type":"SCALAR"},{"name":"disk","scalar":{"value":1024.0},"type":"SCALAR"},{"name":"ports","ranges":{"range":[{"begin":31000,"end":32000}]},"type":"RANGES"}]
I0326 19:02:59.606921 5329 slave.cpp:617] Agent attributes: [ ]
I0326 19:02:59.607097 5329 slave.cpp:626] Agent hostname: 9ca693f8aa79
I0326 19:02:59.607457 5335 task_status_update_manager.cpp:181] Pausing sending task status updates
I0326 19:02:59.610065 5329 state.cpp:66] Recovering state from '/tmp/Endpoint_SlaveEndpointTest_NoAuthorizer_1_m9r2wE/meta'
I0326 19:02:59.610532 5329 task_status_update_manager.cpp:207] Recovering task status update manager
I0326 19:02:59.610819 5329 containerizer.cpp:674] Recovering containerizer
I0326 19:02:59.612776 5326 provisioner.cpp:495] Provisioner recovery complete
I0326 19:02:59.613276 5331 slave.cpp:7212] Finished recovery
I0326 19:02:59.618422 5332 process.cpp:3564] Handling HTTP event for process 'slave(954)' with path: '/slave(954)/monitor/statistics.json'
I0326 19:02:59.620690 5328 http.cpp:1099] HTTP GET for /slave(954)/monitor/statistics.json from 172.17.0.2:60564
I0326 19:02:59.620795 5328 http.cpp:936] Authorizing principal 'test-principal' to GET the '/monitor/statistics.json' endpoint
I0326 19:02:59.625036 5331 slave.cpp:919] Agent terminating
[ OK ] Endpoint/SlaveEndpointTest.NoAuthorizer/1 (80 ms)
[ RUN ] Endpoint/SlaveEndpointTest.NoAuthorizer/2
I0326 19:02:59.678161 5321 containerizer.cpp:304] Using isolation { environment_secret, posix/cpu, posix/mem, filesystem/posix, network/cni }
W0326 19:02:59.678980 5321 backend.cpp:76] Failed to create 'aufs' backend: AufsBackend requires root privileges
W0326 19:02:59.679016 5321 backend.cpp:76] Failed to create 'bind' backend: BindBackend requires root privileges
I0326 19:02:59.679066 5321 provisioner.cpp:299] Using default backend 'copy'
I0326 19:02:59.682147 5321 cluster.cpp:460] Creating default 'local' authorizer
I0326 19:02:59.686053 5326 slave.cpp:261] Mesos agent started on (955)@172.17.0.2:54002
I0326 19:02:59.686086 5326 slave.cpp:262] Flags at startup: --acls="" --appc_simple_discovery_uri_prefix="http://" --appc_store_dir="/tmp/Endpoint_SlaveEndpointTest_NoAuthorizer_2_lR6gr8/store/appc" --authenticate_http_readonly="true" --authenticate_http_readwrite="false" --authenticatee="crammd5" --authentication_backoff_factor="1secs" --authorizer="local" --cgroups_cpu_enable_pids_and_tids_count="false" --cgroups_enable_cfs="false" --cgroups_hierarchy="/sys/fs/cgroup" --cgroups_limit_swap="false" --cgroups_root="mesos" --container_disk_watch_interval="15secs" --containerizers="mesos" --credential="/tmp/Endpoint_SlaveEndpointTest_NoAuthorizer_2_lR6gr8/credential" --default_role="*" --disallow_sharing_agent_pid_namespace="false" --disk_watch_interval="1mins" --docker="docker" --docker_kill_orphans="true" --docker_registry="https://registry-1.docker.io" --docker_remove_delay="6hrs" --docker_socket="/var/run/docker.sock" --docker_stop_timeout="0ns" --docker_store_dir="/tmp/Endpoint_SlaveEndpointTest_NoAuthorizer_2_lR6gr8/store/docker" --docker_volume_checkpoint_dir="/var/run/mesos/isolators/docker/volume" --enforce_container_disk_quota="false" --executor_registration_timeout="1mins" --executor_reregistration_timeout="2secs" --executor_shutdown_grace_period="5secs" --fetcher_cache_dir="/tmp/Endpoint_SlaveEndpointTest_NoAuthorizer_2_lR6gr8/fetch" --fetcher_cache_size="2GB" --frameworks_home="" --gc_delay="1weeks" --gc_disk_headroom="0.1" --hadoop_home="" --help="false" --hostname_lookup="true" --http_command_executor="false" --http_credentials="/tmp/Endpoint_SlaveEndpointTest_NoAuthorizer_2_lR6gr8/http_credentials" --http_heartbeat_interval="30secs" --initialize_driver_logging="true" --isolation="posix/cpu,posix/mem" --launcher="posix" --launcher_dir="/tmp/SRC/build/mesos-1.6.0/_build/sub/src" --logbufsecs="0" --logging_level="INFO" --max_completed_executors_per_framework="150" --oversubscribed_resources_interval="15secs" --perf_duration="10secs" --perf_interval="1mins" --port="5051" --qos_correction_interval_min="0ns" --quiet="false" --reconfiguration_policy="equal" --recover="reconnect" --recovery_timeout="15mins" --registration_backoff_factor="10ms" --resources="cpus:2;gpus:0;mem:1024;disk:1024;ports:[31000-32000]" --revocable_cpu_low_priority="true" --runtime_dir="/tmp/Endpoint_SlaveEndpointTest_NoAuthorizer_2_lR6gr8" --sandbox_directory="/mnt/mesos/sandbox" --strict="true" --switch_user="true" --systemd_enable_support="true" --systemd_runtime_directory="/run/systemd/system" --version="false" --work_dir="/tmp/Endpoint_SlaveEndpointTest_NoAuthorizer_2_aHybAD" --zk_session_timeout="10secs"
I0326 19:02:59.686848 5326 credentials.hpp:86] Loading credential for authentication from '/tmp/Endpoint_SlaveEndpointTest_NoAuthorizer_2_lR6gr8/credential'
I0326 19:02:59.687206 5326 slave.cpp:294] Agent using credential for: test-principal
I0326 19:02:59.687237 5326 credentials.hpp:37] Loading credentials for authentication from '/tmp/Endpoint_SlaveEndpointTest_NoAuthorizer_2_lR6gr8/http_credentials'
I0326 19:02:59.687762 5326 http.cpp:959] Creating default 'basic' HTTP authenticator for realm 'mesos-agent-readonly'
I0326 19:02:59.688316 5326 disk_profile_adaptor.cpp:80] Creating default disk profile adaptor module
I0326 19:02:59.690685 5326 slave.cpp:609] Agent resources: [{"name":"cpus","scalar":{"value":2.0},"type":"SCALAR"},{"name":"mem","scalar":{"value":1024.0},"type":"SCALAR"},{"name":"disk","scalar":{"value":1024.0},"type":"SCALAR"},{"name":"ports","ranges":{"range":[{"begin":31000,"end":32000}]},"type":"RANGES"}]
I0326 19:02:59.691045 5326 slave.cpp:617] Agent attributes: [ ]
I0326 19:02:59.691133 5326 slave.cpp:626] Agent hostname: 9ca693f8aa79
I0326 19:02:59.691351 5333 task_status_update_manager.cpp:181] Pausing sending task status updates
I0326 19:02:59.693811 5326 state.cpp:66] Recovering state from '/tmp/Endpoint_SlaveEndpointTest_NoAuthorizer_2_aHybAD/meta'
I0326 19:02:59.694342 5332 task_status_update_manager.cpp:207] Recovering task status update manager
I0326 19:02:59.694723 5327 containerizer.cpp:674] Recovering containerizer
I0326 19:02:59.696946 5326 provisioner.cpp:495] Provisioner recovery complete
I0326 19:02:59.697481 5335 slave.cpp:7212] Finished recovery
I0326 19:02:59.701509 5324 process.cpp:3564] Handling HTTP event for process 'slave(955)' with path: '/slave(955)/containers'
I0326 19:02:59.703900 5328 http.cpp:1099] HTTP GET for /slave(955)/containers from 172.17.0.2:60565
I0326 19:02:59.704111 5328 http.cpp:936] Authorizing principal 'test-principal' to GET the '/containers' endpoint
I0326 19:02:59.709358 5337 slave.cpp:919] Agent terminating
[ OK ] Endpoint/SlaveEndpointTest.NoAuthorizer/2 (102 ms)
[----------] 9 tests from Endpoint/SlaveEndpointTest (763 ms total)
[----------] 2 tests from ContainerizerType/DefaultContainerDNSFlagTest
[ RUN ] ContainerizerType/DefaultContainerDNSFlagTest.ValidateFlag/0
[ OK ] ContainerizerType/DefaultContainerDNSFlagTest.ValidateFlag/0 (16 ms)
[ RUN ] ContainerizerType/DefaultContainerDNSFlagTest.ValidateFlag/1
[ OK ] ContainerizerType/DefaultContainerDNSFlagTest.ValidateFlag/1 (15 ms)
[----------] 2 tests from ContainerizerType/DefaultContainerDNSFlagTest (33 ms total)
[----------] Global test environment tear-down
[==========] 1887 tests from 194 test cases ran. (898424 ms total)
[ PASSED ] 1886 tests.
[ FAILED ] 1 test, listed below:
[ FAILED ] DiskQuotaTest.SlaveRecovery
1 FAILED TEST
YOU HAVE 22 DISABLED TESTS
I0326 19:02:59.912072 5338 process.cpp:929] Stopped the socket accept loop
Makefile:14619: recipe for target 'check-local' failed
make[4]: *** [check-local] Error 1
make[4]: Leaving directory '/tmp/SRC/build/mesos-1.6.0/_build/sub/src'
Makefile:13752: recipe for target 'check-am' failed
make[3]: *** [check-am] Error 2
make[3]: Leaving directory '/tmp/SRC/build/mesos-1.6.0/_build/sub/src'
Makefile:13756: recipe for target 'check' failed
make[2]: *** [check] Error 2
make[2]: Leaving directory '/tmp/SRC/build/mesos-1.6.0/_build/sub/src'
Makefile:774: recipe for target 'check-recursive' failed
make[1]: *** [check-recursive] Error 1
make[1]: Leaving directory '/tmp/SRC/build/mesos-1.6.0/_build/sub'
Makefile:980: recipe for target 'distcheck' failed
make: *** [distcheck] Error 1
Error response from daemon: conflict: unable to delete df13eb8a4c4b (cannot be forced) - image is being used by running container 75d30a68a8c1
Build step 'Execute shell' marked build as failure
Jenkins build is back to normal : Mesos-Reviewbot #22009
Posted by Apache Jenkins Server <je...@builds.apache.org>.
See <https://builds.apache.org/job/Mesos-Reviewbot/22009/display/redirect>