You are viewing a plain text version of this content. The canonical link for it is here.
Posted to yarn-dev@hadoop.apache.org by Apache Jenkins Server <je...@builds.apache.org> on 2015/03/31 13:02:38 UTC
Failed: YARN-3423 PreCommit Build #7169
Jira: https://issues.apache.org/jira/browse/YARN-3423
Build: https://builds.apache.org/job/PreCommit-YARN-Build/7169/
###################################################################################
########################## LAST 60 LINES OF THE CONSOLE ###########################
[...truncated 3428 lines...]
{color:red}-1 overall{color}. Here are the results of testing the latest attachment
http://issues.apache.org/jira/secure/attachment/12708393/YARN-3423.patch
against trunk revision b5a22e9.
{color:green}+1 @author{color}. The patch does not contain any @author tags.
{color:red}-1 tests included{color}. The patch doesn't appear to include any new or modified tests.
Please justify why no new tests are needed for this patch.
Also please list what manual steps were performed to verify this patch.
{color:green}+1 javac{color}. The applied patch does not increase the total number of javac compiler warnings.
{color:green}+1 javadoc{color}. There were no new javadoc warning messages.
{color:green}+1 eclipse:eclipse{color}. The patch built with eclipse:eclipse.
{color:green}+1 findbugs{color}. The patch does not introduce any new Findbugs (version 2.0.3) warnings.
{color:green}+1 release audit{color}. The applied patch does not increase the total number of release audit warnings.
{color:green}+1 core tests{color}. The patch passed unit tests in hadoop-yarn-project/hadoop-yarn/hadoop-yarn-server/hadoop-yarn-server-resourcemanager.
Test results: https://builds.apache.org/job/PreCommit-YARN-Build/7169//testReport/
Console output: https://builds.apache.org/job/PreCommit-YARN-Build/7169//console
This message is automatically generated.
======================================================================
======================================================================
Adding comment to Jira.
======================================================================
======================================================================
Comment added.
640e91f353cfe2868b6226ab570c74eafb21b01e logged out
======================================================================
======================================================================
Finished build.
======================================================================
======================================================================
Build step 'Execute shell' marked build as failure
Archiving artifacts
Sending artifact delta relative to PreCommit-YARN-Build #7154
Archived 15 artifacts
Archive block size is 32768
Received 44 blocks and 7639397 bytes
Compression is 15.9%
Took 1.6 sec
[description-setter] Could not determine description.
Recording test results
Email was triggered for: Failure
Sending email for trigger: Failure
###################################################################################
############################## FAILED TESTS (if any) ##############################
All tests passed
Success: YARN-3304 PreCommit Build #7173
Posted by Apache Jenkins Server <je...@builds.apache.org>.
Jira: https://issues.apache.org/jira/browse/YARN-3304
Build: https://builds.apache.org/job/PreCommit-YARN-Build/7173/
###################################################################################
########################## LAST 60 LINES OF THE CONSOLE ###########################
[...truncated 3322 lines...]
{color:green}+1 overall{color}. Here are the results of testing the latest attachment
http://issues.apache.org/jira/secure/attachment/12708410/YARN-3304-appendix-v2.patch
against trunk revision b5a22e9.
{color:green}+1 @author{color}. The patch does not contain any @author tags.
{color:green}+1 tests included{color}. The patch appears to include 3 new or modified test files.
{color:green}+1 javac{color}. The applied patch does not increase the total number of javac compiler warnings.
{color:green}+1 javadoc{color}. There were no new javadoc warning messages.
{color:green}+1 eclipse:eclipse{color}. The patch built with eclipse:eclipse.
{color:green}+1 findbugs{color}. The patch does not introduce any new Findbugs (version 2.0.3) warnings.
{color:green}+1 release audit{color}. The applied patch does not increase the total number of release audit warnings.
{color:green}+1 core tests{color}. The patch passed unit tests in hadoop-yarn-project/hadoop-yarn/hadoop-yarn-common.
Test results: https://builds.apache.org/job/PreCommit-YARN-Build/7173//testReport/
Console output: https://builds.apache.org/job/PreCommit-YARN-Build/7173//console
This message is automatically generated.
======================================================================
======================================================================
Adding comment to Jira.
======================================================================
======================================================================
Comment added.
291249d83433f70f34ecf0a25c3ab4d66398b6fc logged out
======================================================================
======================================================================
Finished build.
======================================================================
======================================================================
Archiving artifacts
Sending artifact delta relative to PreCommit-YARN-Build #7154
Archived 15 artifacts
Archive block size is 32768
Received 218 blocks and 1929895 bytes
Compression is 78.7%
Took 0.71 sec
Description set: YARN-3304
Recording test results
Email was triggered for: Success
Sending email for trigger: Success
###################################################################################
############################## FAILED TESTS (if any) ##############################
All tests passed
Failed: YARN-2666 PreCommit Build #7172
Posted by Apache Jenkins Server <je...@builds.apache.org>.
Jira: https://issues.apache.org/jira/browse/YARN-2666
Build: https://builds.apache.org/job/PreCommit-YARN-Build/7172/
###################################################################################
########################## LAST 60 LINES OF THE CONSOLE ###########################
[...truncated 3435 lines...]
{color:red}-1 overall{color}. Here are the results of testing the latest attachment
http://issues.apache.org/jira/secure/attachment/12708403/YARN-2666.000.patch
against trunk revision b5a22e9.
{color:green}+1 @author{color}. The patch does not contain any @author tags.
{color:green}+1 tests included{color}. The patch appears to include 1 new or modified test files.
{color:green}+1 javac{color}. The applied patch does not increase the total number of javac compiler warnings.
{color:green}+1 javadoc{color}. There were no new javadoc warning messages.
{color:green}+1 eclipse:eclipse{color}. The patch built with eclipse:eclipse.
{color:green}+1 findbugs{color}. The patch does not introduce any new Findbugs (version 2.0.3) warnings.
{color:green}+1 release audit{color}. The applied patch does not increase the total number of release audit warnings.
{color:red}-1 core tests{color}. The patch failed these unit tests in hadoop-yarn-project/hadoop-yarn/hadoop-yarn-server/hadoop-yarn-server-resourcemanager:
org.apache.hadoop.yarn.server.resourcemanager.security.TestAMRMTokens
Test results: https://builds.apache.org/job/PreCommit-YARN-Build/7172//testReport/
Console output: https://builds.apache.org/job/PreCommit-YARN-Build/7172//console
This message is automatically generated.
======================================================================
======================================================================
Adding comment to Jira.
======================================================================
======================================================================
Comment added.
dfda3dd7659dd0a9180ec4354244e4a3de914383 logged out
======================================================================
======================================================================
Finished build.
======================================================================
======================================================================
Build step 'Execute shell' marked build as failure
Archiving artifacts
Sending artifact delta relative to PreCommit-YARN-Build #7154
Archived 15 artifacts
Archive block size is 32768
Received 45 blocks and 7606576 bytes
Compression is 16.2%
Took 2.8 sec
[description-setter] Could not determine description.
Recording test results
Email was triggered for: Failure
Sending email for trigger: Failure
###################################################################################
############################## FAILED TESTS (if any) ##############################
1 tests failed.
FAILED: org.apache.hadoop.yarn.server.resourcemanager.security.TestAMRMTokens.testTokenExpiry[1]
Error Message:
Invalid AMRMToken from appattempt_1427804754787_0001_000001
Stack Trace:
org.apache.hadoop.security.token.SecretManager$InvalidToken: Invalid AMRMToken from appattempt_1427804754787_0001_000001
at org.apache.hadoop.ipc.Client.call(Client.java:1492)
at org.apache.hadoop.ipc.Client.call(Client.java:1423)
at org.apache.hadoop.ipc.ProtobufRpcEngine$Invoker.invoke(ProtobufRpcEngine.java:229)
at com.sun.proxy.$Proxy15.registerApplicationMaster(Unknown Source)
at org.apache.hadoop.yarn.api.impl.pb.client.ApplicationMasterProtocolPBClientImpl.registerApplicationMaster(ApplicationMasterProtocolPBClientImpl.java:106)
at org.apache.hadoop.yarn.server.resourcemanager.security.TestAMRMTokens.testTokenExpiry(TestAMRMTokens.java:152)
Failed: YARN-3304 PreCommit Build #7171
Posted by Apache Jenkins Server <je...@builds.apache.org>.
Jira: https://issues.apache.org/jira/browse/YARN-3304
Build: https://builds.apache.org/job/PreCommit-YARN-Build/7171/
###################################################################################
########################## LAST 60 LINES OF THE CONSOLE ###########################
[...truncated 3330 lines...]
{color:red}-1 overall{color}. Here are the results of testing the latest attachment
http://issues.apache.org/jira/secure/attachment/12708294/YARN-3304-appendix.patch
against trunk revision b5a22e9.
{color:green}+1 @author{color}. The patch does not contain any @author tags.
{color:green}+1 tests included{color}. The patch appears to include 3 new or modified test files.
{color:red}-1 javac{color}. The applied patch generated 1162 javac compiler warnings (more than the trunk's current 1148 warnings).
{color:green}+1 javadoc{color}. There were no new javadoc warning messages.
{color:green}+1 eclipse:eclipse{color}. The patch built with eclipse:eclipse.
{color:green}+1 findbugs{color}. The patch does not introduce any new Findbugs (version 2.0.3) warnings.
{color:green}+1 release audit{color}. The applied patch does not increase the total number of release audit warnings.
{color:green}+1 core tests{color}. The patch passed unit tests in hadoop-yarn-project/hadoop-yarn/hadoop-yarn-common.
Test results: https://builds.apache.org/job/PreCommit-YARN-Build/7171//testReport/
Javac warnings: https://builds.apache.org/job/PreCommit-YARN-Build/7171//artifact/patchprocess/diffJavacWarnings.txt
Console output: https://builds.apache.org/job/PreCommit-YARN-Build/7171//console
This message is automatically generated.
======================================================================
======================================================================
Adding comment to Jira.
======================================================================
======================================================================
Comment added.
3ec8ded518cb3dbc7b3dc331f084f06a60cba6c3 logged out
======================================================================
======================================================================
Finished build.
======================================================================
======================================================================
Build step 'Execute shell' marked build as failure
Archiving artifacts
Sending artifact delta relative to PreCommit-YARN-Build #7154
Archived 16 artifacts
Archive block size is 32768
Received 46 blocks and 7581387 bytes
Compression is 16.6%
Took 1.6 sec
[description-setter] Could not determine description.
Recording test results
Publish JUnit test result report is waiting for a checkpoint on PreCommit-YARN-Build #7170
Email was triggered for: Failure
Sending email for trigger: Failure
###################################################################################
############################## FAILED TESTS (if any) ##############################
All tests passed
Failed: YARN-3415 PreCommit Build #7170
Posted by Apache Jenkins Server <je...@builds.apache.org>.
Jira: https://issues.apache.org/jira/browse/YARN-3415
Build: https://builds.apache.org/job/PreCommit-YARN-Build/7170/
###################################################################################
########################## LAST 60 LINES OF THE CONSOLE ###########################
[...truncated 3118 lines...]
cat: /home/jenkins/jenkins-slave/workspace/PreCommit-YARN-Build/../patchprocess/testrun_hadoop-yarn-server-resourcemanager.txt: No such file or directory
awk: cannot open /home/jenkins/jenkins-slave/workspace/PreCommit-YARN-Build/../patchprocess/testrun_hadoop-yarn-server-resourcemanager.txt (No such file or directory)
/home/jenkins/jenkins-slave/workspace/PreCommit-YARN-Build
{color:green}+1 overall{color}. Here are the results of testing the latest attachment
http://issues.apache.org/jira/secure/attachment/12708400/YARN-3415.001.patch
against trunk revision b5a22e9.
{color:green}+1 @author{color}. The patch does not contain any @author tags.
{color:green}+1 tests included{color}. The patch appears to include 1 new or modified test files.
{color:green}+1 javac{color}. The applied patch does not increase the total number of javac compiler warnings.
{color:green}+1 javadoc{color}. There were no new javadoc warning messages.
{color:green}+1 eclipse:eclipse{color}. The patch built with eclipse:eclipse.
{color:green}+1 findbugs{color}. The patch does not introduce any new Findbugs (version 2.0.3) warnings.
{color:green}+1 release audit{color}. The applied patch does not increase the total number of release audit warnings.
{color:green}+1 core tests{color}. The patch passed unit tests in hadoop-yarn-project/hadoop-yarn/hadoop-yarn-server/hadoop-yarn-server-resourcemanager.
Test results: https://builds.apache.org/job/PreCommit-YARN-Build/7170//testReport/
Console output: https://builds.apache.org/job/PreCommit-YARN-Build/7170//console
This message is automatically generated.
======================================================================
======================================================================
Adding comment to Jira.
======================================================================
======================================================================
Comment added.
685f810a580ea6a2ade7590146d0709bfc63e39b logged out
======================================================================
======================================================================
Finished build.
======================================================================
======================================================================
Archiving artifacts
ERROR: No artifacts found that match the file pattern "patchprocess/*.*". Configuration error?
ERROR: ?patchprocess/*.*? doesn?t match anything, but ?*.*? does. Perhaps that?s what you mean?
Build step 'Archive the artifacts' changed build result to FAILURE
[description-setter] Could not determine description.
Recording test results
Email was triggered for: Failure
Sending email for trigger: Failure
###################################################################################
############################## FAILED TESTS (if any) ##############################
All tests passed