You are viewing a plain text version of this content. The canonical link for it is here.
Posted to issues@tajo.apache.org by Apache Jenkins Server <je...@builds.apache.org> on 2014/04/27 04:02:21 UTC

Build failed in Jenkins: Tajo-0.8.0-nightly #56

See <https://builds.apache.org/job/Tajo-0.8.0-nightly/56/>

------------------------------------------
Started by timer
Building remotely on hadoop2 (Hadoop2 Hadoop Mapreduce Hdfs Pig) in workspace <https://builds.apache.org/job/Tajo-0.8.0-nightly/ws/>
Fetching changes from the remote Git repository
Fetching upstream changes from http://git-wip-us.apache.org/repos/asf/tajo.git
Checking out Revision 5211c965a19a64083745bb060e415c756340fe65 (origin/branch-0.8.0)
[Tajo-0.8.0-nightly] $ /bin/bash -x /tmp/hudson8976224902050043390.sh
+ export JAVA_HOME=/home/jenkins/tools/java/latest
+ JAVA_HOME=/home/jenkins/tools/java/latest
+ export MAVEN_HOME=/home/jenkins/tools/maven/latest
+ MAVEN_HOME=/home/jenkins/tools/maven/latest
+ export PATH=/home/jenkins/tools/java/latest/bin:/home/jenkins/tools/maven/latest/bin:/home/hudson/tools/java/latest1.6/bin:/home/hudson/tools/java/latest1.6/bin:/usr/local/sbin:/usr/local/bin:/usr/sbin:/usr/bin:/sbin:/bin:/usr/games
+ PATH=/home/jenkins/tools/java/latest/bin:/home/jenkins/tools/maven/latest/bin:/home/hudson/tools/java/latest1.6/bin:/home/hudson/tools/java/latest1.6/bin:/usr/local/sbin:/usr/local/bin:/usr/sbin:/usr/bin:/sbin:/bin:/usr/games
+ which java
/home/jenkins/tools/java/latest/bin/java
+ protoc --version
libprotoc 2.5.0
+ cd <https://builds.apache.org/job/Tajo-0.8.0-nightly/ws/>
+ /home/jenkins/tools/maven/latest/bin/mvn clean install -Phcatalog-0.12.0
[INFO] Scanning for projects...
Downloading: http://repo1.maven.org/maven2/org/apache/tajo/tajo-project/0.8.0/tajo-project-0.8.0.pom

[ERROR] The build could not read 1 project -> [Help 1]
[ERROR]   
[ERROR]   The project org.apache.tajo:tajo-hcatalog:0.8.0 (<https://builds.apache.org/job/Tajo-0.8.0-nightly/ws/tajo-catalog/tajo-catalog-drivers/tajo-hcatalog/pom.xml)> has 1 error
[ERROR]     Non-resolvable parent POM: Could not find artifact org.apache.tajo:tajo-project:pom:0.8.0 in central (http://repo1.maven.org/maven2) and 'parent.relativePath' points at wrong local POM @ line 23, column 11 -> [Help 2]
[ERROR] 
[ERROR] To see the full stack trace of the errors, re-run Maven with the -e switch.
[ERROR] Re-run Maven using the -X switch to enable full debug logging.
[ERROR] 
[ERROR] For more information about the errors and possible solutions, please read the following articles:
[ERROR] [Help 1] http://cwiki.apache.org/confluence/display/MAVEN/ProjectBuildingException
[ERROR] [Help 2] http://cwiki.apache.org/confluence/display/MAVEN/UnresolvableModelException
Build step 'Execute shell' marked build as failure
Recording test results

Jenkins build is back to normal : Tajo-0.8.1-nightly #60

Posted by Apache Jenkins Server <je...@builds.apache.org>.
See <https://builds.apache.org/job/Tajo-0.8.1-nightly/60/>


Build failed in Jenkins: Tajo-0.8.0-nightly #59

Posted by Apache Jenkins Server <je...@builds.apache.org>.
See <https://builds.apache.org/job/Tajo-0.8.0-nightly/59/>

------------------------------------------
Started by timer
Building remotely on hadoop11 (Hive Zookeeper Hadoop Hcat Pig) in workspace <https://builds.apache.org/job/Tajo-0.8.0-nightly/ws/>
Fetching changes from the remote Git repository
Fetching upstream changes from http://git-wip-us.apache.org/repos/asf/tajo.git
Checking out Revision 5211c965a19a64083745bb060e415c756340fe65 (origin/branch-0.8.0)
[Tajo-0.8.0-nightly] $ /bin/bash -x /tmp/hudson386941743981061060.sh
+ export JAVA_HOME=/home/jenkins/tools/java/latest
+ JAVA_HOME=/home/jenkins/tools/java/latest
+ export MAVEN_HOME=/home/jenkins/tools/maven/latest
+ MAVEN_HOME=/home/jenkins/tools/maven/latest
+ export PATH=/home/jenkins/tools/java/latest/bin:/home/jenkins/tools/maven/latest/bin:/home/hudson/tools/java/latest1.6/bin:/home/hudson/tools/java/latest1.6/bin:/usr/local/sbin:/usr/local/bin:/usr/sbin:/usr/bin:/sbin:/bin:/usr/games
+ PATH=/home/jenkins/tools/java/latest/bin:/home/jenkins/tools/maven/latest/bin:/home/hudson/tools/java/latest1.6/bin:/home/hudson/tools/java/latest1.6/bin:/usr/local/sbin:/usr/local/bin:/usr/sbin:/usr/bin:/sbin:/bin:/usr/games
+ which java
/home/jenkins/tools/java/latest/bin/java
+ protoc --version
libprotoc 2.5.0
+ cd <https://builds.apache.org/job/Tajo-0.8.0-nightly/ws/>
+ /home/jenkins/tools/maven/latest/bin/mvn clean install -Phcatalog-0.12.0
[INFO] Scanning for projects...
Downloading: http://repo.maven.apache.org/maven2/org/apache/tajo/tajo-project/0.8.0/tajo-project-0.8.0.pom

[ERROR] The build could not read 1 project -> [Help 1]
[ERROR]   
[ERROR]   The project org.apache.tajo:tajo-hcatalog:0.8.0 (<https://builds.apache.org/job/Tajo-0.8.0-nightly/ws/tajo-catalog/tajo-catalog-drivers/tajo-hcatalog/pom.xml)> has 1 error
[ERROR]     Non-resolvable parent POM: Could not find artifact org.apache.tajo:tajo-project:pom:0.8.0 in central (http://repo.maven.apache.org/maven2) and 'parent.relativePath' points at wrong local POM @ line 23, column 11 -> [Help 2]
[ERROR] 
[ERROR] To see the full stack trace of the errors, re-run Maven with the -e switch.
[ERROR] Re-run Maven using the -X switch to enable full debug logging.
[ERROR] 
[ERROR] For more information about the errors and possible solutions, please read the following articles:
[ERROR] [Help 1] http://cwiki.apache.org/confluence/display/MAVEN/ProjectBuildingException
[ERROR] [Help 2] http://cwiki.apache.org/confluence/display/MAVEN/UnresolvableModelException
Build step 'Execute shell' marked build as failure
Recording test results

Build failed in Jenkins: Tajo-0.8.0-nightly #58

Posted by Apache Jenkins Server <je...@builds.apache.org>.
See <https://builds.apache.org/job/Tajo-0.8.0-nightly/58/>

------------------------------------------
Started by timer
Building remotely on hadoop1 (Hadoop1 Hadoop Mapreduce Hdfs Pig) in workspace <https://builds.apache.org/job/Tajo-0.8.0-nightly/ws/>
Fetching changes from the remote Git repository
Fetching upstream changes from http://git-wip-us.apache.org/repos/asf/tajo.git
Checking out Revision 5211c965a19a64083745bb060e415c756340fe65 (origin/branch-0.8.0)
[Tajo-0.8.0-nightly] $ /bin/bash -x /tmp/hudson2746913582817461461.sh
+ export JAVA_HOME=/home/jenkins/tools/java/latest
+ JAVA_HOME=/home/jenkins/tools/java/latest
+ export MAVEN_HOME=/home/jenkins/tools/maven/latest
+ MAVEN_HOME=/home/jenkins/tools/maven/latest
+ export PATH=/home/jenkins/tools/java/latest/bin:/home/jenkins/tools/maven/latest/bin:/home/hudson/tools/java/latest1.6/bin:/home/hudson/tools/java/latest1.6/bin:/usr/local/sbin:/usr/local/bin:/usr/sbin:/usr/bin:/sbin:/bin:/usr/games
+ PATH=/home/jenkins/tools/java/latest/bin:/home/jenkins/tools/maven/latest/bin:/home/hudson/tools/java/latest1.6/bin:/home/hudson/tools/java/latest1.6/bin:/usr/local/sbin:/usr/local/bin:/usr/sbin:/usr/bin:/sbin:/bin:/usr/games
+ which java
/home/jenkins/tools/java/latest/bin/java
+ protoc --version
libprotoc 2.5.0
+ cd <https://builds.apache.org/job/Tajo-0.8.0-nightly/ws/>
+ /home/jenkins/tools/maven/latest/bin/mvn clean install -Phcatalog-0.12.0
[INFO] Scanning for projects...
Downloading: http://repo.maven.apache.org/maven2/org/apache/tajo/tajo-project/0.8.0/tajo-project-0.8.0.pom

[ERROR] The build could not read 1 project -> [Help 1]
[ERROR]   
[ERROR]   The project org.apache.tajo:tajo-hcatalog:0.8.0 (<https://builds.apache.org/job/Tajo-0.8.0-nightly/ws/tajo-catalog/tajo-catalog-drivers/tajo-hcatalog/pom.xml)> has 1 error
[ERROR]     Non-resolvable parent POM: Could not find artifact org.apache.tajo:tajo-project:pom:0.8.0 in central (http://repo.maven.apache.org/maven2) and 'parent.relativePath' points at wrong local POM @ line 23, column 11 -> [Help 2]
[ERROR] 
[ERROR] To see the full stack trace of the errors, re-run Maven with the -e switch.
[ERROR] Re-run Maven using the -X switch to enable full debug logging.
[ERROR] 
[ERROR] For more information about the errors and possible solutions, please read the following articles:
[ERROR] [Help 1] http://cwiki.apache.org/confluence/display/MAVEN/ProjectBuildingException
[ERROR] [Help 2] http://cwiki.apache.org/confluence/display/MAVEN/UnresolvableModelException
Build step 'Execute shell' marked build as failure
Recording test results

Build failed in Jenkins: Tajo-0.8.0-nightly #57

Posted by Apache Jenkins Server <je...@builds.apache.org>.
See <https://builds.apache.org/job/Tajo-0.8.0-nightly/57/>

------------------------------------------
Started by timer
Building remotely on hadoop0 (samza Hadoop Hadoop0 Hdfs Pig) in workspace <https://builds.apache.org/job/Tajo-0.8.0-nightly/ws/>
Fetching changes from the remote Git repository
Fetching upstream changes from http://git-wip-us.apache.org/repos/asf/tajo.git
Checking out Revision 5211c965a19a64083745bb060e415c756340fe65 (origin/branch-0.8.0)
[Tajo-0.8.0-nightly] $ /bin/bash -x /tmp/hudson5458535315690307644.sh
+ export JAVA_HOME=/home/jenkins/tools/java/latest
+ JAVA_HOME=/home/jenkins/tools/java/latest
+ export MAVEN_HOME=/home/jenkins/tools/maven/latest
+ MAVEN_HOME=/home/jenkins/tools/maven/latest
+ export PATH=/home/jenkins/tools/java/latest/bin:/home/jenkins/tools/maven/latest/bin:/home/hudson/tools/java/latest1.6/bin:/home/hudson/tools/java/latest1.6/bin:/usr/local/sbin:/usr/local/bin:/usr/sbin:/usr/bin:/sbin:/bin:/usr/games
+ PATH=/home/jenkins/tools/java/latest/bin:/home/jenkins/tools/maven/latest/bin:/home/hudson/tools/java/latest1.6/bin:/home/hudson/tools/java/latest1.6/bin:/usr/local/sbin:/usr/local/bin:/usr/sbin:/usr/bin:/sbin:/bin:/usr/games
+ which java
/home/jenkins/tools/java/latest/bin/java
+ protoc --version
libprotoc 2.5.0
+ cd <https://builds.apache.org/job/Tajo-0.8.0-nightly/ws/>
+ /home/jenkins/tools/maven/latest/bin/mvn clean install -Phcatalog-0.12.0
[INFO] Scanning for projects...
Downloading: http://repo1.maven.org/maven2/org/apache/tajo/tajo-project/0.8.0/tajo-project-0.8.0.pom

[ERROR] The build could not read 1 project -> [Help 1]
[ERROR]   
[ERROR]   The project org.apache.tajo:tajo-hcatalog:0.8.0 (<https://builds.apache.org/job/Tajo-0.8.0-nightly/ws/tajo-catalog/tajo-catalog-drivers/tajo-hcatalog/pom.xml)> has 1 error
[ERROR]     Non-resolvable parent POM: Could not find artifact org.apache.tajo:tajo-project:pom:0.8.0 in central (http://repo1.maven.org/maven2) and 'parent.relativePath' points at wrong local POM @ line 23, column 11 -> [Help 2]
[ERROR] 
[ERROR] To see the full stack trace of the errors, re-run Maven with the -e switch.
[ERROR] Re-run Maven using the -X switch to enable full debug logging.
[ERROR] 
[ERROR] For more information about the errors and possible solutions, please read the following articles:
[ERROR] [Help 1] http://cwiki.apache.org/confluence/display/MAVEN/ProjectBuildingException
[ERROR] [Help 2] http://cwiki.apache.org/confluence/display/MAVEN/UnresolvableModelException
Build step 'Execute shell' marked build as failure
Recording test results