You are viewing a plain text version of this content. The canonical link for it is here.
Posted to yarn-dev@hadoop.apache.org by Apache Jenkins Server <je...@builds.apache.org> on 2015/05/18 10:42:02 UTC

Failed: YARN-3411 PreCommit Build #7965

Jira: https://issues.apache.org/jira/browse/YARN-3411
Build: https://builds.apache.org/job/PreCommit-YARN-Build/7965/

###################################################################################
########################## LAST 60 LINES OF THE CONSOLE ###########################
[...truncated 162 lines...]


/home/jenkins/tools/maven/latest/bin/mvn clean test -DskipTests -DhadoopPatchProcess -Pnative -Ptest-patch > /home/jenkins/jenkins-slave/workspace/PreCommit-YARN-Build/patchprocess/patchJavacWarnings.txt 2>&1

Elapsed time:   3m 18s



-1 overall

| Vote |          Subsystem |  Runtime   | Comment
============================================================================
|   0  |         pre-patch  |  15m 5s    | Pre-patch YARN-2928 compilation is 
|      |                    |            | healthy.
|  +1  |           @author  |  0m 0s     | The patch does not contain any 
|      |                    |            | @author tags.
|  +1  |    tests included  |  0m 0s     | The patch appears to include 1 new 
|      |                    |            | or modified test files.
|  -1  |             javac  |  3m 18s    | The patch appears to cause the build 
|      |                    |            | to fail.


|| Subsystem || Report/Notes ||
============================================================================
| Patch URL | http://issues.apache.org/jira/secure/attachment/12733480/YARN-3411-YARN-2928.003.patch |
| Optional Tests | javadoc javac unit findbugs checkstyle |
| git revision | YARN-2928 / 463e070 |


============================================================================
============================================================================
                          Adding comment to JIRA
============================================================================
============================================================================


Comment added.
d0d37671200b3286d0894bf02941dc88cde3ee2c logged out


============================================================================
============================================================================
                              Finished build.
============================================================================
============================================================================


Build step 'Execute shell' marked build as failure
Archiving artifacts
Sending artifact delta relative to PreCommit-YARN-Build #7942
Archived 9 artifacts
Archive block size is 32768
Received 32 blocks and 3000610 bytes
Compression is 25.9%
Took 2.3 sec
[description-setter] Could not determine description.
Recording test results
Email was triggered for: Failure
Sending email for trigger: Failure



###################################################################################
############################## FAILED TESTS (if any) ##############################
No tests ran.

Success: YARN-2821 PreCommit Build #7967

Posted by Apache Jenkins Server <je...@builds.apache.org>.
Jira: https://issues.apache.org/jira/browse/YARN-2821
Build: https://builds.apache.org/job/PreCommit-YARN-Build/7967/

###################################################################################
########################## LAST 60 LINES OF THE CONSOLE ###########################
[...truncated 263 lines...]
|  +1  |      release audit  |  0m 22s    | The applied patch does not increase 
|      |                     |            | the total number of release audit
|      |                     |            | warnings.
|  +1  |         checkstyle  |  0m 24s    | There were no new checkstyle 
|      |                     |            | issues.
|  +1  |         whitespace  |  0m 0s     | The patch has no lines that end in 
|      |                     |            | whitespace.
|  +1  |            install  |  1m 32s    | mvn install still works. 
|  +1  |    eclipse:eclipse  |  0m 33s    | The patch built with 
|      |                     |            | eclipse:eclipse.
|  +1  |           findbugs  |  0m 36s    | The patch does not introduce any 
|      |                     |            | new Findbugs (version 2.0.3)
|      |                     |            | warnings.
|  +1  |         yarn tests  |  6m 58s    | Tests passed in 
|      |                     |            | hadoop-yarn-applications-distributeds
|      |                     |            | hell.
|      |                     |  42m 25s   | 


|| Subsystem || Report/Notes ||
============================================================================
| Patch URL | http://issues.apache.org/jira/secure/attachment/12733521/YARN-2821.004.patch |
| Optional Tests | javadoc javac unit findbugs checkstyle |
| git revision | trunk / 363c355 |
| hadoop-yarn-applications-distributedshell test log | /home/jenkins/jenkins-slave/workspace/PreCommit-YARN-Build/patchprocess/testrun_hadoop-yarn-applications-distributedshell.txt |
| Test Results | https://builds.apache.org/job/PreCommit-YARN-Build/7967/testReport/ |
| Java | 1.7.0_55 |
| uname | Linux asf909.gq1.ygridcore.net 3.13.0-36-lowlatency #63-Ubuntu SMP PREEMPT Wed Sep 3 21:56:12 UTC 2014 x86_64 x86_64 x86_64 GNU/Linux |


============================================================================
============================================================================
                          Adding comment to JIRA
============================================================================
============================================================================


Comment added.
5577fe7b68137b410f97e8a803681f95380e38fc logged out


============================================================================
============================================================================
                              Finished build.
============================================================================
============================================================================


Archiving artifacts
Sending artifact delta relative to PreCommit-YARN-Build #7942
Archived 24 artifacts
Archive block size is 32768
Received 27 blocks and 8631918 bytes
Compression is 9.3%
Took 4.4 sec
Description set: YARN-2821
Recording test results
Email was triggered for: Success
Sending email for trigger: Success



###################################################################################
############################## FAILED TESTS (if any) ##############################
All tests passed

Failed: YARN-3411 PreCommit Build #7966

Posted by Apache Jenkins Server <je...@builds.apache.org>.
Jira: https://issues.apache.org/jira/browse/YARN-3411
Build: https://builds.apache.org/job/PreCommit-YARN-Build/7966/

###################################################################################
########################## LAST 60 LINES OF THE CONSOLE ###########################
[...truncated 300 lines...]
|      |                     |            | the total number of release audit
|      |                     |            | warnings.
|  +1  |         checkstyle  |  0m 15s    | There were no new checkstyle 
|      |                     |            | issues.
|  +1  |         whitespace  |  0m 0s     | The patch has no lines that end in 
|      |                     |            | whitespace.
|  +1  |            install  |  1m 41s    | mvn install still works. 
|  +1  |    eclipse:eclipse  |  0m 42s    | The patch built with 
|      |                     |            | eclipse:eclipse.
|  +1  |           findbugs  |  0m 38s    | The patch does not introduce any 
|      |                     |            | new Findbugs (version 2.0.3)
|      |                     |            | warnings.
|  +1  |         yarn tests  |  1m 16s    | Tests passed in 
|      |                     |            | hadoop-yarn-server-timelineservice.
|      |                     |  38m 26s   | 


|| Subsystem || Report/Notes ||
============================================================================
| Patch URL | http://issues.apache.org/jira/secure/attachment/12733531/YARN-3411-YARN-2928.004.patch |
| Optional Tests | javadoc javac unit findbugs checkstyle |
| git revision | YARN-2928 / 463e070 |
| javadoc | /home/jenkins/jenkins-slave/workspace/PreCommit-YARN-Build/patchprocess/diffJavadocWarnings.txt |
| hadoop-yarn-server-timelineservice test log | /home/jenkins/jenkins-slave/workspace/PreCommit-YARN-Build/patchprocess/testrun_hadoop-yarn-server-timelineservice.txt |
| Test Results | https://builds.apache.org/job/PreCommit-YARN-Build/7966/testReport/ |
| Java | 1.7.0_55 |
| uname | Linux asf903.gq1.ygridcore.net 3.13.0-36-lowlatency #63-Ubuntu SMP PREEMPT Wed Sep 3 21:56:12 UTC 2014 x86_64 x86_64 x86_64 GNU/Linux |


============================================================================
============================================================================
                          Adding comment to JIRA
============================================================================
============================================================================


Comment added.
0eb87ddd697abe48d2e6e3f85649693ed8f1c8b4 logged out


============================================================================
============================================================================
                              Finished build.
============================================================================
============================================================================


Build step 'Execute shell' marked build as failure
Archiving artifacts
Sending artifact delta relative to PreCommit-YARN-Build #7942
Archived 25 artifacts
Archive block size is 32768
Received 67 blocks and 7803072 bytes
Compression is 22.0%
Took 6.7 sec
[description-setter] Could not determine description.
Recording test results
Email was triggered for: Failure
Sending email for trigger: Failure



###################################################################################
############################## FAILED TESTS (if any) ##############################
All tests passed