You are viewing a plain text version of this content. The canonical link for it is here.
Posted to dev@lucene.apache.org by Apache Hudson Server <hu...@hudson.apache.org> on 2010/10/16 03:59:22 UTC
Build failed in Hudson: Lucene-Solr-tests-only-trunk #130
See <https://hudson.apache.org/hudson/job/Lucene-Solr-tests-only-trunk/130/>
------------------------------------------
[...truncated 7983 lines...]
[junit]
[junit] Testsuite: org.apache.solr.util.DateMathParserTest
[junit] Tests run: 7, Failures: 0, Errors: 0, Time elapsed: 0.053 sec
[junit]
[junit] Testsuite: org.apache.solr.velocity.VelocityResponseWriterTest
[junit] Tests run: 1, Failures: 0, Errors: 0, Time elapsed: 0.649 sec
[junit]
[junit] Testsuite: org.apache.solr.TestDistributedSearch
[junit] Testcase: testDistribSearch(org.apache.solr.TestDistributedSearch): FAILED
[junit] Some threads threw uncaught exceptions!
[junit] junit.framework.AssertionFailedError: Some threads threw uncaught exceptions!
[junit] at org.apache.lucene.util.LuceneTestCase$LuceneTestCaseRunner.runChild(LuceneTestCase.java:811)
[junit] at org.apache.lucene.util.LuceneTestCase$LuceneTestCaseRunner.runChild(LuceneTestCase.java:776)
[junit] at org.apache.lucene.util.LuceneTestCase.tearDown(LuceneTestCase.java:424)
[junit] at org.apache.solr.SolrTestCaseJ4.tearDown(SolrTestCaseJ4.java:76)
[junit] at org.apache.solr.BaseDistributedSearchTestCase.tearDown(BaseDistributedSearchTestCase.java:144)
[junit]
[junit]
[junit] Tests run: 1, Failures: 1, Errors: 0, Time elapsed: 646.652 sec
[junit]
[junit] ------------- Standard Error -----------------
[junit] 2010-10-16 6:52:33.PD org.apache.solr.common.SolrException log
[junit] SEVERE: org.apache.solr.common.SolrException: org.apache.solr.client.solrj.SolrServerException: org.apache.commons.httpclient.NoHttpResponseException: The server localhost failed to respond
[junit] at org.apache.solr.handler.component.SearchHandler.handleRequestBody(SearchHandler.java:318)
[junit] at org.apache.solr.handler.RequestHandlerBase.handleRequest(RequestHandlerBase.java:131)
[junit] at org.apache.solr.core.SolrCore.execute(SolrCore.java:1325)
[junit] at org.apache.solr.servlet.SolrDispatchFilter.execute(SolrDispatchFilter.java:337)
[junit] at org.apache.solr.servlet.SolrDispatchFilter.doFilter(SolrDispatchFilter.java:240)
[junit] at org.mortbay.jetty.servlet.ServletHandler$CachedChain.doFilter(ServletHandler.java:1157)
[junit] at org.mortbay.jetty.servlet.ServletHandler.handle(ServletHandler.java:388)
[junit] at org.mortbay.jetty.servlet.SessionHandler.handle(SessionHandler.java:182)
[junit] at org.mortbay.jetty.handler.ContextHandler.handle(ContextHandler.java:765)
[junit] at org.mortbay.jetty.handler.HandlerWrapper.handle(HandlerWrapper.java:152)
[junit] at org.mortbay.jetty.Server.handle(Server.java:326)
[junit] at org.mortbay.jetty.HttpConnection.handleRequest(HttpConnection.java:542)
[junit] at org.mortbay.jetty.HttpConnection$RequestHandler.headerComplete(HttpConnection.java:923)
[junit] at org.mortbay.jetty.HttpParser.parseNext(HttpParser.java:547)
[junit] at org.mortbay.jetty.HttpParser.parseAvailable(HttpParser.java:212)
[junit] at org.mortbay.jetty.HttpConnection.handle(HttpConnection.java:404)
[junit] at org.mortbay.io.nio.SelectChannelEndPoint.run(SelectChannelEndPoint.java:409)
[junit] at org.mortbay.thread.QueuedThreadPool$PoolThread.run(QueuedThreadPool.java:582)
[junit] Caused by: org.apache.solr.client.solrj.SolrServerException: org.apache.commons.httpclient.NoHttpResponseException: The server localhost failed to respond
[junit] at org.apache.solr.client.solrj.impl.CommonsHttpSolrServer.request(CommonsHttpSolrServer.java:483)
[junit] at org.apache.solr.client.solrj.impl.CommonsHttpSolrServer.request(CommonsHttpSolrServer.java:244)
[junit] at org.apache.solr.handler.component.HttpCommComponent$1.call(SearchHandler.java:511)
[junit] at org.apache.solr.handler.component.HttpCommComponent$1.call(SearchHandler.java:478)
[junit] at java.util.concurrent.FutureTask$Sync.innerRun(FutureTask.java:334)
[junit] at java.util.concurrent.FutureTask.run(FutureTask.java:166)
[junit] at java.util.concurrent.Executors$RunnableAdapter.call(Executors.java:471)
[junit] at java.util.concurrent.FutureTask$Sync.innerRun(FutureTask.java:334)
[junit] at java.util.concurrent.FutureTask.run(FutureTask.java:166)
[junit] at java.util.concurrent.ThreadPoolExecutor.runWorker(ThreadPoolExecutor.java:1110)
[junit] at java.util.concurrent.ThreadPoolExecutor$Worker.run(ThreadPoolExecutor.java:603)
[junit] at java.lang.Thread.run(Thread.java:636)
[junit] Caused by: org.apache.commons.httpclient.NoHttpResponseException: The server localhost failed to respond
[junit] at org.apache.commons.httpclient.HttpMethodBase.readStatusLine(HttpMethodBase.java:1976)
[junit] at org.apache.commons.httpclient.HttpMethodBase.readResponse(HttpMethodBase.java:1735)
[junit] at org.apache.commons.httpclient.HttpMethodBase.execute(HttpMethodBase.java:1098)
[junit] at org.apache.commons.httpclient.HttpMethodDirector.executeWithRetry(HttpMethodDirector.java:398)
[junit] at org.apache.commons.httpclient.HttpMethodDirector.executeMethod(HttpMethodDirector.java:171)
[junit] at org.apache.commons.httpclient.HttpClient.executeMethod(HttpClient.java:397)
[junit] at org.apache.commons.httpclient.HttpClient.executeMethod(HttpClient.java:323)
[junit] at org.apache.solr.client.solrj.impl.CommonsHttpSolrServer.request(CommonsHttpSolrServer.java:427)
[junit] ... 11 more
[junit]
[junit] 2010-10-16 6:57:15.PD org.apache.solr.common.SolrException log
[junit] SEVERE: org.apache.solr.common.SolrException: org.apache.solr.client.solrj.SolrServerException: No live SolrServers available to handle this request
[junit] at org.apache.solr.handler.component.SearchHandler.handleRequestBody(SearchHandler.java:318)
[junit] at org.apache.solr.handler.RequestHandlerBase.handleRequest(RequestHandlerBase.java:131)
[junit] at org.apache.solr.core.SolrCore.execute(SolrCore.java:1325)
[junit] at org.apache.solr.servlet.SolrDispatchFilter.execute(SolrDispatchFilter.java:337)
[junit] at org.apache.solr.servlet.SolrDispatchFilter.doFilter(SolrDispatchFilter.java:240)
[junit] at org.mortbay.jetty.servlet.ServletHandler$CachedChain.doFilter(ServletHandler.java:1157)
[junit] at org.mortbay.jetty.servlet.ServletHandler.handle(ServletHandler.java:388)
[junit] at org.mortbay.jetty.servlet.SessionHandler.handle(SessionHandler.java:182)
[junit] at org.mortbay.jetty.handler.ContextHandler.handle(ContextHandler.java:765)
[junit] at org.mortbay.jetty.handler.HandlerWrapper.handle(HandlerWrapper.java:152)
[junit] at org.mortbay.jetty.Server.handle(Server.java:326)
[junit] at org.mortbay.jetty.HttpConnection.handleRequest(HttpConnection.java:542)
[junit] at org.mortbay.jetty.HttpConnection$RequestHandler.headerComplete(HttpConnection.java:923)
[junit] at org.mortbay.jetty.HttpParser.parseNext(HttpParser.java:547)
[junit] at org.mortbay.jetty.HttpParser.parseAvailable(HttpParser.java:212)
[junit] at org.mortbay.jetty.HttpConnection.handle(HttpConnection.java:404)
[junit] at org.mortbay.io.nio.SelectChannelEndPoint.run(SelectChannelEndPoint.java:409)
[junit] at org.mortbay.thread.QueuedThreadPool$PoolThread.run(QueuedThreadPool.java:582)
[junit] Caused by: org.apache.solr.client.solrj.SolrServerException: No live SolrServers available to handle this request
[junit] at org.apache.solr.client.solrj.impl.LBHttpSolrServer.request(LBHttpSolrServer.java:297)
[junit] at org.apache.solr.handler.component.HttpCommComponent$1.call(SearchHandler.java:513)
[junit] at org.apache.solr.handler.component.HttpCommComponent$1.call(SearchHandler.java:478)
[junit] at java.util.concurrent.FutureTask$Sync.innerRun(FutureTask.java:334)
[junit] at java.util.concurrent.FutureTask.run(FutureTask.java:166)
[junit] at java.util.concurrent.Executors$RunnableAdapter.call(Executors.java:471)
[junit] at java.util.concurrent.FutureTask$Sync.innerRun(FutureTask.java:334)
[junit] at java.util.concurrent.FutureTask.run(FutureTask.java:166)
[junit] at java.util.concurrent.ThreadPoolExecutor.runWorker(ThreadPoolExecutor.java:1110)
[junit] at java.util.concurrent.ThreadPoolExecutor$Worker.run(ThreadPoolExecutor.java:603)
[junit] at java.lang.Thread.run(Thread.java:636)
[junit] Caused by: org.apache.solr.client.solrj.SolrServerException: java.net.ConnectException: Operation timed out
[junit] at org.apache.solr.client.solrj.impl.CommonsHttpSolrServer.request(CommonsHttpSolrServer.java:483)
[junit] at org.apache.solr.client.solrj.impl.CommonsHttpSolrServer.request(CommonsHttpSolrServer.java:244)
[junit] at org.apache.solr.client.solrj.impl.LBHttpSolrServer.request(LBHttpSolrServer.java:274)
[junit] ... 10 more
[junit] Caused by: java.net.ConnectException: Operation timed out
[junit] at java.net.PlainSocketImpl.socketConnect(Native Method)
[junit] at java.net.AbstractPlainSocketImpl.doConnect(AbstractPlainSocketImpl.java:310)
[junit] at java.net.AbstractPlainSocketImpl.connectToAddress(AbstractPlainSocketImpl.java:176)
[junit] at java.net.AbstractPlainSocketImpl.connect(AbstractPlainSocketImpl.java:163)
[junit] at java.net.SocksSocketImpl.connect(SocksSocketImpl.java:384)
[junit] at java.net.Socket.connect(Socket.java:546)
[junit] at java.net.Socket.connect(Socket.java:495)
[junit] at java.net.Socket.<init>(Socket.java:392)
[junit] at java.net.Socket.<init>(Socket.java:266)
[junit] at org.apache.commons.httpclient.protocol.DefaultProtocolSocketFactory.createSocket(DefaultProtocolSocketFactory.java:80)
[junit] at org.apache.commons.httpclient.protocol.DefaultProtocolSocketFactory.createSocket(DefaultProtocolSocketFactory.java:122)
[junit] at org.apache.commons.httpclient.HttpConnection.open(HttpConnection.java:707)
[junit] at org.apache.commons.httpclient.MultiThreadedHttpConnectionManager$HttpConnectionAdapter.open(MultiThreadedHttpConnectionManager.java:1361)
[junit] at org.apache.commons.httpclient.HttpMethodDirector.executeWithRetry(HttpMethodDirector.java:387)
[junit] at org.apache.commons.httpclient.HttpMethodDirector.executeMethod(HttpMethodDirector.java:171)
[junit] at org.apache.commons.httpclient.HttpClient.executeMethod(HttpClient.java:397)
[junit] at org.apache.commons.httpclient.HttpClient.executeMethod(HttpClient.java:323)
[junit] at org.apache.solr.client.solrj.impl.CommonsHttpSolrServer.request(CommonsHttpSolrServer.java:427)
[junit] ... 12 more
[junit]
[junit] The following exceptions were thrown by threads:
[junit] *** Thread: Thread-311 ***
[junit] java.lang.RuntimeException: org.apache.solr.client.solrj.SolrServerException: Error executing query
[junit] at org.apache.solr.BaseDistributedSearchTestCase$5.run(BaseDistributedSearchTestCase.java:324)
[junit] Caused by: org.apache.solr.client.solrj.SolrServerException: Error executing query
[junit] at org.apache.solr.client.solrj.request.QueryRequest.process(QueryRequest.java:95)
[junit] at org.apache.solr.client.solrj.SolrServer.query(SolrServer.java:119)
[junit] at org.apache.solr.BaseDistributedSearchTestCase$5.run(BaseDistributedSearchTestCase.java:319)
[junit] Caused by: org.apache.solr.common.SolrException: org.apache.solr.client.solrj.SolrServerException: org.apache.commons.httpclient.NoHttpResponseException: The server localhost failed to respond org.apache.solr.common.SolrException: org.apache.solr.client.solrj.SolrServerException: org.apache.commons.httpclient.NoHttpResponseException: The server localhost failed to respond at org.apache.solr.handler.component.SearchHandler.handleRequestBody(SearchHandler.java:318) at org.apache.solr.handler.RequestHandlerBase.handleRequest(RequestHandlerBase.java:131) at org.apache.solr.core.SolrCore.execute(SolrCore.java:1325) at org.apache.solr.servlet.SolrDispatchFilter.execute(SolrDispatchFilter.java:337) at org.apache.solr.servlet.SolrDispatchFilter.doFilter(SolrDispatchFilter.java:240) at org.mortbay.jetty.servlet.ServletHandler$CachedChain.doFilter(ServletHandler.java:1157) at org.mortbay.jetty.servlet.ServletHandler.handle(ServletHandler.java:388) at org.mortbay.jetty.servlet.SessionHandler.handle(SessionHandler.java:182) at org.mortbay.jetty.handler.ContextHandler.handle(ContextHandler.java:765) at org.mortbay.jetty.handler.HandlerWrapper.handle(HandlerWrapper.java:152) at org.mortbay.jetty.Server.handle(Server.java:326) at org.mortbay.jetty.HttpConnection.handleRequest(HttpConnection.java:542) at org.mortbay.jetty.HttpConnection$RequestHandler.headerComplete(HttpConnection.java:923) at org.mortbay.jetty.HttpParser.parseNext(HttpParser.java:547) at org.mortbay.jetty.HttpParser.parseAvailable(HttpParser.java:212) at org.mortbay.jetty.HttpConnection.handle(HttpConnection.java:404) at org.mortbay.io.nio.SelectChannelEndPoint.run(SelectChannelEndPoint.java:409) at org.mortbay.thread.QueuedThreadPool$PoolThread.run(QueuedThreadPool.java:582) Caused by: org.apache.solr.client.solrj.SolrServerException: org.apache.commons.httpclient.NoHttpResponseException: The server localhost failed to respond at org.apache.solr.client.solrj.impl.CommonsHttpSolrServer.request(CommonsHttpSolrServer.java:483) at org.apache.solr.client.solrj.impl.CommonsHttpSolrServer.reque
[junit]
[junit] org.apache.solr.client.solrj.SolrServerException: org.apache.commons.httpclient.NoHttpResponseException: The server localhost failed to respond org.apache.solr.common.SolrException: org.apache.solr.client.solrj.SolrServerException: org.apache.commons.httpclient.NoHttpResponseException: The server localhost failed to respond at org.apache.solr.handler.component.SearchHandler.handleRequestBody(SearchHandler.java:318) at org.apache.solr.handler.RequestHandlerBase.handleRequest(RequestHandlerBase.java:131) at org.apache.solr.core.SolrCore.execute(SolrCore.java:1325) at org.apache.solr.servlet.SolrDispatchFilter.execute(SolrDispatchFilter.java:337) at org.apache.solr.servlet.SolrDispatchFilter.doFilter(SolrDispatchFilter.java:240) at org.mortbay.jetty.servlet.ServletHandler$CachedChain.doFilter(ServletHandler.java:1157) at org.mortbay.jetty.servlet.ServletHandler.handle(ServletHandler.java:388) at org.mortbay.jetty.servlet.SessionHandler.handle(SessionHandler.java:182) at org.mortbay.jetty.handler.ContextHandler.handle(ContextHandler.java:765) at org.mortbay.jetty.handler.HandlerWrapper.handle(HandlerWrapper.java:152) at org.mortbay.jetty.Server.handle(Server.java:326) at org.mortbay.jetty.HttpConnection.handleRequest(HttpConnection.java:542) at org.mortbay.jetty.HttpConnection$RequestHandler.headerComplete(HttpConnection.java:923) at org.mortbay.jetty.HttpParser.parseNext(HttpParser.java:547) at org.mortbay.jetty.HttpParser.parseAvailable(HttpParser.java:212) at org.mortbay.jetty.HttpConnection.handle(HttpConnection.java:404) at org.mortbay.io.nio.SelectChannelEndPoint.run(SelectChannelEndPoint.java:409) at org.mortbay.thread.QueuedThreadPool$PoolThread.run(QueuedThreadPool.java:582) Caused by: org.apache.solr.client.solrj.SolrServerException: org.apache.commons.httpclient.NoHttpResponseException: The server localhost failed to respond at org.apache.solr.client.solrj.impl.CommonsHttpSolrServer.request(CommonsHttpSolrServer.java:483) at org.apache.solr.client.solrj.impl.CommonsHttpSolrServer.reque
[junit]
[junit] request: http://localhost:52913/solr/select?q=now their fox sat had put&fl=*,score&hl=true&hl.fl=a_t&shards=localhost:52913/solr,localhost:53327/solr|localhost:33332/solr&wt=javabin&version=2
[junit] at org.apache.solr.client.solrj.impl.CommonsHttpSolrServer.request(CommonsHttpSolrServer.java:435)
[junit] at org.apache.solr.client.solrj.impl.CommonsHttpSolrServer.request(CommonsHttpSolrServer.java:244)
[junit] at org.apache.solr.client.solrj.request.QueryRequest.process(QueryRequest.java:89)
[junit] ... 2 more
[junit] *** Thread: Thread-466 ***
[junit] java.lang.RuntimeException: org.apache.solr.client.solrj.SolrServerException: Error executing query
[junit] at org.apache.solr.BaseDistributedSearchTestCase$5.run(BaseDistributedSearchTestCase.java:324)
[junit] Caused by: org.apache.solr.client.solrj.SolrServerException: Error executing query
[junit] at org.apache.solr.client.solrj.request.QueryRequest.process(QueryRequest.java:95)
[junit] at org.apache.solr.client.solrj.SolrServer.query(SolrServer.java:119)
[junit] at org.apache.solr.BaseDistributedSearchTestCase$5.run(BaseDistributedSearchTestCase.java:319)
[junit] Caused by: org.apache.solr.common.SolrException: org.apache.solr.client.solrj.SolrServerException: No live SolrServers available to handle this request org.apache.solr.common.SolrException: org.apache.solr.client.solrj.SolrServerException: No live SolrServers available to handle this request at org.apache.solr.handler.component.SearchHandler.handleRequestBody(SearchHandler.java:318) at org.apache.solr.handler.RequestHandlerBase.handleRequest(RequestHandlerBase.java:131) at org.apache.solr.core.SolrCore.execute(SolrCore.java:1325) at org.apache.solr.servlet.SolrDispatchFilter.execute(SolrDispatchFilter.java:337) at org.apache.solr.servlet.SolrDispatchFilter.doFilter(SolrDispatchFilter.java:240) at org.mortbay.jetty.servlet.ServletHandler$CachedChain.doFilter(ServletHandler.java:1157) at org.mortbay.jetty.servlet.ServletHandler.handle(ServletHandler.java:388) at org.mortbay.jetty.servlet.SessionHandler.handle(SessionHandler.java:182) at org.mortbay.jetty.handler.ContextHandler.handle(ContextHandler.java:765) at org.mortbay.jetty.handler.HandlerWrapper.handle(HandlerWrapper.java:152) at org.mortbay.jetty.Server.handle(Server.java:326) at org.mortbay.jetty.HttpConnection.handleRequest(HttpConnection.java:542) at org.mortbay.jetty.HttpConnection$RequestHandler.headerComplete(HttpConnection.java:923) at org.mortbay.jetty.HttpParser.parseNext(HttpParser.java:547) at org.mortbay.jetty.HttpParser.parseAvailable(HttpParser.java:212) at org.mortbay.jetty.HttpConnection.handle(HttpConnection.java:404) at org.mortbay.io.nio.SelectChannelEndPoint.run(SelectChannelEndPoint.java:409) at org.mortbay.thread.QueuedThreadPool$PoolThread.run(QueuedThreadPool.java:582) Caused by: org.apache.solr.client.solrj.SolrServerException: No live SolrServers available to handle this request at org.apache.solr.client.solrj.impl.LBHttpSolrServer.request(LBHttpSolrServer.java:297) at org.apache.solr.handler.component.HttpCommComponent$1.call(SearchHandler.java:513) at org.apache.solr.handler.component.HttpCommComponent$1.call(SearchHandler.java:478) at java.util.concurrent
[junit]
[junit] org.apache.solr.client.solrj.SolrServerException: No live SolrServers available to handle this request org.apache.solr.common.SolrException: org.apache.solr.client.solrj.SolrServerException: No live SolrServers available to handle this request at org.apache.solr.handler.component.SearchHandler.handleRequestBody(SearchHandler.java:318) at org.apache.solr.handler.RequestHandlerBase.handleRequest(RequestHandlerBase.java:131) at org.apache.solr.core.SolrCore.execute(SolrCore.java:1325) at org.apache.solr.servlet.SolrDispatchFilter.execute(SolrDispatchFilter.java:337) at org.apache.solr.servlet.SolrDispatchFilter.doFilter(SolrDispatchFilter.java:240) at org.mortbay.jetty.servlet.ServletHandler$CachedChain.doFilter(ServletHandler.java:1157) at org.mortbay.jetty.servlet.ServletHandler.handle(ServletHandler.java:388) at org.mortbay.jetty.servlet.SessionHandler.handle(SessionHandler.java:182) at org.mortbay.jetty.handler.ContextHandler.handle(ContextHandler.java:765) at org.mortbay.jetty.handler.HandlerWrapper.handle(HandlerWrapper.java:152) at org.mortbay.jetty.Server.handle(Server.java:326) at org.mortbay.jetty.HttpConnection.handleRequest(HttpConnection.java:542) at org.mortbay.jetty.HttpConnection$RequestHandler.headerComplete(HttpConnection.java:923) at org.mortbay.jetty.HttpParser.parseNext(HttpParser.java:547) at org.mortbay.jetty.HttpParser.parseAvailable(HttpParser.java:212) at org.mortbay.jetty.HttpConnection.handle(HttpConnection.java:404) at org.mortbay.io.nio.SelectChannelEndPoint.run(SelectChannelEndPoint.java:409) at org.mortbay.thread.QueuedThreadPool$PoolThread.run(QueuedThreadPool.java:582) Caused by: org.apache.solr.client.solrj.SolrServerException: No live SolrServers available to handle this request at org.apache.solr.client.solrj.impl.LBHttpSolrServer.request(LBHttpSolrServer.java:297) at org.apache.solr.handler.component.HttpCommComponent$1.call(SearchHandler.java:513) at org.apache.solr.handler.component.HttpCommComponent$1.call(SearchHandler.java:478) at java.util.concurrent
[junit]
[junit] request: http://localhost:17046/solr/select?q=*:*&sort=n_l asc&shards=localhost:17044/solr|localhost:33332/solr,localhost:17046/solr,localhost:17048/solr|localhost:33332/solr&wt=javabin&version=2
[junit] at org.apache.solr.client.solrj.impl.CommonsHttpSolrServer.request(CommonsHttpSolrServer.java:435)
[junit] at org.apache.solr.client.solrj.impl.CommonsHttpSolrServer.request(CommonsHttpSolrServer.java:244)
[junit] at org.apache.solr.client.solrj.request.QueryRequest.process(QueryRequest.java:89)
[junit] ... 2 more
[junit] ------------- ---------------- ---------------
[junit] TEST org.apache.solr.TestDistributedSearch FAILED
[junit] Testsuite: org.apache.solr.analysis.TestCzechStemFilterFactory
[junit] Tests run: 1, Failures: 0, Errors: 0, Time elapsed: 0.052 sec
[junit]
[junit] Testsuite: org.apache.solr.analysis.TestDelimitedPayloadTokenFilterFactory
[junit] Tests run: 2, Failures: 0, Errors: 0, Time elapsed: 0.063 sec
[junit]
[junit] Testsuite: org.apache.solr.analysis.TestEnglishMinimalStemFilterFactory
[junit] Tests run: 1, Failures: 0, Errors: 0, Time elapsed: 0.018 sec
[junit]
[junit] Testsuite: org.apache.solr.analysis.TestHindiFilters
[junit] Tests run: 4, Failures: 0, Errors: 0, Time elapsed: 0.058 sec
[junit]
[junit] Testsuite: org.apache.solr.analysis.TestPortugueseLightStemFilterFactory
[junit] Tests run: 1, Failures: 0, Errors: 0, Time elapsed: 0.039 sec
[junit]
[junit] Testsuite: org.apache.solr.analysis.TestReverseStringFilterFactory
[junit] Tests run: 1, Failures: 0, Errors: 0, Time elapsed: 0.016 sec
[junit]
[junit] Testsuite: org.apache.solr.analysis.TestRussianFilters
[junit] Tests run: 3, Failures: 0, Errors: 0, Time elapsed: 0.053 sec
[junit]
[junit] Testsuite: org.apache.solr.analysis.TestWikipediaTokenizerFactory
[junit] Tests run: 1, Failures: 0, Errors: 0, Time elapsed: 0.018 sec
[junit]
[junit] Testsuite: org.apache.solr.client.solrj.embedded.LargeVolumeEmbeddedTest
[junit] Tests run: 1, Failures: 0, Errors: 0, Time elapsed: 1.176 sec
[junit]
[junit] Testsuite: org.apache.solr.client.solrj.request.TestUpdateRequestCodec
[junit] Tests run: 2, Failures: 0, Errors: 0, Time elapsed: 0.04 sec
[junit]
[junit] Testsuite: org.apache.solr.client.solrj.response.QueryResponseTest
[junit] Tests run: 1, Failures: 0, Errors: 0, Time elapsed: 0.071 sec
[junit]
[junit] Testsuite: org.apache.solr.cloud.ZkControllerTest
[junit] Tests run: 3, Failures: 0, Errors: 0, Time elapsed: 3.394 sec
[junit]
[junit] Testsuite: org.apache.solr.common.params.ModifiableSolrParamsTest
[junit] Tests run: 5, Failures: 0, Errors: 0, Time elapsed: 0.013 sec
[junit]
[junit] Testsuite: org.apache.solr.common.util.TestNamedListCodec
[junit] Tests run: 4, Failures: 0, Errors: 0, Time elapsed: 0.446 sec
[junit]
[junit] Testsuite: org.apache.solr.core.TestQuerySenderListener
[junit] Tests run: 2, Failures: 0, Errors: 0, Time elapsed: 0.601 sec
[junit]
[junit] Testsuite: org.apache.solr.core.TestSolrDeletionPolicy2
[junit] Tests run: 1, Failures: 0, Errors: 0, Time elapsed: 0.594 sec
[junit]
[junit] Testsuite: org.apache.solr.handler.TestCSVLoader
[junit] Tests run: 4, Failures: 0, Errors: 0, Time elapsed: 1.645 sec
[junit]
[junit] Testsuite: org.apache.solr.handler.XmlUpdateRequestHandlerTest
[junit] Tests run: 1, Failures: 0, Errors: 0, Time elapsed: 0.478 sec
[junit]
[junit] Testsuite: org.apache.solr.handler.component.DebugComponentTest
[junit] Tests run: 2, Failures: 0, Errors: 0, Time elapsed: 0.614 sec
[junit]
[junit] Testsuite: org.apache.solr.schema.IndexSchemaTest
[junit] Tests run: 5, Failures: 0, Errors: 0, Time elapsed: 0.622 sec
[junit]
[junit] Testsuite: org.apache.solr.schema.PolyFieldTest
[junit] Tests run: 4, Failures: 0, Errors: 0, Time elapsed: 0.718 sec
[junit]
[junit] Testsuite: org.apache.solr.search.TestFastLRUCache
[junit] Tests run: 6, Failures: 0, Errors: 0, Time elapsed: 0.02 sec
[junit]
[junit] Testsuite: org.apache.solr.search.function.TestFunctionQuery
[junit] Tests run: 7, Failures: 0, Errors: 0, Time elapsed: 1.633 sec
[junit]
[junit] ------------- Standard Error -----------------
[junit] 15/Out/2010 23:58:46 org.apache.solr.SolrTestCaseJ4 assertQ
[junit] SEVERE: REQUEST FAILED: fl=*,score&q={!func}10+wow+dude+ignore_exception
[junit] ------------- ---------------- ---------------
[junit] Testsuite: org.apache.solr.servlet.SolrRequestParserTest
[junit] Tests run: 4, Failures: 0, Errors: 0, Time elapsed: 0.708 sec
[junit]
[junit] Testsuite: org.apache.solr.spelling.suggest.SuggesterTest
[junit] Tests run: 2, Failures: 0, Errors: 0, Time elapsed: 0.196 sec
[junit]
[junit] Testsuite: org.apache.solr.update.DocumentBuilderTest
[junit] Tests run: 3, Failures: 0, Errors: 0, Time elapsed: 0.449 sec
[junit]
[junit] Tests FAILED
BUILD FAILED
/usr<https://hudson.apache.org/hudson/job/Lucene-Solr-tests-only-trunk/ws/checkout/build.xml>:23: The following error occurred while executing this line:
/usr<https://hudson.apache.org/hudson/job/Lucene-Solr-tests-only-trunk/ws/checkout/solr/build.xml>:391: The following error occurred while executing this line:
/usr<https://hudson.apache.org/hudson/job/Lucene-Solr-tests-only-trunk/ws/checkout/solr/build.xml>:482: Tests failed!
Total time: 33 minutes 45 seconds
Recording test results
---------------------------------------------------------------------
To unsubscribe, e-mail: dev-unsubscribe@lucene.apache.org
For additional commands, e-mail: dev-help@lucene.apache.org
Hudson build is back to normal : Lucene-Solr-tests-only-trunk #132
Posted by Apache Hudson Server <hu...@hudson.apache.org>.
See <https://hudson.apache.org/hudson/job/Lucene-Solr-tests-only-trunk/132/>
---------------------------------------------------------------------
To unsubscribe, e-mail: dev-unsubscribe@lucene.apache.org
For additional commands, e-mail: dev-help@lucene.apache.org
Build failed in Hudson: Lucene-Solr-tests-only-trunk #131
Posted by Apache Hudson Server <hu...@hudson.apache.org>.
See <https://hudson.apache.org/hudson/job/Lucene-Solr-tests-only-trunk/131/>
------------------------------------------
[...truncated 9244 lines...]
[junit]
[junit] Testsuite: org.apache.solr.handler.dataimport.TestFieldReader
[junit] Tests run: 1, Failures: 0, Errors: 0, Time elapsed: 0.016 sec
[junit]
[junit] Testsuite: org.apache.solr.handler.dataimport.TestFileListEntityProcessor
[junit] Testcase: testNTOT(org.apache.solr.handler.dataimport.TestFileListEntityProcessor): Caused an ERROR
[junit] Invalid expression for date
[junit] org.apache.solr.handler.dataimport.DataImportHandlerException: Invalid expression for date
[junit] at org.apache.solr.handler.dataimport.FileListEntityProcessor.getDate(FileListEntityProcessor.java:167)
[junit] at org.apache.solr.handler.dataimport.FileListEntityProcessor.nextRow(FileListEntityProcessor.java:204)
[junit] at org.apache.solr.handler.dataimport.TestFileListEntityProcessor.getFiles(TestFileListEntityProcessor.java:124)
[junit] at org.apache.solr.handler.dataimport.TestFileListEntityProcessor.testNTOT(TestFileListEntityProcessor.java:163)
[junit] at org.apache.lucene.util.LuceneTestCase$LuceneTestCaseRunner.runChild(LuceneTestCase.java:811)
[junit] at org.apache.lucene.util.LuceneTestCase$LuceneTestCaseRunner.runChild(LuceneTestCase.java:776)
[junit] Caused by: java.text.ParseException: Unparseable date: "2010-10-16 04:16:23"
[junit] at java.text.DateFormat.parse(DateFormat.java:354)
[junit] at org.apache.solr.handler.dataimport.FileListEntityProcessor.getDate(FileListEntityProcessor.java:165)
[junit]
[junit]
[junit] Tests run: 4, Failures: 0, Errors: 1, Time elapsed: 0.026 sec
[junit]
[junit] ------------- Standard Output ---------------
[junit] NOTE: reproduce with: ant test -Dtestcase=TestFileListEntityProcessor -Dtestmethod=testNTOT -Dtests.seed=1752943653386448424:-444124962159389380
[junit] NOTE: test params are: codec=MockFixedIntBlock(blockSize=998), locale=en_CA, timezone=Europe/Kiev
[junit] ------------- ---------------- ---------------
[junit] TEST org.apache.solr.handler.dataimport.TestFileListEntityProcessor FAILED
[junit] Testsuite: org.apache.solr.handler.dataimport.TestJdbcDataSource
[junit] Tests run: 3, Failures: 0, Errors: 0, Time elapsed: 0.063 sec
[junit]
[junit] ------------- Standard Error -----------------
[junit] NOTE: Ignoring test method 'testBasic'
[junit] ------------- ---------------- ---------------
[junit] Testsuite: org.apache.solr.handler.dataimport.TestLineEntityProcessor
[junit] Tests run: 4, Failures: 0, Errors: 0, Time elapsed: 0.015 sec
[junit]
[junit] Testsuite: org.apache.solr.handler.dataimport.TestNumberFormatTransformer
[junit] Tests run: 9, Failures: 0, Errors: 0, Time elapsed: 0.024 sec
[junit]
[junit] Testsuite: org.apache.solr.handler.dataimport.TestPlainTextEntityProcessor
[junit] Tests run: 1, Failures: 0, Errors: 0, Time elapsed: 0.017 sec
[junit]
[junit] Testsuite: org.apache.solr.handler.dataimport.TestRegexTransformer
[junit] Tests run: 5, Failures: 0, Errors: 0, Time elapsed: 0.017 sec
[junit]
[junit] Testsuite: org.apache.solr.handler.dataimport.TestScriptTransformer
[junit] Tests run: 0, Failures: 0, Errors: 0, Time elapsed: 0.009 sec
[junit]
[junit] ------------- Standard Error -----------------
[junit] NOTE: Ignoring test method 'testBasic'
[junit] NOTE: Ignoring test method 'testOneparam'
[junit] NOTE: Ignoring test method 'testReadScriptTag'
[junit] NOTE: Ignoring test method 'testCheckScript'
[junit] ------------- ---------------- ---------------
[junit] Testsuite: org.apache.solr.handler.dataimport.TestSqlEntityProcessor
[junit] Tests run: 4, Failures: 0, Errors: 0, Time elapsed: 0.018 sec
[junit]
[junit] Testsuite: org.apache.solr.handler.dataimport.TestSqlEntityProcessor2
[junit] Testcase: testLastIndexTime(org.apache.solr.handler.dataimport.TestSqlEntityProcessor2): Caused an ERROR
[junit] Exception during query
[junit] java.lang.RuntimeException: Exception during query
[junit] at org.apache.solr.SolrTestCaseJ4.assertQ(SolrTestCaseJ4.java:343)
[junit] at org.apache.solr.SolrTestCaseJ4.assertQ(SolrTestCaseJ4.java:310)
[junit] at org.apache.solr.handler.dataimport.TestSqlEntityProcessor2.testLastIndexTime(TestSqlEntityProcessor2.java:211)
[junit] at org.apache.lucene.util.LuceneTestCase$LuceneTestCaseRunner.runChild(LuceneTestCase.java:811)
[junit] at org.apache.lucene.util.LuceneTestCase$LuceneTestCaseRunner.runChild(LuceneTestCase.java:776)
[junit] Caused by: java.lang.RuntimeException: REQUEST FAILED: xpath=//*[@numFound='1']
[junit] xml response was: <?xml version="1.0" encoding="UTF-8"?>
[junit] <response>
[junit] <lst name="responseHeader"><int name="status">0</int><int name="QTime">2</int><lst name="params"><str name="start">0</str><str name="q">id:5</str><str name="qt">standard</str><str name="rows">20</str><str name="version">2.2</str></lst></lst><result name="response" numFound="0" start="0"/>
[junit] </response>
[junit]
[junit] request was:start=0&q=id:5&qt=standard&rows=20&version=2.2
[junit] at org.apache.solr.SolrTestCaseJ4.assertQ(SolrTestCaseJ4.java:336)
[junit]
[junit]
[junit] Tests run: 7, Failures: 0, Errors: 1, Time elapsed: 0.738 sec
[junit]
[junit] ------------- Standard Output ---------------
[junit] NOTE: reproduce with: ant test -Dtestcase=TestSqlEntityProcessor2 -Dtestmethod=testLastIndexTime -Dtests.seed=7469614386427859964:-4276408692106499042
[junit] NOTE: test params are: codec=MockSep, locale=ga_IE, timezone=America/Regina
[junit] ------------- ---------------- ---------------
[junit] ------------- Standard Error -----------------
[junit] 15 DFómh 2010 20:17:14 org.apache.solr.handler.dataimport.JdbcDataSource finalize
[junit] SEVERE: JdbcDataSource was not closed prior to finalize(), indicates a bug -- POSSIBLE RESOURCE LEAK!!!
[junit] 15 DFómh 2010 20:17:14 org.apache.solr.handler.dataimport.JdbcDataSource finalize
[junit] SEVERE: JdbcDataSource was not closed prior to finalize(), indicates a bug -- POSSIBLE RESOURCE LEAK!!!
[junit] 15 DFómh 2010 20:17:14 org.apache.solr.handler.dataimport.JdbcDataSource finalize
[junit] SEVERE: JdbcDataSource was not closed prior to finalize(), indicates a bug -- POSSIBLE RESOURCE LEAK!!!
[junit] 15 DFómh 2010 20:17:14 org.apache.solr.handler.dataimport.DocBuilder buildDocument
[junit] SEVERE: Exception while processing: x document : SolrInputDocument[{}]
[junit] org.apache.solr.handler.dataimport.DataImportHandlerException: java.text.ParseException: Unparseable date: "1970-01-01 01:00:00"
[junit] at org.apache.solr.handler.dataimport.DataImportHandlerException.wrapAndThrow(DataImportHandlerException.java:64)
[junit] at org.apache.solr.handler.dataimport.TestSqlEntityProcessor2$DateFormatValidatingEvaluator.evaluate(TestSqlEntityProcessor2.java:228)
[junit] at org.apache.solr.handler.dataimport.EvaluatorBag$5.get(EvaluatorBag.java:218)
[junit] at org.apache.solr.handler.dataimport.EvaluatorBag$5.get(EvaluatorBag.java:205)
[junit] at org.apache.solr.handler.dataimport.VariableResolverImpl.resolve(VariableResolverImpl.java:116)
[junit] at org.apache.solr.handler.dataimport.TemplateString.fillTokens(TemplateString.java:81)
[junit] at org.apache.solr.handler.dataimport.TemplateString.replaceTokens(TemplateString.java:75)
[junit] at org.apache.solr.handler.dataimport.VariableResolverImpl.replaceTokens(VariableResolverImpl.java:95)
[junit] at org.apache.solr.handler.dataimport.ContextImpl.replaceTokens(ContextImpl.java:235)
[junit] at org.apache.solr.handler.dataimport.SqlEntityProcessor.nextRow(SqlEntityProcessor.java:71)
[junit] at org.apache.solr.handler.dataimport.EntityProcessorWrapper.nextRow(EntityProcessorWrapper.java:233)
[junit] at org.apache.solr.handler.dataimport.DocBuilder.buildDocument(DocBuilder.java:579)
[junit] at org.apache.solr.handler.dataimport.DocBuilder.doFullDump(DocBuilder.java:260)
[junit] at org.apache.solr.handler.dataimport.DocBuilder.execute(DocBuilder.java:184)
[junit] at org.apache.solr.handler.dataimport.DataImporter.doFullImport(DataImporter.java:334)
[junit] at org.apache.solr.handler.dataimport.DataImporter.runCmd(DataImporter.java:392)
[junit] at org.apache.solr.handler.dataimport.DataImportHandler.handleRequestBody(DataImportHandler.java:203)
[junit] at org.apache.solr.handler.RequestHandlerBase.handleRequest(RequestHandlerBase.java:131)
[junit] at org.apache.solr.core.SolrCore.execute(SolrCore.java:1325)
[junit] at org.apache.solr.util.TestHarness.queryAndResponse(TestHarness.java:339)
[junit] at org.apache.solr.util.TestHarness.query(TestHarness.java:322)
[junit] at org.apache.solr.handler.dataimport.AbstractDataImportHandlerTestCase.runFullImport(AbstractDataImportHandlerTestCase.java:81)
[junit] at org.apache.solr.handler.dataimport.TestSqlEntityProcessor2.testLastIndexTime(TestSqlEntityProcessor2.java:210)
[junit] at sun.reflect.NativeMethodAccessorImpl.invoke0(Native Method)
[junit] at sun.reflect.NativeMethodAccessorImpl.invoke(NativeMethodAccessorImpl.java:57)
[junit] at sun.reflect.DelegatingMethodAccessorImpl.invoke(DelegatingMethodAccessorImpl.java:43)
[junit] at java.lang.reflect.Method.invoke(Method.java:616)
[junit] at org.junit.runners.model.FrameworkMethod$1.runReflectiveCall(FrameworkMethod.java:44)
[junit] at org.junit.internal.runners.model.ReflectiveCallable.run(ReflectiveCallable.java:15)
[junit] at org.junit.runners.model.FrameworkMethod.invokeExplosively(FrameworkMethod.java:41)
[junit] at org.junit.internal.runners.statements.InvokeMethod.evaluate(InvokeMethod.java:20)
[junit] at org.junit.rules.TestWatchman$1.evaluate(TestWatchman.java:48)
[junit] at org.junit.internal.runners.statements.RunBefores.evaluate(RunBefores.java:28)
[junit] at org.junit.internal.runners.statements.RunAfters.evaluate(RunAfters.java:31)
[junit] at org.junit.runners.BlockJUnit4ClassRunner.runChild(BlockJUnit4ClassRunner.java:76)
[junit] at org.apache.lucene.util.LuceneTestCase$LuceneTestCaseRunner.runChild(LuceneTestCase.java:811)
[junit] at org.apache.lucene.util.LuceneTestCase$LuceneTestCaseRunner.runChild(LuceneTestCase.java:776)
[junit] at org.junit.runners.ParentRunner$3.run(ParentRunner.java:193)
[junit] at org.junit.runners.ParentRunner$1.schedule(ParentRunner.java:52)
[junit] at org.junit.runners.ParentRunner.runChildren(ParentRunner.java:191)
[junit] at org.junit.runners.ParentRunner.access$000(ParentRunner.java:42)
[junit] at org.junit.runners.ParentRunner$2.evaluate(ParentRunner.java:184)
[junit] at org.junit.internal.runners.statements.RunBefores.evaluate(RunBefores.java:28)
[junit] at org.junit.internal.runners.statements.RunAfters.evaluate(RunAfters.java:31)
[junit] at org.junit.runners.ParentRunner.run(ParentRunner.java:236)
[junit] at junit.framework.JUnit4TestAdapter.run(JUnit4TestAdapter.java:39)
[junit] at org.apache.tools.ant.taskdefs.optional.junit.JUnitTestRunner.run(JUnitTestRunner.java:421)
[junit] at org.apache.tools.ant.taskdefs.optional.junit.JUnitTestRunner.launch(JUnitTestRunner.java:912)
[junit] at org.apache.tools.ant.taskdefs.optional.junit.JUnitTestRunner.main(JUnitTestRunner.java:743)
[junit] Caused by: java.text.ParseException: Unparseable date: "1970-01-01 01:00:00"
[junit] at java.text.DateFormat.parse(DateFormat.java:354)
[junit] at org.apache.solr.handler.dataimport.TestSqlEntityProcessor2$DateFormatValidatingEvaluator.evaluate(TestSqlEntityProcessor2.java:226)
[junit] ... 47 more
[junit] 15 DFómh 2010 20:17:14 org.apache.solr.handler.dataimport.DataImporter doFullImport
[junit] SEVERE: Full Import failed
[junit] org.apache.solr.handler.dataimport.DataImportHandlerException: java.text.ParseException: Unparseable date: "1970-01-01 01:00:00"
[junit] at org.apache.solr.handler.dataimport.DataImportHandlerException.wrapAndThrow(DataImportHandlerException.java:64)
[junit] at org.apache.solr.handler.dataimport.TestSqlEntityProcessor2$DateFormatValidatingEvaluator.evaluate(TestSqlEntityProcessor2.java:228)
[junit] at org.apache.solr.handler.dataimport.EvaluatorBag$5.get(EvaluatorBag.java:218)
[junit] at org.apache.solr.handler.dataimport.EvaluatorBag$5.get(EvaluatorBag.java:205)
[junit] at org.apache.solr.handler.dataimport.VariableResolverImpl.resolve(VariableResolverImpl.java:116)
[junit] at org.apache.solr.handler.dataimport.TemplateString.fillTokens(TemplateString.java:81)
[junit] at org.apache.solr.handler.dataimport.TemplateString.replaceTokens(TemplateString.java:75)
[junit] at org.apache.solr.handler.dataimport.VariableResolverImpl.replaceTokens(VariableResolverImpl.java:95)
[junit] at org.apache.solr.handler.dataimport.ContextImpl.replaceTokens(ContextImpl.java:235)
[junit] at org.apache.solr.handler.dataimport.SqlEntityProcessor.nextRow(SqlEntityProcessor.java:71)
[junit] at org.apache.solr.handler.dataimport.EntityProcessorWrapper.nextRow(EntityProcessorWrapper.java:233)
[junit] at org.apache.solr.handler.dataimport.DocBuilder.buildDocument(DocBuilder.java:579)
[junit] at org.apache.solr.handler.dataimport.DocBuilder.doFullDump(DocBuilder.java:260)
[junit] at org.apache.solr.handler.dataimport.DocBuilder.execute(DocBuilder.java:184)
[junit] at org.apache.solr.handler.dataimport.DataImporter.doFullImport(DataImporter.java:334)
[junit] at org.apache.solr.handler.dataimport.DataImporter.runCmd(DataImporter.java:392)
[junit] at org.apache.solr.handler.dataimport.DataImportHandler.handleRequestBody(DataImportHandler.java:203)
[junit] at org.apache.solr.handler.RequestHandlerBase.handleRequest(RequestHandlerBase.java:131)
[junit] at org.apache.solr.core.SolrCore.execute(SolrCore.java:1325)
[junit] at org.apache.solr.util.TestHarness.queryAndResponse(TestHarness.java:339)
[junit] at org.apache.solr.util.TestHarness.query(TestHarness.java:322)
[junit] at org.apache.solr.handler.dataimport.AbstractDataImportHandlerTestCase.runFullImport(AbstractDataImportHandlerTestCase.java:81)
[junit] at org.apache.solr.handler.dataimport.TestSqlEntityProcessor2.testLastIndexTime(TestSqlEntityProcessor2.java:210)
[junit] at sun.reflect.NativeMethodAccessorImpl.invoke0(Native Method)
[junit] at sun.reflect.NativeMethodAccessorImpl.invoke(NativeMethodAccessorImpl.java:57)
[junit] at sun.reflect.DelegatingMethodAccessorImpl.invoke(DelegatingMethodAccessorImpl.java:43)
[junit] at java.lang.reflect.Method.invoke(Method.java:616)
[junit] at org.junit.runners.model.FrameworkMethod$1.runReflectiveCall(FrameworkMethod.java:44)
[junit] at org.junit.internal.runners.model.ReflectiveCallable.run(ReflectiveCallable.java:15)
[junit] at org.junit.runners.model.FrameworkMethod.invokeExplosively(FrameworkMethod.java:41)
[junit] at org.junit.internal.runners.statements.InvokeMethod.evaluate(InvokeMethod.java:20)
[junit] at org.junit.rules.TestWatchman$1.evaluate(TestWatchman.java:48)
[junit] at org.junit.internal.runners.statements.RunBefores.evaluate(RunBefores.java:28)
[junit] at org.junit.internal.runners.statements.RunAfters.evaluate(RunAfters.java:31)
[junit] at org.junit.runners.BlockJUnit4ClassRunner.runChild(BlockJUnit4ClassRunner.java:76)
[junit] at org.apache.lucene.util.LuceneTestCase$LuceneTestCaseRunner.runChild(LuceneTestCase.java:811)
[junit] at org.apache.lucene.util.LuceneTestCase$LuceneTestCaseRunner.runChild(LuceneTestCase.java:776)
[junit] at org.junit.runners.ParentRunner$3.run(ParentRunner.java:193)
[junit] at org.junit.runners.ParentRunner$1.schedule(ParentRunner.java:52)
[junit] at org.junit.runners.ParentRunner.runChildren(ParentRunner.java:191)
[junit] at org.junit.runners.ParentRunner.access$000(ParentRunner.java:42)
[junit] at org.junit.runners.ParentRunner$2.evaluate(ParentRunner.java:184)
[junit] at org.junit.internal.runners.statements.RunBefores.evaluate(RunBefores.java:28)
[junit] at org.junit.internal.runners.statements.RunAfters.evaluate(RunAfters.java:31)
[junit] at org.junit.runners.ParentRunner.run(ParentRunner.java:236)
[junit] at junit.framework.JUnit4TestAdapter.run(JUnit4TestAdapter.java:39)
[junit] at org.apache.tools.ant.taskdefs.optional.junit.JUnitTestRunner.run(JUnitTestRunner.java:421)
[junit] at org.apache.tools.ant.taskdefs.optional.junit.JUnitTestRunner.launch(JUnitTestRunner.java:912)
[junit] at org.apache.tools.ant.taskdefs.optional.junit.JUnitTestRunner.main(JUnitTestRunner.java:743)
[junit] Caused by: java.text.ParseException: Unparseable date: "1970-01-01 01:00:00"
[junit] at java.text.DateFormat.parse(DateFormat.java:354)
[junit] at org.apache.solr.handler.dataimport.TestSqlEntityProcessor2$DateFormatValidatingEvaluator.evaluate(TestSqlEntityProcessor2.java:226)
[junit] ... 47 more
[junit] 15 DFómh 2010 20:17:14 org.apache.solr.SolrTestCaseJ4 assertQ
[junit] SEVERE: REQUEST FAILED: xpath=//*[@numFound='1']
[junit] xml response was: <?xml version="1.0" encoding="UTF-8"?>
[junit] <response>
[junit] <lst name="responseHeader"><int name="status">0</int><int name="QTime">2</int><lst name="params"><str name="start">0</str><str name="q">id:5</str><str name="qt">standard</str><str name="rows">20</str><str name="version">2.2</str></lst></lst><result name="response" numFound="0" start="0"/>
[junit] </response>
[junit]
[junit] request was:start=0&q=id:5&qt=standard&rows=20&version=2.2
[junit] 15 DFómh 2010 20:17:14 org.apache.solr.SolrTestCaseJ4 assertQ
[junit] SEVERE: REQUEST FAILED: start=0&q=id:5&qt=standard&rows=20&version=2.2
[junit] ------------- ---------------- ---------------
[junit] TEST org.apache.solr.handler.dataimport.TestSqlEntityProcessor2 FAILED
[junit] Testsuite: org.apache.solr.handler.dataimport.TestSqlEntityProcessorDelta
[junit] Tests run: 8, Failures: 0, Errors: 0, Time elapsed: 1.056 sec
[junit]
[junit] Testsuite: org.apache.solr.handler.dataimport.TestSqlEntityProcessorDelta2
[junit] Tests run: 8, Failures: 0, Errors: 0, Time elapsed: 1.082 sec
[junit]
[junit] Testsuite: org.apache.solr.handler.dataimport.TestTemplateString
[junit] Tests run: 1, Failures: 0, Errors: 0, Time elapsed: 0.008 sec
[junit]
[junit] Testsuite: org.apache.solr.handler.dataimport.TestTemplateTransformer
[junit] Tests run: 1, Failures: 0, Errors: 0, Time elapsed: 0.007 sec
[junit]
[junit] Testsuite: org.apache.solr.handler.dataimport.TestThreaded
[junit] Tests run: 1, Failures: 0, Errors: 0, Time elapsed: 0.321 sec
[junit]
[junit] Testsuite: org.apache.solr.handler.dataimport.TestURLDataSource
[junit] Tests run: 1, Failures: 0, Errors: 0, Time elapsed: 0.008 sec
[junit]
[junit] Testsuite: org.apache.solr.handler.dataimport.TestVariableResolver
[junit] Tests run: 9, Failures: 0, Errors: 0, Time elapsed: 0.021 sec
[junit]
[junit] Testsuite: org.apache.solr.handler.dataimport.TestXPathEntityProcessor
[junit] Tests run: 8, Failures: 0, Errors: 0, Time elapsed: 0.5 sec
[junit]
[junit] Testsuite: org.apache.solr.handler.dataimport.TestXPathRecordReader
[junit] Tests run: 21, Failures: 0, Errors: 0, Time elapsed: 0.034 sec
[junit]
[junit] Tests FAILED
BUILD FAILED
/usr<https://hudson.apache.org/hudson/job/Lucene-Solr-tests-only-trunk/ws/checkout/build.xml>:23: The following error occurred while executing this line:
/usr<https://hudson.apache.org/hudson/job/Lucene-Solr-tests-only-trunk/ws/checkout/solr/common-build.xml>:462: The following error occurred while executing this line:
/usr<https://hudson.apache.org/hudson/job/Lucene-Solr-tests-only-trunk/ws/checkout/solr/common-build.xml>:319: The following error occurred while executing this line:
/usr<https://hudson.apache.org/hudson/job/Lucene-Solr-tests-only-trunk/ws/checkout/solr/contrib/dataimporthandler/build.xml>:192: Tests failed!
Total time: 8 minutes 57 seconds
Recording test results
---------------------------------------------------------------------
To unsubscribe, e-mail: dev-unsubscribe@lucene.apache.org
For additional commands, e-mail: dev-help@lucene.apache.org