You are viewing a plain text version of this content. The canonical link for it is here.
Posted to builds@hbase.apache.org by Apache Jenkins Server <je...@builds.apache.org> on 2015/10/29 04:27:37 UTC
Build failed in Jenkins: HBase-1.1 #728
See <https://builds.apache.org/job/HBase-1.1/728/changes>
Changes:
[enis] HBASE-14689 Addendum and unit test for HBASE-13471
------------------------------------------
[...truncated 1985 lines...]
Tests run: 12, Failures: 0, Errors: 0, Skipped: 0, Time elapsed: 228.897 sec - in org.apache.hadoop.hbase.regionserver.TestRegionReplicaFailover
Running org.apache.hadoop.hbase.regionserver.TestDefaultMemStore
Running org.apache.hadoop.hbase.regionserver.TestRegionServerMetrics
Tests run: 5, Failures: 0, Errors: 0, Skipped: 0, Time elapsed: 46.766 sec - in org.apache.hadoop.hbase.regionserver.TestCompactionState
Running org.apache.hadoop.hbase.regionserver.TestGetClosestAtOrBefore
Tests run: 3, Failures: 0, Errors: 0, Skipped: 0, Time elapsed: 1.904 sec - in org.apache.hadoop.hbase.regionserver.TestGetClosestAtOrBefore
Running org.apache.hadoop.hbase.regionserver.TestRSKilledWhenInitializing
Tests run: 24, Failures: 0, Errors: 0, Skipped: 0, Time elapsed: 26.434 sec - in org.apache.hadoop.hbase.regionserver.TestDefaultMemStore
Running org.apache.hadoop.hbase.regionserver.TestReversibleScanners
Tests run: 10, Failures: 0, Errors: 0, Skipped: 0, Time elapsed: 21.066 sec - in org.apache.hadoop.hbase.regionserver.TestRegionServerMetrics
Running org.apache.hadoop.hbase.regionserver.TestRecoveredEdits
Tests run: 5, Failures: 0, Errors: 0, Skipped: 0, Time elapsed: 4.715 sec - in org.apache.hadoop.hbase.regionserver.TestReversibleScanners
Tests run: 1, Failures: 0, Errors: 0, Skipped: 0, Time elapsed: 17.023 sec - in org.apache.hadoop.hbase.regionserver.TestRSKilledWhenInitializing
Tests run: 1, Failures: 0, Errors: 0, Skipped: 0, Time elapsed: 11.839 sec - in org.apache.hadoop.hbase.regionserver.TestRecoveredEdits
Running org.apache.hadoop.hbase.regionserver.TestRegionServerNoMaster
Running org.apache.hadoop.hbase.regionserver.TestScannerRetriableFailure
Running org.apache.hadoop.hbase.regionserver.TestScannerWithBulkload
Tests run: 9, Failures: 0, Errors: 0, Skipped: 0, Time elapsed: 17.927 sec - in org.apache.hadoop.hbase.regionserver.TestRegionServerNoMaster
Running org.apache.hadoop.hbase.regionserver.TestClusterId
Tests run: 3, Failures: 0, Errors: 0, Skipped: 0, Time elapsed: 12.115 sec - in org.apache.hadoop.hbase.regionserver.TestScannerWithBulkload
Tests run: 7, Failures: 0, Errors: 0, Skipped: 0, Time elapsed: 172.778 sec - in org.apache.hadoop.hbase.regionserver.TestRegionReplicas
Running org.apache.hadoop.hbase.regionserver.TestRegionServerHostname
Running org.apache.hadoop.hbase.regionserver.TestCompaction
Tests run: 1, Failures: 0, Errors: 0, Skipped: 0, Time elapsed: 34.182 sec - in org.apache.hadoop.hbase.regionserver.TestScannerRetriableFailure
Tests run: 2, Failures: 0, Errors: 0, Skipped: 0, Time elapsed: 15.44 sec - in org.apache.hadoop.hbase.regionserver.TestRegionServerHostname
Running org.apache.hadoop.hbase.regionserver.TestSplitWalDataLoss
Running org.apache.hadoop.hbase.regionserver.TestPerColumnFamilyFlush
Tests run: 5, Failures: 0, Errors: 0, Skipped: 0, Time elapsed: 22.216 sec - in org.apache.hadoop.hbase.regionserver.TestCompaction
Tests run: 2, Failures: 0, Errors: 0, Skipped: 0, Time elapsed: 27.555 sec - in org.apache.hadoop.hbase.regionserver.TestClusterId
Tests run: 5, Failures: 0, Errors: 0, Skipped: 0, Time elapsed: 303.247 sec - in org.apache.hadoop.hbase.regionserver.wal.TestLogRolling
Tests run: 1, Failures: 0, Errors: 0, Skipped: 0, Time elapsed: 12.132 sec - in org.apache.hadoop.hbase.regionserver.TestSplitWalDataLoss
Running org.apache.hadoop.hbase.regionserver.compactions.TestCompactionWithThroughputController
Running org.apache.hadoop.hbase.regionserver.TestSeekOptimizations
Running org.apache.hadoop.hbase.regionserver.TestServerCustomProtocol
Running org.apache.hadoop.hbase.regionserver.TestRegionFavoredNodes
Tests run: 6, Failures: 0, Errors: 0, Skipped: 0, Time elapsed: 6.386 sec - in org.apache.hadoop.hbase.regionserver.TestSeekOptimizations
Running org.apache.hadoop.hbase.regionserver.TestHRegion
Tests run: 1, Failures: 0, Errors: 0, Skipped: 0, Time elapsed: 9.076 sec - in org.apache.hadoop.hbase.regionserver.TestRegionFavoredNodes
Running org.apache.hadoop.hbase.regionserver.TestAtomicOperation
Tests run: 7, Failures: 0, Errors: 0, Skipped: 0, Time elapsed: 40.28 sec - in org.apache.hadoop.hbase.regionserver.TestServerCustomProtocol
Running org.apache.hadoop.hbase.regionserver.TestSplitTransactionOnCluster
Tests run: 6, Failures: 0, Errors: 0, Skipped: 0, Time elapsed: 41.889 sec - in org.apache.hadoop.hbase.regionserver.TestAtomicOperation
Running org.apache.hadoop.hbase.regionserver.TestCompactionWithCoprocessor
Tests run: 3, Failures: 0, Errors: 0, Skipped: 0, Time elapsed: 65.338 sec - in org.apache.hadoop.hbase.regionserver.compactions.TestCompactionWithThroughputController
Running org.apache.hadoop.hbase.regionserver.TestHRegionServerBulkLoad
Tests run: 6, Failures: 0, Errors: 0, Skipped: 0, Time elapsed: 96.074 sec - in org.apache.hadoop.hbase.regionserver.TestPerColumnFamilyFlush
Tests run: 5, Failures: 0, Errors: 0, Skipped: 0, Time elapsed: 26.733 sec - in org.apache.hadoop.hbase.regionserver.TestCompactionWithCoprocessor
Running org.apache.hadoop.hbase.regionserver.TestScannerHeartbeatMessages
Running org.apache.hadoop.hbase.regionserver.TestRegionServerOnlineConfigChange
Tests run: 1, Failures: 0, Errors: 0, Skipped: 0, Time elapsed: 43.399 sec - in org.apache.hadoop.hbase.regionserver.TestHRegionServerBulkLoad
Tests run: 2, Failures: 0, Errors: 0, Skipped: 0, Time elapsed: 1.222 sec - in org.apache.hadoop.hbase.regionserver.TestRegionServerOnlineConfigChange
Tests run: 99, Failures: 0, Errors: 0, Skipped: 0, Time elapsed: 106.23 sec - in org.apache.hadoop.hbase.regionserver.TestHRegion
Running org.apache.hadoop.hbase.regionserver.TestEndToEndSplitTransaction
Running org.apache.hadoop.hbase.regionserver.TestEncryptionRandomKeying
Tests run: 1, Failures: 0, Errors: 0, Skipped: 0, Time elapsed: 1.211 sec - in org.apache.hadoop.hbase.regionserver.TestEncryptionRandomKeying
Tests run: 1, Failures: 0, Errors: 0, Skipped: 0, Time elapsed: 26.302 sec - in org.apache.hadoop.hbase.regionserver.TestScannerHeartbeatMessages
Running org.apache.hadoop.hbase.TestRegionRebalancing
Running org.apache.hadoop.hbase.TestPartialResultsFromClientSide
Tests run: 2, Failures: 0, Errors: 0, Skipped: 0, Time elapsed: 18.535 sec - in org.apache.hadoop.hbase.regionserver.TestEndToEndSplitTransaction
Running org.apache.hadoop.hbase.quotas.TestQuotaThrottle
Running org.apache.hadoop.hbase.quotas.TestQuotaAdmin
Tests run: 17, Failures: 0, Errors: 0, Skipped: 0, Time elapsed: 91.233 sec - in org.apache.hadoop.hbase.regionserver.TestSplitTransactionOnCluster
Tests run: 2, Failures: 0, Errors: 0, Skipped: 0, Time elapsed: 3.207 sec - in org.apache.hadoop.hbase.quotas.TestQuotaAdmin
Running org.apache.hadoop.hbase.io.encoding.TestEncodedSeekers
Tests run: 7, Failures: 0, Errors: 0, Skipped: 0, Time elapsed: 16.7 sec - in org.apache.hadoop.hbase.quotas.TestQuotaThrottle
Running org.apache.hadoop.hbase.io.encoding.TestDataBlockEncoders
Tests run: 2, Failures: 0, Errors: 0, Skipped: 0, Time elapsed: 34.923 sec - in org.apache.hadoop.hbase.TestRegionRebalancing
Running org.apache.hadoop.hbase.quotas.TestQuotaTableUtil
Tests run: 3, Failures: 0, Errors: 0, Skipped: 0, Time elapsed: 1.466 sec - in org.apache.hadoop.hbase.quotas.TestQuotaTableUtil
Running org.apache.hadoop.hbase.io.encoding.TestLoadAndSwitchEncodeOnDisk
Running org.apache.hadoop.hbase.io.encoding.TestChangingEncoding
Tests run: 13, Failures: 0, Errors: 0, Skipped: 0, Time elapsed: 47.978 sec - in org.apache.hadoop.hbase.TestPartialResultsFromClientSide
Running org.apache.hadoop.hbase.io.encoding.TestBufferedDataBlockEncoder
Tests run: 1, Failures: 0, Errors: 0, Skipped: 0, Time elapsed: 14.619 sec - in org.apache.hadoop.hbase.io.encoding.TestBufferedDataBlockEncoder
Tests run: 1, Failures: 0, Errors: 0, Skipped: 0, Time elapsed: 27.82 sec - in org.apache.hadoop.hbase.io.encoding.TestLoadAndSwitchEncodeOnDisk
Running org.apache.hadoop.hbase.io.hfile.TestCacheOnWrite
Running org.apache.hadoop.hbase.io.hfile.TestSeekBeforeWithInlineBlocks
Tests run: 1, Failures: 0, Errors: 0, Skipped: 0, Time elapsed: 12.763 sec - in org.apache.hadoop.hbase.io.hfile.TestSeekBeforeWithInlineBlocks
Running org.apache.hadoop.hbase.io.hfile.TestCacheConfig
Tests run: 6, Failures: 0, Errors: 0, Skipped: 0, Time elapsed: 1.795 sec - in org.apache.hadoop.hbase.io.hfile.TestCacheConfig
Running org.apache.hadoop.hbase.io.hfile.TestHFileSeek
Tests run: 1, Failures: 0, Errors: 0, Skipped: 0, Time elapsed: 2.254 sec - in org.apache.hadoop.hbase.io.hfile.TestHFileSeek
Running org.apache.hadoop.hbase.io.hfile.TestHFileBlock
Tests run: 20, Failures: 0, Errors: 0, Skipped: 0, Time elapsed: 136.069 sec - in org.apache.hadoop.hbase.io.encoding.TestEncodedSeekers
Running org.apache.hadoop.hbase.io.hfile.TestForceCacheImportantBlocks
Tests run: 3, Failures: 0, Errors: 0, Skipped: 0, Time elapsed: 143.183 sec - in org.apache.hadoop.hbase.io.encoding.TestChangingEncoding
Tests run: 28, Failures: 0, Errors: 0, Skipped: 0, Time elapsed: 90.773 sec - in org.apache.hadoop.hbase.io.hfile.TestHFileBlock
Running org.apache.hadoop.hbase.io.hfile.TestScannerSelectionUsingTTL
Running org.apache.hadoop.hbase.io.hfile.TestHFileBlockIndex
Tests run: 10, Failures: 0, Errors: 0, Skipped: 0, Time elapsed: 10.827 sec - in org.apache.hadoop.hbase.io.hfile.TestHFileBlockIndex
Running org.apache.hadoop.hbase.io.TestFileLink
Tests run: 72, Failures: 0, Errors: 0, Skipped: 0, Time elapsed: 135.884 sec - in org.apache.hadoop.hbase.io.hfile.TestCacheOnWrite
Tests run: 4, Failures: 0, Errors: 0, Skipped: 0, Time elapsed: 39.403 sec - in org.apache.hadoop.hbase.io.hfile.TestForceCacheImportantBlocks
Tests run: 5, Failures: 0, Errors: 0, Skipped: 0, Time elapsed: 12.017 sec - in org.apache.hadoop.hbase.io.TestFileLink
Running org.apache.hadoop.hbase.security.access.TestTablePermissions
Running org.apache.hadoop.hbase.security.access.TestAccessController
Running org.apache.hadoop.hbase.security.access.TestCellACLs
Tests run: 7, Failures: 0, Errors: 0, Skipped: 0, Time elapsed: 17.617 sec - in org.apache.hadoop.hbase.security.access.TestTablePermissions
Tests run: 2, Failures: 0, Errors: 0, Skipped: 0, Time elapsed: 14.095 sec - in org.apache.hadoop.hbase.security.access.TestCellACLs
Running org.apache.hadoop.hbase.security.access.TestAccessControlFilter
Running org.apache.hadoop.hbase.security.access.TestNamespaceCommands
Tests run: 1, Failures: 0, Errors: 0, Skipped: 0, Time elapsed: 3.663 sec - in org.apache.hadoop.hbase.security.access.TestAccessControlFilter
Tests run: 6, Failures: 0, Errors: 0, Skipped: 0, Time elapsed: 63.022 sec - in org.apache.hadoop.hbase.io.hfile.TestScannerSelectionUsingTTL
Tests run: 7, Failures: 0, Errors: 0, Skipped: 0, Time elapsed: 4.771 sec - in org.apache.hadoop.hbase.security.access.TestNamespaceCommands
Running org.apache.hadoop.hbase.security.access.TestCellACLWithMultipleVersions
Running org.apache.hadoop.hbase.security.access.TestZKPermissionsWatcher
Running org.apache.hadoop.hbase.security.access.TestAccessController2
Tests run: 1, Failures: 0, Errors: 0, Skipped: 0, Time elapsed: 3.686 sec - in org.apache.hadoop.hbase.security.access.TestZKPermissionsWatcher
Running org.apache.hadoop.hbase.security.access.TestWithDisabledAuthorization
Tests run: 56, Failures: 0, Errors: 0, Skipped: 0, Time elapsed: 63.614 sec - in org.apache.hadoop.hbase.security.access.TestAccessController
Tests run: 28, Failures: 0, Errors: 0, Skipped: 0, Time elapsed: 257.435 sec - in org.apache.hadoop.hbase.io.encoding.TestDataBlockEncoders
Running org.apache.hadoop.hbase.security.access.TestScanEarlyTermination
Tests run: 1, Failures: 0, Errors: 0, Skipped: 0, Time elapsed: 5.767 sec - in org.apache.hadoop.hbase.security.access.TestScanEarlyTermination
Running org.apache.hadoop.hbase.security.visibility.TestVisibilityLablesWithGroups
Tests run: 1, Failures: 0, Errors: 0, Skipped: 0, Time elapsed: 3.407 sec - in org.apache.hadoop.hbase.security.visibility.TestVisibilityLablesWithGroups
Tests run: 6, Failures: 0, Errors: 0, Skipped: 0, Time elapsed: 38.622 sec - in org.apache.hadoop.hbase.security.access.TestAccessController2
Running org.apache.hadoop.hbase.security.visibility.TestVisibilityLabelsWithDeletes
Tests run: 8, Failures: 0, Errors: 0, Skipped: 0, Time elapsed: 49.861 sec - in org.apache.hadoop.hbase.security.access.TestCellACLWithMultipleVersions
Tests run: 6, Failures: 0, Errors: 0, Skipped: 0, Time elapsed: 35.689 sec - in org.apache.hadoop.hbase.security.access.TestWithDisabledAuthorization
Running org.apache.hadoop.hbase.security.visibility.TestVisibilityLabelsWithCustomVisLabService
Running org.apache.hadoop.hbase.security.visibility.TestVisibilityLabelsWithDefaultVisLabelService
Running org.apache.hadoop.hbase.security.visibility.TestDefaultScanLabelGeneratorStack
Running org.apache.hadoop.hbase.security.visibility.TestVisibilityWithCheckAuths
Tests run: 1, Failures: 0, Errors: 0, Skipped: 0, Time elapsed: 3.033 sec - in org.apache.hadoop.hbase.security.visibility.TestDefaultScanLabelGeneratorStack
Tests run: 2, Failures: 0, Errors: 0, Skipped: 0, Time elapsed: 4.4 sec - in org.apache.hadoop.hbase.security.visibility.TestVisibilityWithCheckAuths
Running org.apache.hadoop.hbase.security.visibility.TestVisibilityLabelsOpWithDifferentUsersNoACL
Tests run: 1, Failures: 0, Errors: 0, Skipped: 0, Time elapsed: 1.67 sec - in org.apache.hadoop.hbase.security.visibility.TestVisibilityLabelsOpWithDifferentUsersNoACL
Running org.apache.hadoop.hbase.security.visibility.TestVisibilityLabelsWithSLGStack
Tests run: 1, Failures: 0, Errors: 0, Skipped: 0, Time elapsed: 3.128 sec - in org.apache.hadoop.hbase.security.visibility.TestVisibilityLabelsWithSLGStack
Running org.apache.hadoop.hbase.security.visibility.TestVisibilityLabelsReplication
Tests run: 19, Failures: 0, Errors: 0, Skipped: 0, Time elapsed: 29.002 sec - in org.apache.hadoop.hbase.security.visibility.TestVisibilityLabelsWithCustomVisLabService
Running org.apache.hadoop.hbase.security.visibility.TestVisibilityLabelReplicationWithExpAsString
Running org.apache.hadoop.hbase.security.visibility.TestEnforcingScanLabelGenerator
Tests run: 23, Failures: 0, Errors: 0, Skipped: 0, Time elapsed: 30.94 sec - in org.apache.hadoop.hbase.security.visibility.TestVisibilityLabelsWithDefaultVisLabelService
Tests run: 1, Failures: 0, Errors: 0, Skipped: 0, Time elapsed: 2.655 sec - in org.apache.hadoop.hbase.security.visibility.TestEnforcingScanLabelGenerator
Running org.apache.hadoop.hbase.security.visibility.TestVisibilityLabelsWithACL
Running org.apache.hadoop.hbase.security.visibility.TestWithDisabledAuthorization
Tests run: 1, Failures: 0, Errors: 0, Skipped: 0, Time elapsed: 21 sec - in org.apache.hadoop.hbase.security.visibility.TestVisibilityLabelsReplication
Tests run: 2, Failures: 0, Errors: 0, Skipped: 0, Time elapsed: 3.529 sec - in org.apache.hadoop.hbase.security.visibility.TestWithDisabledAuthorization
Tests run: 5, Failures: 0, Errors: 0, Skipped: 0, Time elapsed: 7.727 sec - in org.apache.hadoop.hbase.security.visibility.TestVisibilityLabelsWithACL
Tests run: 1, Failures: 0, Errors: 0, Skipped: 0, Time elapsed: 21.583 sec - in org.apache.hadoop.hbase.security.visibility.TestVisibilityLabelReplicationWithExpAsString
Running org.apache.hadoop.hbase.security.token.TestZKSecretWatcher
Running org.apache.hadoop.hbase.security.token.TestTokenAuthentication
Tests run: 3, Failures: 0, Errors: 0, Skipped: 0, Time elapsed: 0.434 sec - in org.apache.hadoop.hbase.security.token.TestTokenAuthentication
Running org.apache.hadoop.hbase.TestHBaseOnOtherDfsCluster
Tests run: 1, Failures: 0, Errors: 0, Skipped: 0, Time elapsed: 13.261 sec - in org.apache.hadoop.hbase.security.token.TestZKSecretWatcher
Tests run: 1, Failures: 0, Errors: 0, Skipped: 0, Time elapsed: 10.6 sec - in org.apache.hadoop.hbase.TestHBaseOnOtherDfsCluster
Running org.apache.hadoop.hbase.security.token.TestGenerateDelegationToken
Tests run: 1, Failures: 0, Errors: 0, Skipped: 0, Time elapsed: 2.335 sec - in org.apache.hadoop.hbase.security.token.TestGenerateDelegationToken
Tests run: 39, Failures: 0, Errors: 0, Skipped: 0, Time elapsed: 82.819 sec - in org.apache.hadoop.hbase.security.visibility.TestVisibilityLabelsWithDeletes
Results :
Flaked tests:
org.apache.hadoop.hbase.client.TestSnapshotCloneIndependence.testOnlineSnapshotDeleteIndependent(org.apache.hadoop.hbase.client.TestSnapshotCloneIndependence)
Run 1: TestSnapshotCloneIndependence.testOnlineSnapshotDeleteIndependent:182->runTestSnapshotDeleteIndependent:425 expected:<17576> but was:<14046>
Run 2: PASS
Tests run: 2437, Failures: 0, Errors: 0, Skipped: 21, Flakes: 1
[INFO] ------------------------------------------------------------------------
[INFO] Reactor Summary:
[INFO]
[INFO] Apache HBase ...................................... SUCCESS [6.192s]
[INFO] Apache HBase - Checkstyle ......................... SUCCESS [1.042s]
[INFO] Apache HBase - Resource Bundle .................... SUCCESS [0.346s]
[INFO] Apache HBase - Annotations ........................ SUCCESS [1.173s]
[INFO] Apache HBase - Protocol ........................... SUCCESS [14.360s]
[INFO] Apache HBase - Common ............................. SUCCESS [1:40.076s]
[INFO] Apache HBase - Procedure .......................... SUCCESS [1:16.260s]
[INFO] Apache HBase - Client ............................. SUCCESS [1:27.534s]
[INFO] Apache HBase - Hadoop Compatibility ............... SUCCESS [8.033s]
[INFO] Apache HBase - Hadoop Two Compatibility ........... SUCCESS [8.924s]
[INFO] Apache HBase - Prefix Tree ........................ SUCCESS [10.552s]
[INFO] Apache HBase - Server ............................. FAILURE [1:29:51.312s]
[INFO] Apache HBase - Testing Util ....................... SKIPPED
[INFO] Apache HBase - Thrift ............................. SKIPPED
[INFO] Apache HBase - Rest ............................... SKIPPED
[INFO] Apache HBase - Shell .............................. SKIPPED
[INFO] Apache HBase - Integration Tests .................. SKIPPED
[INFO] Apache HBase - Examples ........................... SKIPPED
[INFO] Apache HBase - Assembly ........................... SKIPPED
[INFO] Apache HBase - Shaded ............................. SKIPPED
[INFO] Apache HBase - Shaded - Client .................... SKIPPED
[INFO] Apache HBase - Shaded - Server .................... SKIPPED
[INFO] ------------------------------------------------------------------------
[INFO] BUILD FAILURE
[INFO] ------------------------------------------------------------------------
[INFO] Total time: 1:35:08.772s
[INFO] Finished at: Thu Oct 29 03:20:45 UTC 2015
[INFO] Final Memory: 434M/621M
[INFO] ------------------------------------------------------------------------
[ERROR] Failed to execute goal org.apache.maven.plugins:maven-surefire-plugin:2.18.1:test (secondPartTestsExecution) on project hbase-server: There was a timeout or other error in the fork -> [Help 1]
[ERROR]
[ERROR] To see the full stack trace of the errors, re-run Maven with the -e switch.
[ERROR] Re-run Maven using the -X switch to enable full debug logging.
[ERROR]
[ERROR] For more information about the errors and possible solutions, please read the following articles:
[ERROR] [Help 1] http://cwiki.apache.org/confluence/display/MAVEN/MojoFailureException
[ERROR]
[ERROR] After correcting the problems, you can resume the build with the command
[ERROR] mvn <goals> -rf :hbase-server
Build step 'Invoke top-level Maven targets' marked build as failure
Performing Post build task...
Match found for :.* : True
Logical operation result is TRUE
Running script : ZOMBIE_TESTS_COUNT=`jps -v | grep surefirebooter | grep '-Dhbase.test' | wc -l`
if [[ $ZOMBIE_TESTS_COUNT != 0 ]] ; then
#It seems sometimes the tests are not dying immediately. Let's give them 30s
echo "Suspicious java process found - waiting 30s to see if there are just slow to stop"
sleep 30
ZOMBIE_TESTS_COUNT=`jps -v | grep surefirebooter | grep '-Dhbase.test' | wc -l`
if [[ $ZOMBIE_TESTS_COUNT != 0 ]] ; then
echo "There are $ZOMBIE_TESTS_COUNT zombie tests, they should have been killed by surefire but survived"
echo "************ zombies jps listing"
jps -v
jps -v | grep surefirebooter | grep '-Dhbase.test'
echo "************ BEGIN zombies jstack extract"
# HBase tests have been flagged with an innocuous '-Dhbase.test' just so they can
# be identified as hbase in a process listing.
ZB_STACK=`jps -v | grep surefirebooter | grep '-Dhbase.test' | cut -d ' ' -f 1 | xargs -n 1 jstack | grep ".test" | grep "\.java"`
jps -v | grep surefirebooter | grep '-Dhbase.test' | cut -d ' ' -f 1 | xargs -n 1 jstack
echo "************ END zombies jstack extract"
JIRA_COMMENT="$JIRA_COMMENT
{color:red}-1 core zombie tests{color}. There are ${ZOMBIE_TESTS_COUNT} zombie test(s): ${ZB_STACK}"
BAD=1
# Killing these zombies
echo 'Killing ZOMBIES!!!'
jps -v
jps -v | grep surefirebooter | grep '-Dhbase.test' | cut -d ' ' -f 1 | xargs kill -9
else
echo "We're ok: there is no zombie test, but some tests took some time to stop"
fi
[HBase-1.1] $ /bin/bash -xe /tmp/hudson950046040156444160.sh
++ jps -v
++ grep surefirebooter
++ wc -l
++ grep -Dhbase.test
grep: unknown devices method
+ ZOMBIE_TESTS_COUNT=0
/tmp/hudson950046040156444160.sh: line 30: syntax error: unexpected end of file
POST BUILD TASK : FAILURE
END OF POST BUILD TASK : 0
Archiving artifacts
Recording test results
Updating HBASE-14689
Updating HBASE-13471