You are viewing a plain text version of this content. The canonical link for it is here.
Posted to builds@solr.apache.org by Apache Jenkins Server <je...@builds.apache.org> on 2023/08/14 15:37:17 UTC
[JENKINS] Solr » Solr-Smoketest-9.3 - Build # 38 - Failure!
Build: https://ci-builds.apache.org/job/Solr/job/Solr-Smoketest-9.3/38/
Log:
Started by timer
Running as SYSTEM
[EnvInject] - Loading node environment variables.
Building remotely on lucene-solr-2 (solr lucene) in workspace /home/jenkins/jenkins-slave/workspace/Solr/Solr-Smoketest-9.3
The recommended git tool is: NONE
No credentials specified
> git rev-parse --resolve-git-dir /home/jenkins/jenkins-slave/workspace/Solr/Solr-Smoketest-9.3/.git # timeout=10
Fetching changes from the remote Git repository
> git config remote.origin.url https://github.com/apache/solr.git # timeout=10
Cleaning workspace
> git rev-parse --verify HEAD # timeout=10
Resetting working tree
> git reset --hard # timeout=10
> git clean -fdx # timeout=10
Fetching upstream changes from https://github.com/apache/solr.git
> git --version # timeout=10
> git --version # 'git version 2.25.1'
> git fetch --tags --force --progress -- https://github.com/apache/solr.git +refs/heads/*:refs/remotes/origin/* # timeout=10
> git rev-parse origin/branch_9_3^{commit} # timeout=10
Checking out Revision 72346aab9e63fb071f617b9c01f807429da2e7d0 (origin/branch_9_3)
> git config core.sparsecheckout # timeout=10
> git checkout -f 72346aab9e63fb071f617b9c01f807429da2e7d0 # timeout=10
Commit message: "Fix a typo in move-replica API documentation (#1801)"
> git rev-list --no-walk 72346aab9e63fb071f617b9c01f807429da2e7d0 # timeout=10
No emails were triggered.
provisioning config files...
copy managed file [gradle.properties] to file:/home/jenkins/jenkins-slave/workspace/Solr/Solr-Smoketest-9.3/gradle.properties
[Gradle] - Launching build.
[Solr-Smoketest-9.3] $ /home/jenkins/jenkins-slave/workspace/Solr/Solr-Smoketest-9.3/gradlew -Dversion.suffix= -Dgradle.user.home=/home/jenkins/jenkins-slave/workspace/Solr/.gradle -Porg.gradle.daemon=false -Pvalidation.git.failOnModified=false --continue -x signJarsPublication clean assembleRelease
Downloading gradle-wrapper.jar from https://raw.githubusercontent.com/gradle/gradle/v7.6.0/gradle/wrapper/gradle-wrapper.jar
To honour the JVM settings for this build a single-use Daemon process will be forked. See https://docs.gradle.org/7.6/userguide/gradle_daemon.html#sec:disabling_the_daemon.
Daemon will be stopped at the end of the build
> Task :buildSrc:compileJava
> Task :buildSrc:compileGroovy NO-SOURCE
> Task :buildSrc:processResources NO-SOURCE
> Task :buildSrc:classes
> Task :buildSrc:jar
> Task :buildSrc:assemble
> Task :buildSrc:compileTestJava NO-SOURCE
> Task :buildSrc:compileTestGroovy NO-SOURCE
> Task :buildSrc:processTestResources NO-SOURCE
> Task :buildSrc:testClasses UP-TO-DATE
> Task :buildSrc:test NO-SOURCE
> Task :buildSrc:check UP-TO-DATE
> Task :buildSrc:build
> Task :clean
> Task :solr:clean UP-TO-DATE
> Task :solr:benchmark:clean
> Task :solr:core:clean
> Task :solr:distribution:clean UP-TO-DATE
> Task :solr:docker:clean UP-TO-DATE
> Task :solr:documentation:clean UP-TO-DATE
> Task :solr:example:clean UP-TO-DATE
> Task :solr:modules:clean UP-TO-DATE
> Task :solr:packaging:clean UP-TO-DATE
> Task :solr:prometheus-exporter:clean
> Task :solr:server:clean
> Task :solr:solr-ref-guide:clean
> Task :solr:solrj:clean
> Task :solr:solrj-streaming:clean
> Task :solr:solrj-zookeeper:clean
> Task :solr:test-framework:clean
> Task :solr:webapp:clean
> Task :solr:modules:analysis-extras:clean
> Task :solr:modules:analytics:clean
> Task :solr:modules:clustering:clean
> Task :solr:modules:extraction:clean
> Task :solr:modules:gcs-repository:clean
> Task :solr:modules:hadoop-auth:clean
> Task :solr:modules:hdfs:clean
> Task :solr:modules:jaegertracer-configurator:clean
> Task :solr:modules:jwt-auth:clean
> Task :solr:modules:langid:clean
> Task :solr:modules:ltr:clean
> Task :solr:modules:opentelemetry:clean
> Task :solr:modules:s3-repository:clean
> Task :solr:modules:scripting:clean
> Task :solr:modules:sql:clean
> Task :mavenLocalClean UP-TO-DATE
> Task :solr-missing-doclet:compileJava
> Task :solr-missing-doclet:processResources NO-SOURCE
> Task :solr-missing-doclet:classes
> Task :solr-missing-doclet:jar
> Task :gitStatus
> Task :checkJdkInternalsExportedToGradle
> Task :solr:solrj:compileJava
Note: Some input files use or override a deprecated API.
Note: Recompile with -Xlint:deprecation for details.
> Task :solr:solrj-streaming:compileJava
Note: Some input files use or override a deprecated API.
Note: Recompile with -Xlint:deprecation for details.
> Task :solr:solrj-zookeeper:compileJava
Note: Some input files use or override a deprecated API.
Note: Recompile with -Xlint:deprecation for details.
> Task :solr:core:compileJava
Note: Some input files use or override a deprecated API.
Note: Recompile with -Xlint:deprecation for details.
> Task :solr:core:processResources
> Task :solr:core:classes
> Task :solr:core:jar
> Task :solr:core:generateMetadataFileForJarsPublication SKIPPED
> Task :solr:core:generatePomFileForJarsPublication
> Task :solr:solrj:renderJavadoc
> Task :solr:solrj-streaming:renderJavadoc
> Task :solr:solrj-zookeeper:renderJavadoc
> Task :solr:core:renderJavadoc
> Task :solr:core:javadoc SKIPPED
> Task :solr:core:javadocJar
> Task :solr:core:sourcesJar
> Task :solr:core:publishJarsPublicationToBuildRepository
> Task :solr:prometheus-exporter:compileJava
Note: Some input files use or override a deprecated API.
Note: Recompile with -Xlint:deprecation for details.
> Task :solr:prometheus-exporter:processResources NO-SOURCE
> Task :solr:prometheus-exporter:classes
> Task :solr:prometheus-exporter:jar
> Task :solr:prometheus-exporter:generateMetadataFileForJarsPublication SKIPPED
> Task :solr:prometheus-exporter:generatePomFileForJarsPublication
> Task :solr:prometheus-exporter:renderJavadoc
> Task :solr:prometheus-exporter:javadoc SKIPPED
> Task :solr:prometheus-exporter:javadocJar
> Task :solr:prometheus-exporter:sourcesJar
> Task :solr:prometheus-exporter:publishJarsPublicationToBuildRepository
> Task :solr:solrj:processResources NO-SOURCE
> Task :solr:solrj:classes
> Task :solr:solrj:jar
> Task :solr:solrj:generateMetadataFileForJarsPublication SKIPPED
> Task :solr:solrj:generatePomFileForJarsPublication
> Task :solr:solrj:javadoc SKIPPED
> Task :solr:solrj:javadocJar
> Task :solr:solrj:sourcesJar
> Task :solr:solrj:publishJarsPublicationToBuildRepository
> Task :solr:solrj-streaming:processResources
> Task :solr:solrj-streaming:classes
> Task :solr:solrj-streaming:jar
> Task :solr:solrj-streaming:generateMetadataFileForJarsPublication SKIPPED
> Task :solr:solrj-streaming:generatePomFileForJarsPublication
> Task :solr:solrj-streaming:javadoc SKIPPED
> Task :solr:solrj-streaming:javadocJar
> Task :solr:solrj-streaming:sourcesJar
> Task :solr:solrj-streaming:publishJarsPublicationToBuildRepository
> Task :solr:solrj-zookeeper:processResources NO-SOURCE
> Task :solr:solrj-zookeeper:classes
> Task :solr:solrj-zookeeper:jar
> Task :solr:solrj-zookeeper:generateMetadataFileForJarsPublication SKIPPED
> Task :solr:solrj-zookeeper:generatePomFileForJarsPublication
> Task :solr:solrj-zookeeper:javadoc SKIPPED
> Task :solr:solrj-zookeeper:javadocJar
> Task :solr:solrj-zookeeper:sourcesJar
> Task :solr:solrj-zookeeper:publishJarsPublicationToBuildRepository
> Task :solr:test-framework:compileJava
Note: Some input files use or override a deprecated API.
Note: Recompile with -Xlint:deprecation for details.
> Task :solr:test-framework:processResources
> Task :solr:test-framework:classes
> Task :solr:test-framework:jar
> Task :solr:test-framework:generateMetadataFileForJarsPublication SKIPPED
> Task :solr:test-framework:generatePomFileForJarsPublication
> Task :solr:test-framework:renderJavadoc
> Task :solr:test-framework:javadoc SKIPPED
> Task :solr:test-framework:javadocJar
> Task :solr:test-framework:sourcesJar
> Task :solr:test-framework:publishJarsPublicationToBuildRepository
> Task :solr:modules:analysis-extras:compileJava
Note: /home/jenkins/jenkins-slave/workspace/Solr/Solr-Smoketest-9.3/solr/modules/analysis-extras/src/java/org/apache/solr/schema/ICUCollationField.java uses or overrides a deprecated API.
Note: Recompile with -Xlint:deprecation for details.
> Task :solr:modules:analysis-extras:processResources NO-SOURCE
> Task :solr:modules:analysis-extras:classes
> Task :solr:modules:analysis-extras:jar
> Task :solr:modules:analysis-extras:generateMetadataFileForJarsPublication SKIPPED
> Task :solr:modules:analysis-extras:generatePomFileForJarsPublication
> Task :solr:modules:analysis-extras:renderJavadoc
> Task :solr:modules:analysis-extras:javadoc SKIPPED
> Task :solr:modules:analysis-extras:javadocJar
> Task :solr:modules:analysis-extras:sourcesJar
> Task :solr:modules:analysis-extras:publishJarsPublicationToBuildRepository
> Task :solr:modules:analytics:compileJava
Note: Some input files use or override a deprecated API.
Note: Recompile with -Xlint:deprecation for details.
> Task :solr:modules:analytics:processResources NO-SOURCE
> Task :solr:modules:analytics:classes
> Task :solr:modules:analytics:jar
> Task :solr:modules:analytics:generateMetadataFileForJarsPublication SKIPPED
> Task :solr:modules:analytics:generatePomFileForJarsPublication
> Task :solr:modules:analytics:renderJavadoc
> Task :solr:modules:analytics:javadoc SKIPPED
> Task :solr:modules:analytics:javadocJar
> Task :solr:modules:analytics:sourcesJar
> Task :solr:modules:analytics:publishJarsPublicationToBuildRepository
> Task :solr:modules:clustering:compileJava
> Task :solr:modules:clustering:processResources NO-SOURCE
> Task :solr:modules:clustering:classes
> Task :solr:modules:clustering:jar
> Task :solr:modules:clustering:generateMetadataFileForJarsPublication SKIPPED
> Task :solr:modules:clustering:generatePomFileForJarsPublication
> Task :solr:modules:clustering:renderJavadoc
> Task :solr:modules:clustering:javadoc SKIPPED
> Task :solr:modules:clustering:javadocJar
> Task :solr:modules:clustering:sourcesJar
> Task :solr:modules:clustering:publishJarsPublicationToBuildRepository
> Task :solr:modules:extraction:compileJava
Note: /home/jenkins/jenkins-slave/workspace/Solr/Solr-Smoketest-9.3/solr/modules/extraction/src/java/org/apache/solr/handler/extraction/ExtractingDocumentLoader.java uses or overrides a deprecated API.
Note: Recompile with -Xlint:deprecation for details.
> Task :solr:modules:extraction:processResources
> Task :solr:modules:extraction:classes
> Task :solr:modules:extraction:jar
> Task :solr:modules:extraction:generateMetadataFileForJarsPublication SKIPPED
> Task :solr:modules:extraction:generatePomFileForJarsPublication
> Task :solr:modules:extraction:renderJavadoc
> Task :solr:modules:extraction:javadoc SKIPPED
> Task :solr:modules:extraction:javadocJar
> Task :solr:modules:extraction:sourcesJar
> Task :solr:modules:extraction:publishJarsPublicationToBuildRepository
> Task :solr:modules:gcs-repository:compileJava
Note: /home/jenkins/jenkins-slave/workspace/Solr/Solr-Smoketest-9.3/solr/modules/gcs-repository/src/java/org/apache/solr/gcs/GCSConfigParser.java uses or overrides a deprecated API.
Note: Recompile with -Xlint:deprecation for details.
> Task :solr:modules:gcs-repository:processResources NO-SOURCE
> Task :solr:modules:gcs-repository:classes
> Task :solr:modules:gcs-repository:jar
> Task :solr:modules:gcs-repository:generateMetadataFileForJarsPublication SKIPPED
> Task :solr:modules:gcs-repository:generatePomFileForJarsPublication
> Task :solr:modules:gcs-repository:renderJavadoc
> Task :solr:modules:gcs-repository:javadoc SKIPPED
> Task :solr:modules:gcs-repository:javadocJar
> Task :solr:modules:gcs-repository:sourcesJar
> Task :solr:modules:gcs-repository:publishJarsPublicationToBuildRepository
> Task :solr:modules:hadoop-auth:compileJava
Note: Some input files use or override a deprecated API.
Note: Recompile with -Xlint:deprecation for details.
> Task :solr:modules:hadoop-auth:processResources NO-SOURCE
> Task :solr:modules:hadoop-auth:classes
> Task :solr:modules:hadoop-auth:jar
> Task :solr:modules:hadoop-auth:generateMetadataFileForJarsPublication SKIPPED
> Task :solr:modules:hadoop-auth:generatePomFileForJarsPublication
> Task :solr:modules:hadoop-auth:renderJavadoc
> Task :solr:modules:hadoop-auth:javadoc SKIPPED
> Task :solr:modules:hadoop-auth:javadocJar
> Task :solr:modules:hadoop-auth:sourcesJar
> Task :solr:modules:hadoop-auth:publishJarsPublicationToBuildRepository
> Task :solr:modules:hdfs:compileJava
Note: Some input files use or override a deprecated API.
Note: Recompile with -Xlint:deprecation for details.
> Task :solr:modules:hdfs:processResources NO-SOURCE
> Task :solr:modules:hdfs:classes
> Task :solr:modules:hdfs:jar
> Task :solr:modules:hdfs:generateMetadataFileForJarsPublication SKIPPED
> Task :solr:modules:hdfs:generatePomFileForJarsPublication
> Task :solr:modules:hdfs:renderJavadoc
> Task :solr:modules:hdfs:javadoc SKIPPED
> Task :solr:modules:hdfs:javadocJar
> Task :solr:modules:hdfs:sourcesJar
> Task :solr:modules:hdfs:publishJarsPublicationToBuildRepository
> Task :solr:modules:jaegertracer-configurator:compileJava
> Task :solr:modules:jaegertracer-configurator:processResources NO-SOURCE
> Task :solr:modules:jaegertracer-configurator:classes
> Task :solr:modules:jaegertracer-configurator:jar
> Task :solr:modules:jaegertracer-configurator:generateMetadataFileForJarsPublication SKIPPED
> Task :solr:modules:jaegertracer-configurator:generatePomFileForJarsPublication
> Task :solr:modules:jaegertracer-configurator:renderJavadoc
> Task :solr:modules:jaegertracer-configurator:javadoc SKIPPED
> Task :solr:modules:jaegertracer-configurator:javadocJar
> Task :solr:modules:jaegertracer-configurator:sourcesJar
> Task :solr:modules:jaegertracer-configurator:publishJarsPublicationToBuildRepository
> Task :solr:modules:jwt-auth:compileJava
Note: /home/jenkins/jenkins-slave/workspace/Solr/Solr-Smoketest-9.3/solr/modules/jwt-auth/src/java/org/apache/solr/security/jwt/JWTAuthPlugin.java uses or overrides a deprecated API.
Note: Recompile with -Xlint:deprecation for details.
> Task :solr:modules:jwt-auth:processResources NO-SOURCE
> Task :solr:modules:jwt-auth:classes
> Task :solr:modules:jwt-auth:jar
> Task :solr:modules:jwt-auth:generateMetadataFileForJarsPublication SKIPPED
> Task :solr:modules:jwt-auth:generatePomFileForJarsPublication
> Task :solr:modules:jwt-auth:renderJavadoc
> Task :solr:modules:jwt-auth:javadoc SKIPPED
> Task :solr:modules:jwt-auth:javadocJar
> Task :solr:modules:jwt-auth:sourcesJar
> Task :solr:modules:jwt-auth:publishJarsPublicationToBuildRepository
> Task :solr:modules:langid:compileJava
Note: Some input files use or override a deprecated API.
Note: Recompile with -Xlint:deprecation for details.
> Task :solr:modules:langid:processResources
> Task :solr:modules:langid:classes
> Task :solr:modules:langid:jar
> Task :solr:modules:langid:generateMetadataFileForJarsPublication SKIPPED
> Task :solr:modules:langid:generatePomFileForJarsPublication
> Task :solr:modules:langid:renderJavadoc
> Task :solr:modules:langid:javadoc SKIPPED
> Task :solr:modules:langid:javadocJar
> Task :solr:modules:langid:sourcesJar
> Task :solr:modules:langid:publishJarsPublicationToBuildRepository
> Task :solr:modules:ltr:compileJava
Note: /home/jenkins/jenkins-slave/workspace/Solr/Solr-Smoketest-9.3/solr/modules/ltr/src/java/org/apache/solr/ltr/feature/FieldValueFeature.java uses or overrides a deprecated API.
Note: Recompile with -Xlint:deprecation for details.
> Task :solr:modules:ltr:processResources NO-SOURCE
> Task :solr:modules:ltr:classes
> Task :solr:modules:ltr:jar
> Task :solr:modules:ltr:generateMetadataFileForJarsPublication SKIPPED
> Task :solr:modules:ltr:generatePomFileForJarsPublication
> Task :solr:modules:ltr:renderJavadoc
> Task :solr:modules:ltr:javadoc SKIPPED
> Task :solr:modules:ltr:javadocJar
> Task :solr:modules:ltr:sourcesJar
> Task :solr:modules:ltr:publishJarsPublicationToBuildRepository
> Task :solr:modules:opentelemetry:compileJava
> Task :solr:modules:opentelemetry:processResources NO-SOURCE
> Task :solr:modules:opentelemetry:classes
> Task :solr:modules:opentelemetry:jar
> Task :solr:modules:opentelemetry:generateMetadataFileForJarsPublication SKIPPED
> Task :solr:modules:opentelemetry:generatePomFileForJarsPublication
> Task :solr:modules:opentelemetry:renderJavadoc
> Task :solr:modules:opentelemetry:javadoc SKIPPED
> Task :solr:modules:opentelemetry:javadocJar
> Task :solr:modules:opentelemetry:sourcesJar
> Task :solr:modules:opentelemetry:publishJarsPublicationToBuildRepository
> Task :solr:modules:s3-repository:compileJava
> Task :solr:modules:s3-repository:processResources NO-SOURCE
> Task :solr:modules:s3-repository:classes
> Task :solr:modules:s3-repository:jar
> Task :solr:modules:s3-repository:generateMetadataFileForJarsPublication SKIPPED
> Task :solr:modules:s3-repository:generatePomFileForJarsPublication
> Task :solr:modules:s3-repository:renderJavadoc
> Task :solr:modules:s3-repository:javadoc SKIPPED
> Task :solr:modules:s3-repository:javadocJar
> Task :solr:modules:s3-repository:sourcesJar
> Task :solr:modules:s3-repository:publishJarsPublicationToBuildRepository
> Task :solr:modules:scripting:compileJava
Note: /home/jenkins/jenkins-slave/workspace/Solr/Solr-Smoketest-9.3/solr/modules/scripting/src/java/org/apache/solr/scripting/xslt/XSLTUpdateRequestHandler.java uses or overrides a deprecated API.
Note: Recompile with -Xlint:deprecation for details.
> Task :solr:modules:scripting:processResources NO-SOURCE
> Task :solr:modules:scripting:classes
> Task :solr:modules:scripting:jar
> Task :solr:modules:scripting:generateMetadataFileForJarsPublication SKIPPED
> Task :solr:modules:scripting:generatePomFileForJarsPublication
> Task :solr:modules:scripting:renderJavadoc
> Task :solr:modules:scripting:javadoc SKIPPED
> Task :solr:modules:scripting:javadocJar
> Task :solr:modules:scripting:sourcesJar
> Task :solr:modules:scripting:publishJarsPublicationToBuildRepository
> Task :solr:modules:sql:compileJava
Note: Some input files use or override a deprecated API.
Note: Recompile with -Xlint:deprecation for details.
> Task :solr:modules:sql:processResources
> Task :solr:modules:sql:classes
> Task :solr:modules:sql:jar
> Task :solr:modules:sql:generateMetadataFileForJarsPublication SKIPPED
> Task :solr:modules:sql:generatePomFileForJarsPublication
> Task :solr:modules:sql:renderJavadoc
> Task :solr:modules:sql:javadoc SKIPPED
> Task :solr:modules:sql:javadocJar
> Task :solr:modules:sql:sourcesJar
> Task :solr:modules:sql:publishJarsPublicationToBuildRepository
> Task :mavenToLocalFolder
Local maven artifacts (poms, jars) created at: /home/jenkins/jenkins-slave/workspace/Solr/Solr-Smoketest-9.3/build/maven-local
> Task :checkWorkingCopyClean
> Task :solr:distribution:assembleSourceTgz
> Task :solr:docker:createBodySnippetDockerfile
> Task :solr:docker:createDockerfileLocal
> Task :solr:docker:assemblePackaging
> Task :solr:documentation:changesToHtml
> Task :solr:documentation:copyDocumentationAssets
> Task :solr:documentation:markdownToHtml
> Task :solr:documentation:copyChangesToHtmlForMiniSite
> Task :solr:documentation:copyMiniDocumentationAssets
> Task :solr:documentation:createMiniDocumentationIndex
> Task :solr:documentation:documentationMinimal
> Task :solr:core:assemblePostJar
> Task :solr:example:assemblePackaging
> Task :solr:prometheus-exporter:assemblePackaging
> Task :solr:webapp:compileJava NO-SOURCE
> Task :solr:webapp:processResources NO-SOURCE
> Task :solr:webapp:classes UP-TO-DATE
> Task :solr:webapp:war
> Task :solr:server:assemblePackaging
> Task :solr:modules:analysis-extras:assemblePackaging
> Task :solr:modules:analytics:assemblePackaging
> Task :solr:modules:clustering:assemblePackaging
> Task :solr:modules:extraction:assemblePackaging
> Task :solr:modules:gcs-repository:assemblePackaging
> Task :solr:modules:hadoop-auth:assemblePackaging
> Task :solr:modules:hdfs:assemblePackaging
> Task :solr:modules:jaegertracer-configurator:assemblePackaging
> Task :solr:modules:jwt-auth:assemblePackaging
> Task :solr:modules:langid:assemblePackaging
> Task :solr:modules:ltr:assemblePackaging
> Task :solr:modules:opentelemetry:assemblePackaging
> Task :solr:modules:s3-repository:assemblePackaging
> Task :solr:modules:scripting:assemblePackaging
> Task :solr:modules:sql:assemblePackaging
> Task :solr:packaging:fullDistTar
> Task :solr:packaging:slimDistTar
> Task :solr:distribution:computeChecksums
> Task :solr:distribution:prepareGitRev
> Task :solr:docker:createDockerfileOfficialFull
> Task :solr:docker:createDockerfileOfficialSlim
> Task :solr:distribution:assembleRelease
Deprecated Gradle features were used in this build, making it incompatible with Gradle 8.0.
You can use '--warning-mode all' to show the individual deprecation warnings and determine if they come from your own scripts or plugins.
See https://docs.gradle.org/7.6/userguide/command_line_interface.html#sec:command_line_warnings
BUILD SUCCESSFUL in 3m 37s
232 actionable tasks: 224 executed, 8 up-to-date
Build step 'Invoke Gradle script' changed build result to SUCCESS
Run condition [Always] enabling perform for step [Execute shell]
[Solr-Smoketest-9.3] $ /bin/bash /tmp/jenkins165097123488108029.sh
Installing Python script requirements
Defaulting to user installation because normal site-packages is not writeable
Requirement already satisfied: six~=1.16.0 in /home/jenkins/.local/lib/python3.8/site-packages (from -r dev-tools/scripts/requirements.txt (line 1)) (1.16.0)
Requirement already satisfied: Jinja2~=3.1.1 in /home/jenkins/.local/lib/python3.8/site-packages (from -r dev-tools/scripts/requirements.txt (line 2)) (3.1.2)
Requirement already satisfied: PyYAML~=6.0 in /home/jenkins/.local/lib/python3.8/site-packages (from -r dev-tools/scripts/requirements.txt (line 3)) (6.0)
Requirement already satisfied: holidays~=0.16 in /home/jenkins/.local/lib/python3.8/site-packages (from -r dev-tools/scripts/requirements.txt (line 4)) (0.21)
Requirement already satisfied: ics~=0.7.2 in /home/jenkins/.local/lib/python3.8/site-packages (from -r dev-tools/scripts/requirements.txt (line 5)) (0.7.2)
Requirement already satisfied: console-menu~=0.7.1 in /home/jenkins/.local/lib/python3.8/site-packages (from -r dev-tools/scripts/requirements.txt (line 6)) (0.7.1)
Requirement already satisfied: PyGithub~=1.56 in /home/jenkins/.local/lib/python3.8/site-packages (from -r dev-tools/scripts/requirements.txt (line 7)) (1.58.0)
Requirement already satisfied: jira~=3.4.1 in /home/jenkins/.local/lib/python3.8/site-packages (from -r dev-tools/scripts/requirements.txt (line 8)) (3.4.1)
Requirement already satisfied: MarkupSafe>=2.0 in /home/jenkins/.local/lib/python3.8/site-packages (from Jinja2~=3.1.1->-r dev-tools/scripts/requirements.txt (line 2)) (2.1.2)
Requirement already satisfied: PyMeeus in /home/jenkins/.local/lib/python3.8/site-packages (from holidays~=0.16->-r dev-tools/scripts/requirements.txt (line 4)) (0.5.11)
Requirement already satisfied: convertdate>=2.3.0 in /home/jenkins/.local/lib/python3.8/site-packages (from holidays~=0.16->-r dev-tools/scripts/requirements.txt (line 4)) (2.4.0)
Requirement already satisfied: hijri-converter in /home/jenkins/.local/lib/python3.8/site-packages (from holidays~=0.16->-r dev-tools/scripts/requirements.txt (line 4)) (2.2.3)
Requirement already satisfied: korean-lunar-calendar in /home/jenkins/.local/lib/python3.8/site-packages (from holidays~=0.16->-r dev-tools/scripts/requirements.txt (line 4)) (0.2.1)
Requirement already satisfied: python-dateutil in /usr/lib/python3/dist-packages (from holidays~=0.16->-r dev-tools/scripts/requirements.txt (line 4)) (2.7.3)
Requirement already satisfied: backports.zoneinfo in /home/jenkins/.local/lib/python3.8/site-packages (from holidays~=0.16->-r dev-tools/scripts/requirements.txt (line 4)) (0.2.1)
Requirement already satisfied: arrow>=0.11 in /home/jenkins/.local/lib/python3.8/site-packages (from ics~=0.7.2->-r dev-tools/scripts/requirements.txt (line 5)) (0.14.7)
Requirement already satisfied: tatsu>4.2 in /home/jenkins/.local/lib/python3.8/site-packages (from ics~=0.7.2->-r dev-tools/scripts/requirements.txt (line 5)) (5.6.1)
Requirement already satisfied: attrs>=19.1.0 in /usr/lib/python3/dist-packages (from ics~=0.7.2->-r dev-tools/scripts/requirements.txt (line 5)) (19.3.0)
Requirement already satisfied: ansiwrap in /home/jenkins/.local/lib/python3.8/site-packages (from console-menu~=0.7.1->-r dev-tools/scripts/requirements.txt (line 6)) (0.8.4)
Requirement already satisfied: deprecated in /home/jenkins/.local/lib/python3.8/site-packages (from PyGithub~=1.56->-r dev-tools/scripts/requirements.txt (line 7)) (1.2.13)
Requirement already satisfied: pyjwt>=2.4.0 in /home/jenkins/.local/lib/python3.8/site-packages (from PyGithub~=1.56->-r dev-tools/scripts/requirements.txt (line 7)) (2.6.0)
Requirement already satisfied: pynacl>=1.4.0 in /home/jenkins/.local/lib/python3.8/site-packages (from PyGithub~=1.56->-r dev-tools/scripts/requirements.txt (line 7)) (1.5.0)
Requirement already satisfied: requests>=2.14.0 in /usr/lib/python3/dist-packages (from PyGithub~=1.56->-r dev-tools/scripts/requirements.txt (line 7)) (2.22.0)
Requirement already satisfied: defusedxml in /home/jenkins/.local/lib/python3.8/site-packages (from jira~=3.4.1->-r dev-tools/scripts/requirements.txt (line 8)) (0.7.1)
Requirement already satisfied: packaging in /home/jenkins/.local/lib/python3.8/site-packages (from jira~=3.4.1->-r dev-tools/scripts/requirements.txt (line 8)) (23.0)
Requirement already satisfied: requests-oauthlib>=1.1.0 in /home/jenkins/.local/lib/python3.8/site-packages (from jira~=3.4.1->-r dev-tools/scripts/requirements.txt (line 8)) (1.3.1)
Requirement already satisfied: requests-toolbelt in /home/jenkins/.local/lib/python3.8/site-packages (from jira~=3.4.1->-r dev-tools/scripts/requirements.txt (line 8)) (0.9.1)
Requirement already satisfied: typing-extensions>=3.7.4.2 in /home/jenkins/.local/lib/python3.8/site-packages (from jira~=3.4.1->-r dev-tools/scripts/requirements.txt (line 8)) (4.5.0)
Requirement already satisfied: cffi>=1.4.1 in /usr/local/lib/python3.8/dist-packages (from pynacl>=1.4.0->PyGithub~=1.56->-r dev-tools/scripts/requirements.txt (line 7)) (1.14.2)
Requirement already satisfied: oauthlib>=3.0.0 in /usr/lib/python3/dist-packages (from requests-oauthlib>=1.1.0->jira~=3.4.1->-r dev-tools/scripts/requirements.txt (line 8)) (3.1.0)
Requirement already satisfied: textwrap3>=0.9.2 in /home/jenkins/.local/lib/python3.8/site-packages (from ansiwrap->console-menu~=0.7.1->-r dev-tools/scripts/requirements.txt (line 6)) (0.9.2)
Requirement already satisfied: wrapt<2,>=1.10 in /home/jenkins/.local/lib/python3.8/site-packages (from deprecated->PyGithub~=1.56->-r dev-tools/scripts/requirements.txt (line 7)) (1.13.3)
Requirement already satisfied: pycparser in /usr/local/lib/python3.8/dist-packages (from cffi>=1.4.1->pynacl>=1.4.0->PyGithub~=1.56->-r dev-tools/scripts/requirements.txt (line 7)) (2.20)
DEPRECATION: dblatex 0.3.11py3 has a non-standard version number. pip 23.3 will enforce this behaviour change. A possible replacement is to upgrade to a newer version of dblatex or contact the author to suggest that they release a version with a conforming version number. Discussion can be found at https://github.com/pypa/pip/issues/12063
DEPRECATION: devscripts 2.20.2ubuntu2 has a non-standard version number. pip 23.3 will enforce this behaviour change. A possible replacement is to upgrade to a newer version of devscripts or contact the author to suggest that they release a version with a conforming version number. Discussion can be found at https://github.com/pypa/pip/issues/12063
Starting Smoke tester in folder /home/jenkins/jenkins-slave/workspace/Solr/Solr-Smoketest-9.3
Java 11 JAVA_HOME=/home/jenkins/tools/java/latest11
NOTE: output encoding is utf-8
NOTE: Not running @Nightly or @BadApple tests. Please verify that recent Jenkins runs have passed.
Load release URL "file:///home/jenkins/jenkins-slave/workspace/Solr/Solr-Smoketest-9.3/solr/distribution/build/release"...
Get KEYS...
Downloading online KEYS file https://archive.apache.org/dist/solr/KEYS
Downloading https://archive.apache.org/dist/solr/KEYS
0.3 MB in 1.18 sec (0.3 MB/sec)
Test Solr...
test basics...
check changes HTML...
download solr-9.3.1-slim.tgz...
Downloading file:///home/jenkins/jenkins-slave/workspace/Solr/Solr-Smoketest-9.3/solr/distribution/build/release/solr-9.3.1-slim.tgz
59.5 MB in 0.05 sec (1315.5 MB/sec)
verify sha512 digest
download solr-9.3.1-src.tgz...
Downloading file:///home/jenkins/jenkins-slave/workspace/Solr/Solr-Smoketest-9.3/solr/distribution/build/release/solr-9.3.1-src.tgz
85.9 MB in 0.07 sec (1256.7 MB/sec)
verify sha512 digest
download solr-9.3.1.tgz...
Downloading file:///home/jenkins/jenkins-slave/workspace/Solr/Solr-Smoketest-9.3/solr/distribution/build/release/solr-9.3.1.tgz
264.4 MB in 0.20 sec (1339.2 MB/sec)
verify sha512 digest
unpack solr-9.3.1.tgz...
solr-9.3.1.tgz
Checking LICENSE.txt
Checking NOTICE.txt
Checking README.txt
Checking CHANGES.txt
Checking bin
Checking modules
Checking docker
Checking prometheus-exporter
Checking docs
Checking example
Checking licenses
Checking server
Checking lib
verify JAR metadata/identity/no javax.* or java.* classes...
**WARNING**: skipping check of /home/jenkins/jenkins-slave/workspace/Solr/Solr-Smoketest-9.3/_tmp/smoke_1692024812/unpack/solr-9.3.1/modules/extraction/lib/unit-api-1.0.jar: it has javax.* classes
**WARNING**: skipping check of /home/jenkins/jenkins-slave/workspace/Solr/Solr-Smoketest-9.3/_tmp/smoke_1692024812/unpack/solr-9.3.1/modules/extraction/lib/jakarta.activation-1.2.2.jar: it has javax.* classes
**WARNING**: skipping check of /home/jenkins/jenkins-slave/workspace/Solr/Solr-Smoketest-9.3/_tmp/smoke_1692024812/unpack/solr-9.3.1/server/solr-webapp/webapp/WEB-INF/lib/jakarta.inject-2.6.1.jar: it has javax.* classes
**WARNING**: skipping check of /home/jenkins/jenkins-slave/workspace/Solr/Solr-Smoketest-9.3/_tmp/smoke_1692024812/unpack/solr-9.3.1/server/solr-webapp/webapp/WEB-INF/lib/jakarta.activation-api-1.2.2.jar: it has javax.* classes
**WARNING**: skipping check of /home/jenkins/jenkins-slave/workspace/Solr/Solr-Smoketest-9.3/_tmp/smoke_1692024812/unpack/solr-9.3.1/server/solr-webapp/webapp/WEB-INF/lib/jakarta.validation-api-2.0.2.jar: it has javax.* classes
**WARNING**: skipping check of /home/jenkins/jenkins-slave/workspace/Solr/Solr-Smoketest-9.3/_tmp/smoke_1692024812/unpack/solr-9.3.1/server/solr-webapp/webapp/WEB-INF/lib/jakarta.annotation-api-1.3.5.jar: it has javax.* classes
**WARNING**: skipping check of /home/jenkins/jenkins-slave/workspace/Solr/Solr-Smoketest-9.3/_tmp/smoke_1692024812/unpack/solr-9.3.1/server/solr-webapp/webapp/WEB-INF/lib/jakarta.ws.rs-api-2.1.6.jar: it has javax.* classes
**WARNING**: skipping check of /home/jenkins/jenkins-slave/workspace/Solr/Solr-Smoketest-9.3/_tmp/smoke_1692024812/unpack/solr-9.3.1/server/solr-webapp/webapp/WEB-INF/lib/jakarta.xml.bind-api-2.3.3.jar: it has javax.* classes
**WARNING**: skipping check of /home/jenkins/jenkins-slave/workspace/Solr/Solr-Smoketest-9.3/_tmp/smoke_1692024812/unpack/solr-9.3.1/server/lib/ext/jetty-servlet-api-4.0.6.jar: it has javax.* classes
copying unpacked distribution for Java 11 ...
test solr example w/ Java 11...
start Solr instance (log=/home/jenkins/jenkins-slave/workspace/Solr/Solr-Smoketest-9.3/_tmp/smoke_1692024812/unpack/solr-9.3.1-java11/solr-example.log)...
No process found for Solr node running on port 8983
Running techproducts example on port 8983 from /home/jenkins/jenkins-slave/workspace/Solr/Solr-Smoketest-9.3/_tmp/smoke_1692024812/unpack/solr-9.3.1-java11
*** [WARN] *** Your open file limit is currently 60000.
It should be set to 65000 to avoid operational disruption.
If you no longer wish to see this warning, set SOLR_ULIMIT_CHECKS to false in your profile or solr.in.sh
*** [WARN] *** Your Max Processes Limit is currently 30000.
It should be set to 65000 to avoid operational disruption.
If you no longer wish to see this warning, set SOLR_ULIMIT_CHECKS to false in your profile or solr.in.sh
Creating Solr home directory /home/jenkins/jenkins-slave/workspace/Solr/Solr-Smoketest-9.3/_tmp/smoke_1692024812/unpack/solr-9.3.1-java11/example/techproducts/solr
Starting up Solr on port 8983 using command:
"bin/solr" start -p 8983 -s "example/techproducts/solr"
*** [WARN] *** Your open file limit is currently 60000.
It should be set to 65000 to avoid operational disruption.
If you no longer wish to see this warning, set SOLR_ULIMIT_CHECKS to false in your profile or solr.in.sh
*** [WARN] *** Your Max Processes Limit is currently 30000.
It should be set to 65000 to avoid operational disruption.
If you no longer wish to see this warning, set SOLR_ULIMIT_CHECKS to false in your profile or solr.in.sh
Warning: Available entropy is low. As a result, use of the UUIDField, SSL, or any other features that require
RNG might not work properly. To check for the amount of available entropy, use 'cat /proc/sys/kernel/random/entropy_avail'.
Waiting up to 180 seconds to see Solr running on port 8983 [|] [/] [-] [\] [|]
Started Solr server on port 8983 (pid=2699030). Happy searching!
Created new core 'techproducts'
Indexing tech product example docs from /home/jenkins/jenkins-slave/workspace/Solr/Solr-Smoketest-9.3/_tmp/smoke_1692024812/unpack/solr-9.3.1-java11/example/exampledocs
SimplePostTool version 5.0.0
Posting files to [base] url http://localhost:8983/solr/techproducts/update using content-type application/xml...
POSTing file solr.xml to [base]
POSTing file sd500.xml to [base]
POSTing file hd.xml to [base]
POSTing file manufacturers.xml to [base]
POSTing file ipod_other.xml to [base]
POSTing file gb18030-example.xml to [base]
POSTing file mp500.xml to [base]
POSTing file vidcard.xml to [base]
POSTing file utf8-example.xml to [base]
POSTing file monitor2.xml to [base]
POSTing file money.xml to [base]
POSTing file monitor.xml to [base]
POSTing file ipod_video.xml to [base]
POSTing file mem.xml to [base]
14 files indexed.
COMMITting Solr index changes to http://localhost:8983/solr/techproducts/update...
Time spent: 0:00:00.445
test utf8...
run query...
stop server using: bin/solr stop -p 8983
Sending stop command to Solr running on port 8983 ... waiting up to 180 seconds to allow Jetty process 2699030 to stop gracefully.
[|] [/] [-] [\] unpack solr-9.3.1-slim.tgz...
solr-9.3.1-slim.tgz
Checking LICENSE.txt
Checking NOTICE.txt
Checking README.txt
Checking CHANGES.txt
Checking bin
Checking docker
Checking docs
Checking example
Checking licenses
Checking server
Checking lib
verify JAR metadata/identity/no javax.* or java.* classes...
**WARNING**: skipping check of /home/jenkins/jenkins-slave/workspace/Solr/Solr-Smoketest-9.3/_tmp/smoke_1692024812/unpack/solr-9.3.1-slim/server/solr-webapp/webapp/WEB-INF/lib/jakarta.inject-2.6.1.jar: it has javax.* classes
**WARNING**: skipping check of /home/jenkins/jenkins-slave/workspace/Solr/Solr-Smoketest-9.3/_tmp/smoke_1692024812/unpack/solr-9.3.1-slim/server/solr-webapp/webapp/WEB-INF/lib/jakarta.activation-api-1.2.2.jar: it has javax.* classes
**WARNING**: skipping check of /home/jenkins/jenkins-slave/workspace/Solr/Solr-Smoketest-9.3/_tmp/smoke_1692024812/unpack/solr-9.3.1-slim/server/solr-webapp/webapp/WEB-INF/lib/jakarta.validation-api-2.0.2.jar: it has javax.* classes
**WARNING**: skipping check of /home/jenkins/jenkins-slave/workspace/Solr/Solr-Smoketest-9.3/_tmp/smoke_1692024812/unpack/solr-9.3.1-slim/server/solr-webapp/webapp/WEB-INF/lib/jakarta.annotation-api-1.3.5.jar: it has javax.* classes
**WARNING**: skipping check of /home/jenkins/jenkins-slave/workspace/Solr/Solr-Smoketest-9.3/_tmp/smoke_1692024812/unpack/solr-9.3.1-slim/server/solr-webapp/webapp/WEB-INF/lib/jakarta.ws.rs-api-2.1.6.jar: it has javax.* classes
**WARNING**: skipping check of /home/jenkins/jenkins-slave/workspace/Solr/Solr-Smoketest-9.3/_tmp/smoke_1692024812/unpack/solr-9.3.1-slim/server/solr-webapp/webapp/WEB-INF/lib/jakarta.xml.bind-api-2.3.3.jar: it has javax.* classes
**WARNING**: skipping check of /home/jenkins/jenkins-slave/workspace/Solr/Solr-Smoketest-9.3/_tmp/smoke_1692024812/unpack/solr-9.3.1-slim/server/lib/ext/jetty-servlet-api-4.0.6.jar: it has javax.* classes
copying unpacked distribution for Java 11 ...
test solr example w/ Java 11...
start Solr instance (log=/home/jenkins/jenkins-slave/workspace/Solr/Solr-Smoketest-9.3/_tmp/smoke_1692024812/unpack/solr-9.3.1-slim-java11/solr-example.log)...
No process found for Solr node running on port 8983
Running techproducts example on port 8983 from /home/jenkins/jenkins-slave/workspace/Solr/Solr-Smoketest-9.3/_tmp/smoke_1692024812/unpack/solr-9.3.1-slim-java11
*** [WARN] *** Your open file limit is currently 60000.
It should be set to 65000 to avoid operational disruption.
If you no longer wish to see this warning, set SOLR_ULIMIT_CHECKS to false in your profile or solr.in.sh
*** [WARN] *** Your Max Processes Limit is currently 30000.
It should be set to 65000 to avoid operational disruption.
If you no longer wish to see this warning, set SOLR_ULIMIT_CHECKS to false in your profile or solr.in.sh
Creating Solr home directory /home/jenkins/jenkins-slave/workspace/Solr/Solr-Smoketest-9.3/_tmp/smoke_1692024812/unpack/solr-9.3.1-slim-java11/example/techproducts/solr
Starting up Solr on port 8983 using command:
"bin/solr" start -p 8983 -s "example/techproducts/solr"
*** [WARN] *** Your open file limit is currently 60000.
It should be set to 65000 to avoid operational disruption.
If you no longer wish to see this warning, set SOLR_ULIMIT_CHECKS to false in your profile or solr.in.sh
*** [WARN] *** Your Max Processes Limit is currently 30000.
It should be set to 65000 to avoid operational disruption.
If you no longer wish to see this warning, set SOLR_ULIMIT_CHECKS to false in your profile or solr.in.sh
Warning: Available entropy is low. As a result, use of the UUIDField, SSL, or any other features that require
RNG might not work properly. To check for the amount of available entropy, use 'cat /proc/sys/kernel/random/entropy_avail'.
Waiting up to 180 seconds to see Solr running on port 8983 [|] [/] [-] [\] [|]
Started Solr server on port 8983 (pid=2699440). Happy searching!
Created new core 'techproducts'
Indexing tech product example docs from /home/jenkins/jenkins-slave/workspace/Solr/Solr-Smoketest-9.3/_tmp/smoke_1692024812/unpack/solr-9.3.1-slim-java11/example/exampledocs
SimplePostTool version 5.0.0
Posting files to [base] url http://localhost:8983/solr/techproducts/update using content-type application/xml...
POSTing file solr.xml to [base]
POSTing file sd500.xml to [base]
POSTing file hd.xml to [base]
POSTing file manufacturers.xml to [base]
POSTing file ipod_other.xml to [base]
POSTing file gb18030-example.xml to [base]
POSTing file mp500.xml to [base]
POSTing file vidcard.xml to [base]
POSTing file utf8-example.xml to [base]
POSTing file monitor2.xml to [base]
POSTing file money.xml to [base]
POSTing file monitor.xml to [base]
POSTing file ipod_video.xml to [base]
POSTing file mem.xml to [base]
14 files indexed.
COMMITting Solr index changes to http://localhost:8983/solr/techproducts/update...
Time spent: 0:00:00.455
test utf8...
run query...
stop server using: bin/solr stop -p 8983
Sending stop command to Solr running on port 8983 ... waiting up to 180 seconds to allow Jetty process 2699440 to stop gracefully.
[|] [/] [-] [\] unpack solr-9.3.1-src.tgz...
solr-9.3.1-src.tgz
Checking LICENSE.txt
Checking NOTICE.txt
Checking README.md
Checking CONTRIBUTING.md
Checking CHANGES.txt
Checking README.adoc
Checking buildSrc
Checking dev-docs
Checking dev-tools
Checking gradle
Checking help
Checking solr
Checking build.gradle
Checking gradlew
Checking gradlew.bat
Checking settings.gradle
Checking versions.lock
Checking versions.props
Checking benchmark
Checking bin
Checking modules
Checking core
Checking docker
Checking documentation
Checking example
Checking licenses
Checking packaging
Checking distribution
Checking prometheus-exporter
Checking server
Checking solr-ref-guide
Checking solrj
Checking solrj-streaming
Checking solrj-zookeeper
Checking test-framework
Checking webapp
Checking .gitignore
Checking .gitattributes
Checking build.gradle
make sure no JARs/WARs in src dist...
run "./gradlew --no-daemon check -p solr/documentation"
run tests w/ Java 11 and testArgs='-Dtests.nightly=false -Dtests.badapples=false '...
command "export JAVA_HOME="/home/jenkins/tools/java/latest11" PATH="/home/jenkins/tools/java/latest11/bin:$PATH" JAVACMD="/home/jenkins/tools/java/latest11/bin/java"; ./gradlew --no-daemon test -Dtests.nightly=false -Dtests.badapples=false " failed:
To honour the JVM settings for this build a single-use Daemon process will be forked. See https://docs.gradle.org/7.6/userguide/gradle_daemon.html#sec:disabling_the_daemon.
Daemon will be stopped at the end of the build
Gradle Enterprise plugins resolution: https://plugins.gradle.org/m2
Applying com.gradle.enterprise.gradleplugin.GradleEnterprisePlugin via init script
Connection to Gradle Enterprise: https://ge.apache.org, allowUntrustedServer: false
Enforcing Gradle Enterprise: https://ge.apache.org, allowUntrustedServer: false
Applying com.gradle.CommonCustomUserDataGradlePlugin via init script
> Task :buildSrc:compileJava UP-TO-DATE
> Task :buildSrc:compileGroovy NO-SOURCE
> Task :buildSrc:processResources NO-SOURCE
> Task :buildSrc:classes UP-TO-DATE
> Task :buildSrc:jar UP-TO-DATE
> Task :buildSrc:assemble UP-TO-DATE
> Task :buildSrc:compileTestJava NO-SOURCE
> Task :buildSrc:compileTestGroovy NO-SOURCE
> Task :buildSrc:processTestResources NO-SOURCE
> Task :buildSrc:testClasses UP-TO-DATE
> Task :buildSrc:test NO-SOURCE
> Task :buildSrc:check UP-TO-DATE
> Task :buildSrc:build UP-TO-DATE
> Task :randomizationInfo
Running tests with randomization seed: tests.seed=88DB9DF441205B7D
> Task :checkJdkInternalsExportedToGradle
> Task :solr:benchmark:processResources
> Task :solr:benchmark:processTestResources
> Task :solr:solrj:compileJava UP-TO-DATE
> Task :solr:solrj-streaming:compileJava UP-TO-DATE
> Task :gitStatus
> Task :solr:core:processResources UP-TO-DATE
> Task :solr:solrj:processResources NO-SOURCE
> Task :solr:solrj:classes UP-TO-DATE
> Task :solr:solrj:jar UP-TO-DATE
> Task :solr:solrj-zookeeper:compileJava UP-TO-DATE
> Task :solr:solrj-streaming:processResources UP-TO-DATE
> Task :solr:solrj-streaming:classes UP-TO-DATE
> Task :solr:solrj-streaming:jar UP-TO-DATE
> Task :solr:solrj-zookeeper:processResources NO-SOURCE
> Task :solr:solrj-zookeeper:classes UP-TO-DATE
> Task :solr:solrj-zookeeper:jar UP-TO-DATE
> Task :solr:test-framework:processResources
> Task :solr:modules:analysis-extras:processResources NO-SOURCE
> Task :solr:core:compileJava UP-TO-DATE
> Task :solr:test-framework:compileJava UP-TO-DATE
> Task :solr:prometheus-exporter:compileJava
Note: Some input files use or override a deprecated API.
Note: Recompile with -Xlint:deprecation for details.
> Task :solr:core:classes UP-TO-DATE
> Task :solr:core:jar UP-TO-DATE
> Task :solr:test-framework:classes
> Task :solr:test-framework:jar
> Task :solr:benchmark:compileJava
> Task :solr:benchmark:classes
> Task :solr:benchmark:compileTestJava
> Task :solr:benchmark:testClasses
> Task :solr:core:compileTestJava
> Task :solr:benchmark:test
> Task :solr:core:compileTestJava
Note: Some input files use or override a deprecated API.
Note: Recompile with -Xlint:deprecation for details.
> Task :solr:core:processTestResources
> Task :solr:core:testClasses
> Task :solr:modules:analysis-extras:compileJava
Note: /home/jenkins/jenkins-slave/workspace/Solr/Solr-Smoketest-9.3/_tmp/smoke_1692024812/unpack/solr-9.3.1/solr/modules/analysis-extras/src/java/org/apache/solr/schema/ICUCollationField.java uses or overrides a deprecated API.
Note: Recompile with -Xlint:deprecation for details.
> Task :solr:modules:analysis-extras:classes
> Task :solr:modules:analysis-extras:jar
> Task :solr:core:test
WARNING: Test org.apache.solr.TestRandomFaceting wrote 12,738,926 bytes of output.
WARNING: Test org.apache.solr.schema.DocValuesTest wrote 11,016,720 bytes of output.
WARNING: Test org.apache.solr.schema.TestCloudSchemaless wrote 13,140,671 bytes of output.
WARNING: Test org.apache.solr.search.facet.TestCloudJSONFacetSKG wrote 24,954,662 bytes of output.
WARNING: Test org.apache.solr.search.facet.TestJsonFacets wrote 26,006,753 bytes of output.
org.apache.solr.search.TestStressUserVersions > testStressReorderVersions FAILED
com.carrotsearch.randomizedtesting.UncaughtExceptionError: Captured an uncaught exception in thread: Thread[id=40395, name=READER0, state=RUNNABLE, group=TGRP-TestStressUserVersions]
Caused by:
java.lang.RuntimeException: java.lang.AssertionError
at __randomizedtesting.SeedInfo.seed([88DB9DF441205B7D]:0)
at org.apache.solr.search.TestStressUserVersions$2.run(TestStressUserVersions.java:333)
Caused by:
java.lang.AssertionError
at org.junit.Assert.fail(Assert.java:87)
at org.junit.Assert.fail(Assert.java:96)
at org.apache.solr.search.TestStressUserVersions$2.run(TestStressUserVersions.java:317)
com.carrotsearch.randomizedtesting.UncaughtExceptionError: Captured an uncaught exception in thread: Thread[id=40401, name=READER6, state=RUNNABLE, group=TGRP-TestStressUserVersions]
Caused by:
java.lang.RuntimeException: java.lang.AssertionError
at __randomizedtesting.SeedInfo.seed([88DB9DF441205B7D]:0)
at org.apache.solr.search.TestStressUserVersions$2.run(TestStressUserVersions.java:333)
Caused by:
java.lang.AssertionError
at org.junit.Assert.fail(Assert.java:87)
at org.junit.Assert.fail(Assert.java:96)
at org.apache.solr.search.TestStressUserVersions$2.run(TestStressUserVersions.java:317)
com.carrotsearch.randomizedtesting.UncaughtExceptionError: Captured an uncaught exception in thread: Thread[id=40403, name=READER8, state=RUNNABLE, group=TGRP-TestStressUserVersions]
Caused by:
java.lang.RuntimeException: java.lang.AssertionError
at __randomizedtesting.SeedInfo.seed([88DB9DF441205B7D]:0)
at org.apache.solr.search.TestStressUserVersions$2.run(TestStressUserVersions.java:333)
Caused by:
java.lang.AssertionError
at org.junit.Assert.fail(Assert.java:87)
at org.junit.Assert.fail(Assert.java:96)
at org.apache.solr.search.TestStressUserVersions$2.run(TestStressUserVersions.java:317)
org.apache.solr.search.TestStressUserVersions > test suite's output saved to /home/jenkins/jenkins-slave/workspace/Solr/Solr-Smoketest-9.3/_tmp/smoke_1692024812/unpack/solr-9.3.1/solr/core/build/test-results/test/outputs/OUTPUT-org.apache.solr.search.TestStressUserVersions.txt, copied below:
2> 1837487 INFO (SUITE-TestStressUserVersions-seed#[88DB9DF441205B7D]-worker) [] o.a.s.SolrTestCase Setting 'solr.default.confdir' system property to test-framework derived value of '/home/jenkins/jenkins-slave/workspace/Solr/Solr-Smoketest-9.3/_tmp/smoke_1692024812/unpack/solr-9.3.1/solr/server/solr/configsets/_default/conf'
2> 1837488 INFO (SUITE-TestStressUserVersions-seed#[88DB9DF441205B7D]-worker) [] o.a.s.u.ErrorLogMuter Closing ErrorLogMuter-regex-9137 after mutting 0 log messages
2> 1837488 INFO (SUITE-TestStressUserVersions-seed#[88DB9DF441205B7D]-worker) [] o.a.s.u.ErrorLogMuter Creating ErrorLogMuter-regex-9138 for ERROR logs matching regex: ignore_exception
2> 1837489 INFO (SUITE-TestStressUserVersions-seed#[88DB9DF441205B7D]-worker) [] o.a.s.SolrTestCaseJ4 Created dataDir: /home/jenkins/jenkins-slave/workspace/Solr/Solr-Smoketest-9.3/_tmp/smoke_1692024812/unpack/solr-9.3.1/solr/core/build/tmp/tests-tmp/solr.search.TestStressUserVersions_88DB9DF441205B7D-001/data-dir-384-001
2> 1837489 WARN (SUITE-TestStressUserVersions-seed#[88DB9DF441205B7D]-worker) [] o.a.s.SolrTestCaseJ4 startTrackingSearchers: numOpens=4 numCloses=4
2> 1837490 INFO (SUITE-TestStressUserVersions-seed#[88DB9DF441205B7D]-worker) [] o.a.s.SolrTestCaseJ4 Using PointFields (NUMERIC_POINTS_SYSPROP=true) w/NUMERIC_DOCVALUES_SYSPROP=false
2> 1837490 INFO (SUITE-TestStressUserVersions-seed#[88DB9DF441205B7D]-worker) [] o.a.s.SolrTestCaseJ4 Randomized ssl (false) and clientAuth (false) via: @org.apache.solr.util.RandomizeSSL(reason="", ssl=0.0/0.0, value=0.0/0.0, clientAuth=0.0/0.0)
2> 1837490 INFO (SUITE-TestStressUserVersions-seed#[88DB9DF441205B7D]-worker) [] o.a.s.SolrTestCaseJ4 SecureRandom sanity checks: test.solr.allowed.securerandom=null & java.security.egd=file:/dev/./urandom
2> 1837491 INFO (SUITE-TestStressUserVersions-seed#[88DB9DF441205B7D]-worker) [] o.a.s.SolrTestCaseJ4 ####initCore
2> 1837493 INFO (SUITE-TestStressUserVersions-seed#[88DB9DF441205B7D]-worker) [] o.a.s.c.SolrResourceLoader Added 2 libs to classloader, from paths: [/home/jenkins/jenkins-slave/workspace/Solr/Solr-Smoketest-9.3/_tmp/smoke_1692024812/unpack/solr-9.3.1/solr/core/build/resources/test/solr/collection1/lib, /home/jenkins/jenkins-slave/workspace/Solr/Solr-Smoketest-9.3/_tmp/smoke_1692024812/unpack/solr-9.3.1/solr/core/build/resources/test/solr/collection1/lib/classes]
2> 1837506 INFO (SUITE-TestStressUserVersions-seed#[88DB9DF441205B7D]-worker) [] o.a.s.c.SolrConfig Using Lucene MatchVersion: 9.7.0
2> 1837509 INFO (SUITE-TestStressUserVersions-seed#[88DB9DF441205B7D]-worker) [] o.a.s.s.IndexSchema Schema name=test
2> 1837512 INFO (SUITE-TestStressUserVersions-seed#[88DB9DF441205B7D]-worker) [] o.a.s.s.IndexSchema Loaded schema test/1.6 with uniqueid field id
2> 1838166 WARN (SUITE-TestStressUserVersions-seed#[88DB9DF441205B7D]-worker) [] o.a.s.c.CoreContainer Not all security plugins configured! authentication=disabled authorization=disabled. Solr is only as secure as you make it. Consider configuring authentication/authorization before exposing Solr to users internal or external. See https://s.apache.org/solrsecurity for more info
2> 1838185 INFO (coreLoadExecutor-27200-thread-1) [ x:collection1] o.a.s.c.SolrResourceLoader Added 2 libs to classloader, from paths: [/home/jenkins/jenkins-slave/workspace/Solr/Solr-Smoketest-9.3/_tmp/smoke_1692024812/unpack/solr-9.3.1/solr/core/build/resources/test/solr/collection1/lib, /home/jenkins/jenkins-slave/workspace/Solr/Solr-Smoketest-9.3/_tmp/smoke_1692024812/unpack/solr-9.3.1/solr/core/build/resources/test/solr/collection1/lib/classes]
2> 1838198 INFO (coreLoadExecutor-27200-thread-1) [ x:collection1] o.a.s.c.SolrConfig Using Lucene MatchVersion: 9.7.0
2> 1838201 INFO (coreLoadExecutor-27200-thread-1) [ x:collection1] o.a.s.s.IndexSchema Schema name=test
2> 1838204 INFO (coreLoadExecutor-27200-thread-1) [ x:collection1] o.a.s.s.IndexSchema Loaded schema test/1.6 with uniqueid field id
2> 1838213 INFO (coreLoadExecutor-27200-thread-1) [ x:collection1] o.a.s.c.CoreContainer Creating SolrCore 'collection1' using configuration from instancedir /home/jenkins/jenkins-slave/workspace/Solr/Solr-Smoketest-9.3/_tmp/smoke_1692024812/unpack/solr-9.3.1/solr/core/build/resources/test/solr/collection1, trusted=true
2> 1838213 INFO (coreLoadExecutor-27200-thread-1) [ x:collection1] o.a.s.c.SolrCore Opening new SolrCore at [/home/jenkins/jenkins-slave/workspace/Solr/Solr-Smoketest-9.3/_tmp/smoke_1692024812/unpack/solr-9.3.1/solr/core/build/resources/test/solr/collection1], dataDir=[/home/jenkins/jenkins-slave/workspace/Solr/Solr-Smoketest-9.3/_tmp/smoke_1692024812/unpack/solr-9.3.1/solr/core/build/tmp/tests-tmp/solr.search.TestStressUserVersions_88DB9DF441205B7D-001/data-dir-384-001/]
2> 1838214 INFO (coreLoadExecutor-27200-thread-1) [ x:collection1] o.a.s.u.RandomMergePolicy RandomMergePolicy wrapping class org.apache.lucene.index.TieredMergePolicy: [TieredMergePolicy: maxMergeAtOnce=31, maxMergedSegmentMB=12.133273124694824, floorSegmentMB=1.8098430633544922, forceMergeDeletesPctAllowed=19.41334893417124, segmentsPerTier=30.0, maxCFSSegmentSizeMB=8.796093022208E12, noCFSRatio=0.3262840266509691, deletesPctAllowed=37.5549004638476
2> 1838249 INFO (coreLoadExecutor-27200-thread-1) [ x:collection1] o.a.s.j.SolrRequestAuthorizer Creating a new SolrRequestAuthorizer
2> 1838252 INFO (coreLoadExecutor-27200-thread-1) [ x:collection1] o.a.s.u.UpdateHandler Using UpdateLog implementation: org.apache.solr.update.UpdateLog
2> 1838252 INFO (coreLoadExecutor-27200-thread-1) [ x:collection1] o.a.s.u.UpdateLog Initializing UpdateLog: dataDir= defaultSyncLevel=FLUSH numRecordsToKeep=100 maxNumLogsToKeep=10 numVersionBuckets=65536
2> 1838253 INFO (coreLoadExecutor-27200-thread-1) [ x:collection1] o.a.s.u.CommitTracker Hard AutoCommit: disabled
2> 1838253 INFO (coreLoadExecutor-27200-thread-1) [ x:collection1] o.a.s.u.CommitTracker Soft AutoCommit: disabled
2> 1838253 INFO (coreLoadExecutor-27200-thread-1) [ x:collection1] o.a.s.u.RandomMergePolicy RandomMergePolicy wrapping class org.apache.lucene.index.LogByteSizeMergePolicy: [LogByteSizeMergePolicy: minMergeSize=1677721, mergeFactor=20, maxMergeSize=2147483648, maxMergeSizeForForcedMerge=9223372036854775807, calibrateSizeByDeletes=true, maxMergeDocs=2147483647, maxCFSSegmentSizeMB=8.796093022208E12, noCFSRatio=0.1350471819800248]
2> 1838254 WARN (coreLoadExecutor-27200-thread-1) [ x:collection1] o.a.s.r.ManagedResourceStorage Cannot write to config directory /home/jenkins/jenkins-slave/workspace/Solr/Solr-Smoketest-9.3/_tmp/smoke_1692024812/unpack/solr-9.3.1/solr/core/build/resources/test/solr/collection1/conf ; switching to use InMemory storage instead.
2> 1838255 INFO (coreLoadExecutor-27200-thread-1) [ x:collection1] o.a.s.h.ReplicationHandler Commits will be reserved for 10000 ms
2> 1838255 INFO (coreLoadExecutor-27200-thread-1) [ x:collection1] o.a.s.u.UpdateLog Could not find max version in index or recent updates, using new clock 1774218811668430848
2> 1838257 INFO (searcherExecutor-27202-thread-1-processing-collection1) [ x:collection1] o.a.s.c.SolrCore Registered new searcher autowarm time: 0 ms
2> 1838276 INFO (SUITE-TestStressUserVersions-seed#[88DB9DF441205B7D]-worker) [] o.a.s.j.SolrRequestAuthorizer Creating a new SolrRequestAuthorizer
2> 1838284 INFO (SUITE-TestStressUserVersions-seed#[88DB9DF441205B7D]-worker) [] o.a.s.SolrTestCaseJ4 ####initCore end
2> 1838288 INFO (TEST-TestStressUserVersions.testStressReorderVersions-seed#[88DB9DF441205B7D]) [] o.a.s.SolrTestCaseJ4 ###Starting testStressReorderVersions
2> 1838289 INFO (TEST-TestStressUserVersions.testStressReorderVersions-seed#[88DB9DF441205B7D]) [] o.a.s.u.DirectUpdateHandler2 REMOVING ALL DOCUMENTS FROM INDEX
2> 1838289 INFO (TEST-TestStressUserVersions.testStressReorderVersions-seed#[88DB9DF441205B7D]) [] o.a.s.c.S.Request webapp=null path=null params={_version_=-9223372036854775807&update.distrib=FROMLEADER&versions=true&wt=json&indent=true} status=0 QTime=1
2> 1838291 INFO (searcherExecutor-27202-thread-1-processing-collection1) [ x:collection1] o.a.s.c.SolrCore Registered new searcher autowarm time: 0 ms
2> 1838292 INFO (TEST-TestStressUserVersions.testStressReorderVersions-seed#[88DB9DF441205B7D]) [ x:collection1] o.a.s.c.S.Request webapp=null path=null params={} status=0 QTime=2
2> 1838292 INFO (TEST-TestStressUserVersions.testStressReorderVersions-seed#[88DB9DF441205B7D]) [] o.a.s.s.TestStressUserVersions VERBOSE: commitPercent 22 softCommitPercent 47 deletePercent 24 deleteByQueryPercent 0 ndocs 186 nWriteThreads 11 percentRealtimeQuery 75 operations 10000 nReadThreads 11
2> 1838295 INFO (WRITER0) [] o.a.s.s.TestStressUserVersions VERBOSE: adding id 0 val= 2 version 1
2> 1838295 INFO (WRITER2) [] o.a.s.s.TestStressUserVersions VERBOSE: adding id 116 val= 2 version 2
2> 1838295 INFO (WRITER1) [] o.a.s.s.TestStressUserVersions VERBOSE: hardCommit start
2> 1838295 INFO (WRITER1) [ x:collection1] o.a.s.c.S.Request webapp=null path=null params={} status=0 QTime=0
2> 1838296 INFO (WRITER1) [] o.a.s.s.TestStressUserVersions VERBOSE: hardCommit end
2> 1838296 INFO (WRITER1) [] o.a.s.s.TestStressUserVersions VERBOSE: deleting id 0 val= 2 version 3
2> 1838297 INFO (WRITER3) [] o.a.s.s.TestStressUserVersions VERBOSE: adding id 31 val= 2 version 4
2> 1838297 INFO (WRITER6) [] o.a.s.s.TestStressUserVersions VERBOSE: adding id 31 val= 2 version 5
2> 1838297 INFO (WRITER7) [] o.a.s.s.TestStressUserVersions VERBOSE: deleting id 31 val= 2 version 6
2> 1838298 INFO (WRITER8) [] o.a.s.s.TestStressUserVersions VERBOSE: adding id 31 val= 2 version 7
2> 1838299 INFO (WRITER9) [] o.a.s.s.TestStressUserVersions VERBOSE: adding id 31 val= 2 version 8
2> 1838303 INFO (READER0) [] o.a.s.c.S.Request webapp=null path=null params={qt=/get&ids=77&wt=json} status=0 QTime=0
2> 1838303 INFO (READER1) [] o.a.s.c.S.Request webapp=null path=null params={qt=/get&ids=11&wt=json} status=0 QTime=0
2> 1838303 INFO (WRITER10) [] o.a.s.s.TestStressUserVersions VERBOSE: adding id 31 val= 2 version 9
2> 1838304 INFO (READER0) [] o.a.s.c.S.Request webapp=null path=null params={qt=/get&ids=142&wt=json} status=0 QTime=0
2> 1838304 INFO (READER1) [] o.a.s.c.S.Request webapp=null path=null params={qt=/get&ids=31&wt=json} status=0 QTime=0
2> 1838304 INFO (READER1) [] o.a.s.c.S.Request webapp=null path=null params={qt=/get&ids=96&wt=json} status=0 QTime=0
2> 1838304 INFO (READER1) [] o.a.s.c.S.Request webapp=null path=null params={qt=/get&ids=20&wt=json} status=0 QTime=0
2> 1838304 INFO (READER1) [] o.a.s.c.S.Request webapp=null path=null params={qt=/get&ids=44&wt=json} status=0 QTime=0
2> 1838304 INFO (READER1) [] o.a.s.c.S.Request webapp=null path=null params={qt=/get&ids=147&wt=json} status=0 QTime=0
2> 1838304 INFO (READER2) [] o.a.s.c.S.Request webapp=null path=null params={qt=/get&ids=37&wt=json} status=0 QTime=0
2> 1838304 INFO (READER2) [] o.a.s.c.S.Request webapp=null path=null params={qt=/get&ids=54&wt=json} status=0 QTime=0
2> 1838305 INFO (READER2) [] o.a.s.c.S.Request webapp=null path=null params={qt=/get&ids=68&wt=json} status=0 QTime=0
2> 1838305 INFO (READER5) [] o.a.s.c.S.Request webapp=null path=null params={qt=/get&ids=168&wt=json} status=0 QTime=0
2> 1838305 INFO (READER5) [] o.a.s.c.S.Request webapp=null path=null params={qt=/get&ids=87&wt=json} status=0 QTime=0
2> 1838305 INFO (READER5) [] o.a.s.c.S.Request webapp=null path=null params={qt=/get&ids=62&wt=json} status=0 QTime=0
2> 1838305 INFO (READER5) [] o.a.s.c.S.Request webapp=null path=null params={qt=/get&ids=173&wt=json} status=0 QTime=0
2> 1838305 INFO (READER2) [] o.a.s.c.S.Request webapp=null path=null params={qt=/get&ids=165&wt=json} status=0 QTime=0
2> 1838305 INFO (READER7) [] o.a.s.c.S.Request webapp=null path=null params={qt=/get&ids=6&wt=json} status=0 QTime=0
2> 1838306 INFO (READER8) [] o.a.s.c.S.Request webapp=null path=null params={qt=/get&ids=53&wt=json} status=0 QTime=0
2> 1838306 INFO (READER8) [] o.a.s.c.S.Request webapp=null path=null params={qt=/get&ids=31&wt=json} status=0 QTime=0
2> 1838306 INFO (READER8) [] o.a.s.c.S.Request webapp=null path=null params={qt=/get&ids=26&wt=json} status=0 QTime=0
2> 1838306 INFO (READER8) [] o.a.s.c.S.Request webapp=null path=null params={qt=/get&ids=102&wt=json} status=0 QTime=0
2> 1838307 INFO (READER8) [] o.a.s.c.S.Request webapp=null path=null params={qt=/get&ids=31&wt=json} status=0 QTime=0
2> 1838307 INFO (READER8) [] o.a.s.c.S.Request webapp=null path=null params={qt=/get&ids=84&wt=json} status=0 QTime=0
2> 1838307 INFO (READER8) [] o.a.s.c.S.Request webapp=null path=null params={qt=/get&ids=31&wt=json} status=0 QTime=0
2> 1838307 INFO (READER8) [] o.a.s.c.S.Request webapp=null path=null params={qt=/get&ids=71&wt=json} status=0 QTime=0
2> 1838307 INFO (READER9) [] o.a.s.c.S.Request webapp=null path=null params={qt=/get&ids=150&wt=json} status=0 QTime=0
2> 1838307 INFO (READER9) [] o.a.s.c.S.Request webapp=null path=null params={qt=/get&ids=31&wt=json} status=0 QTime=0
2> 1838307 INFO (READER9) [] o.a.s.c.S.Request webapp=null path=null params={qt=/get&ids=35&wt=json} status=0 QTime=0
2> 1838308 INFO (READER9) [] o.a.s.c.S.Request webapp=null path=null params={qt=/get&ids=100&wt=json} status=0 QTime=0
2> 1838315 INFO (READER2) [] o.a.s.c.S.Request webapp=null path=null params={q=id:31&omitHeader=true&wt=json} hits=0 status=0 QTime=0
2> 1838315 INFO (READER1) [] o.a.s.c.S.Request webapp=null path=null params={q=id:110&omitHeader=true&wt=json} hits=0 status=0 QTime=0
2> 1838315 INFO (READER3) [] o.a.s.c.S.Request webapp=null path=null params={q=id:176&omitHeader=true&wt=json} hits=0 status=0 QTime=0
2> 1838315 INFO (READER2) [] o.a.s.c.S.Request webapp=null path=null params={qt=/get&ids=146&wt=json} status=0 QTime=0
2> 1838315 INFO (READER2) [] o.a.s.c.S.Request webapp=null path=null params={qt=/get&ids=8&wt=json} status=0 QTime=0
2> 1838315 INFO (READER1) [] o.a.s.c.S.Request webapp=null path=null params={q=id:158&omitHeader=true&wt=json} hits=0 status=0 QTime=0
2> 1838315 INFO (READER3) [] o.a.s.c.S.Request webapp=null path=null params={q=id:31&omitHeader=true&wt=json} hits=0 status=0 QTime=0
2> 1838315 INFO (READER4) [] o.a.s.c.S.Request webapp=null path=null params={q=id:31&omitHeader=true&wt=json} hits=0 status=0 QTime=0
2> 1838315 INFO (READER2) [] o.a.s.c.S.Request webapp=null path=null params={q=id:31&omitHeader=true&wt=json} hits=0 status=0 QTime=0
2> 1838315 INFO (READER3) [] o.a.s.c.S.Request webapp=null path=null params={qt=/get&ids=96&wt=json} status=0 QTime=0
2> 1838315 INFO (READER4) [] o.a.s.c.S.Request webapp=null path=null params={qt=/get&ids=113&wt=json} status=0 QTime=0
2> 1838315 INFO (READER3) [] o.a.s.c.S.Request webapp=null path=null params={qt=/get&ids=128&wt=json} status=0 QTime=0
2> 1838315 INFO (READER2) [] o.a.s.c.S.Request webapp=null path=null params={qt=/get&ids=158&wt=json} status=0 QTime=0
2> 1838315 INFO (READER4) [] o.a.s.c.S.Request webapp=null path=null params={qt=/get&ids=171&wt=json} status=0 QTime=0
2> 1838315 INFO (READER3) [] o.a.s.c.S.Request webapp=null path=null params={qt=/get&ids=31&wt=json} status=0 QTime=0
2> 1838315 INFO (READER2) [] o.a.s.c.S.Request webapp=null path=null params={qt=/get&ids=92&wt=json} status=0 QTime=0
2> 1838315 INFO (READER4) [] o.a.s.c.S.Request webapp=null path=null params={qt=/get&ids=145&wt=json} status=0 QTime=0
2> 1838315 INFO (READER3) [] o.a.s.c.S.Request webapp=null path=null params={qt=/get&ids=31&wt=json} status=0 QTime=0
2> 1838315 INFO (READER2) [] o.a.s.c.S.Request webapp=null path=null params={qt=/get&ids=120&wt=json} status=0 QTime=0
2> 1838315 INFO (READER4) [] o.a.s.c.S.Request webapp=null path=null params={qt=/get&ids=31&wt=json} status=0 QTime=0
2> 1838315 INFO (READER3) [] o.a.s.c.S.Request webapp=null path=null params={qt=/get&ids=42&wt=json} status=0 QTime=0
2> 1838315 INFO (READER4) [] o.a.s.c.S.Request webapp=null path=null params={qt=/get&ids=31&wt=json} status=0 QTime=0
2> 1838315 INFO (READER2) [] o.a.s.c.S.Request webapp=null path=null params={qt=/get&ids=34&wt=json} status=0 QTime=0
2> 1838315 INFO (READER2) [] o.a.s.c.S.Request webapp=null path=null params={qt=/get&ids=31&wt=json} status=0 QTime=0
2> 1838315 INFO (READER3) [] o.a.s.c.S.Request webapp=null path=null params={q=id:84&omitHeader=true&wt=json} hits=0 status=0 QTime=0
2> 1838315 INFO (READER4) [] o.a.s.c.S.Request webapp=null path=null params={q=id:109&omitHeader=true&wt=json} hits=0 status=0 QTime=0
2> 1838316 INFO (READER3) [] o.a.s.c.S.Request webapp=null path=null params={qt=/get&ids=131&wt=json} status=0 QTime=0
2> 1838316 INFO (READER2) [] o.a.s.c.S.Request webapp=null path=null params={q=id:31&omitHeader=true&wt=json} hits=0 status=0 QTime=0
2> 1838316 INFO (READER4) [] o.a.s.c.S.Request webapp=null path=null params={qt=/get&ids=31&wt=json} status=0 QTime=0
2> 1838316 INFO (READER3) [] o.a.s.c.S.Request webapp=null path=null params={q=id:31&omitHeader=true&wt=json} hits=0 status=0 QTime=0
2> 1838316 INFO (READER4) [] o.a.s.c.S.Request webapp=null path=null params={qt=/get&ids=165&wt=json} status=0 QTime=0
2> 1838316 INFO (READER2) [] o.a.s.c.S.Request webapp=null path=null params={q=id:18&omitHeader=true&wt=json} hits=0 status=0 QTime=0
2> 1838316 INFO (READER4) [] o.a.s.c.S.Request webapp=null path=null params={qt=/get&ids=106&wt=json} status=0 QTime=0
2> 1838316 INFO (READER3) [] o.a.s.c.S.Request webapp=null path=null params={qt=/get&ids=147&wt=json} status=0 QTime=0
2> 1838316 INFO (READER2) [] o.a.s.c.S.Request webapp=null path=null params={qt=/get&ids=31&wt=json} status=0 QTime=0
2> 1838316 INFO (READER4) [] o.a.s.c.S.Request webapp=null path=null params={qt=/get&ids=24&wt=json} status=0 QTime=0
2> 1838316 INFO (READER3) [] o.a.s.c.S.Request webapp=null path=null params={q=id:31&omitHeader=true&wt=json} hits=0 status=0 QTime=0
2> 1838316 INFO (READER2) [] o.a.s.c.S.Request webapp=null path=null params={q=id:56&omitHeader=true&wt=json} hits=0 status=0 QTime=0
2> 1838316 INFO (READER4) [] o.a.s.c.S.Request webapp=null path=null params={qt=/get&ids=31&wt=json} status=0 QTime=0
2> 1838316 INFO (READER3) [] o.a.s.c.S.Request webapp=null path=null params={qt=/get&ids=31&wt=json} status=0 QTime=0
2> 1838316 INFO (READER4) [] o.a.s.c.S.Request webapp=null path=null params={qt=/get&ids=119&wt=json} status=0 QTime=0
2> 1838316 INFO (READER2) [] o.a.s.c.S.Request webapp=null path=null params={q=id:69&omitHeader=true&wt=json} hits=0 status=0 QTime=0
2> 1838316 INFO (READER3) [] o.a.s.c.S.Request webapp=null path=null params={qt=/get&ids=182&wt=json} status=0 QTime=0
2> 1838316 INFO (READER4) [] o.a.s.c.S.Request webapp=null path=null params={qt=/get&ids=31&wt=json} status=0 QTime=0
2> 1838316 INFO (READER2) [] o.a.s.c.S.Request webapp=null path=null params={q=id:94&omitHeader=true&wt=json} hits=0 status=0 QTime=0
2> 1838316 INFO (READER4) [] o.a.s.c.S.Request webapp=null path=null params={qt=/get&ids=120&wt=json} status=0 QTime=0
2> 1838316 INFO (READER3) [] o.a.s.c.S.Request webapp=null path=null params={q=id:103&omitHeader=true&wt=json} hits=0 status=0 QTime=0
2> 1838316 INFO (READER2) [] o.a.s.c.S.Request webapp=null path=null params={qt=/get&ids=31&wt=json} status=0 QTime=0
2> 1838316 INFO (READER3) [] o.a.s.c.S.Request webapp=null path=null params={qt=/get&ids=182&wt=json} status=0 QTime=0
2> 1838316 INFO (READER4) [] o.a.s.c.S.Request webapp=null path=null params={q=id:31&omitHeader=true&wt=json} hits=0 status=0 QTime=0
2> 1838316 INFO (READER2) [] o.a.s.c.S.Request webapp=null path=null params={qt=/get&ids=77&wt=json} status=0 QTime=0
2> 1838316 INFO (READER3) [] o.a.s.c.S.Request webapp=null path=null params={qt=/get&ids=102&wt=json} status=0 QTime=0
2> 1838316 INFO (READER4) [] o.a.s.c.S.Request webapp=null path=null params={qt=/get&ids=115&wt=json} status=0 QTime=0
2> 1838316 INFO (READER2) [] o.a.s.c.S.Request webapp=null path=null params={qt=/get&ids=31&wt=json} status=0 QTime=0
2> 1838316 INFO (READER3) [] o.a.s.c.S.Request webapp=null path=null params={q=id:31&omitHeader=true&wt=json} hits=0 status=0 QTime=0
2> 1838316 INFO (READER4) [] o.a.s.c.S.Request webapp=null path=null params={qt=/get&ids=19&wt=json} status=0 QTime=0
2> 1838316 INFO (READER2) [] o.a.s.c.S.Request webapp=null path=null params={qt=/get&ids=77&wt=json} status=0 QTime=0
2> 1838316 INFO (READER3) [] o.a.s.c.S.Request webapp=null path=null params={qt=/get&ids=178&wt=json} status=0 QTime=0
2> 1838316 INFO (READER4) [] o.a.s.c.S.Request webapp=null path=null params={q=id:31&omitHeader=true&wt=json} hits=0 status=0 QTime=0
2> 1838316 INFO (READER2) [] o.a.s.c.S.Request webapp=null path=null params={q=id:66&omitHeader=true&wt=json} hits=0 status=0 QTime=0
2> 1838316 INFO (READER3) [] o.a.s.c.S.Request webapp=null path=null params={qt=/get&ids=147&wt=json} status=0 QTime=0
2> 1838317 INFO (READER4) [] o.a.s.c.S.Request webapp=null path=null params={q=id:179&omitHeader=true&wt=json} hits=0 status=0 QTime=0
2> 1838317 INFO (READER2) [] o.a.s.c.S.Request webapp=null path=null params={qt=/get&ids=81&wt=json} status=0 QTime=0
2> 1838317 INFO (READER3) [] o.a.s.c.S.Request webapp=null path=null params={qt=/get&ids=31&wt=json} status=0 QTime=0
2> 1838317 INFO (READER2) [] o.a.s.c.S.Request webapp=null path=null params={qt=/get&ids=145&wt=json} status=0 QTime=0
2> 1838317 INFO (READER3) [] o.a.s.c.S.Request webapp=null path=null params={qt=/get&ids=31&wt=json} status=0 QTime=0
2> 1838317 INFO (READER4) [] o.a.s.c.S.Request webapp=null path=null params={q=id:83&omitHeader=true&wt=json} hits=0 status=0 QTime=0
2> 1838317 INFO (READER3) [] o.a.s.c.S.Request webapp=null path=null params={qt=/get&ids=23&wt=json} status=0 QTime=0
2> 1838317 INFO (READER4) [] o.a.s.c.S.Request webapp=null path=null params={qt=/get&ids=97&wt=json} status=0 QTime=0
2> 1838317 INFO (READER2) [] o.a.s.c.S.Request webapp=null path=null params={q=id:169&omitHeader=true&wt=json} hits=0 status=0 QTime=0
2> 1838317 INFO (READER3) [] o.a.s.c.S.Request webapp=null path=null params={qt=/get&ids=18&wt=json} status=0 QTime=0
2> 1838317 INFO (READER2) [] o.a.s.c.S.Request webapp=null path=null params={qt=/get&ids=103&wt=json} status=0 QTime=0
2> 1838317 INFO (READER4) [] o.a.s.c.S.Request webapp=null path=null params={q=id:86&omitHeader=true&wt=json} hits=0 status=0 QTime=0
2> 1838317 INFO (READER3) [] o.a.s.c.S.Request webapp=null path=null params={qt=/get&ids=141&wt=json} status=0 QTime=0
2> 1838317 INFO (READER3) [] o.a.s.c.S.Request webapp=null path=null params={qt=/get&ids=130&wt=json} status=0 QTime=0
2> 1838317 INFO (READER4) [] o.a.s.c.S.Request webapp=null path=null params={qt=/get&ids=31&wt=json} status=0 QTime=0
2> 1838317 INFO (READER2) [] o.a.s.c.S.Request webapp=null path=null params={q=id:70&omitHeader=true&wt=json} hits=0 status=0 QTime=0
2> 1838317 INFO (READER3) [] o.a.s.c.S.Request webapp=null path=null params={qt=/get&ids=31&wt=json} status=0 QTime=0
2> 1838317 INFO (READER4) [] o.a.s.c.S.Request webapp=null path=null params={qt=/get&ids=31&wt=json} status=0 QTime=0
2> 1838317 INFO (READER2) [] o.a.s.c.S.Request webapp=null path=null params={qt=/get&ids=159&wt=json} status=0 QTime=0
2> 1838317 INFO (READER3) [] o.a.s.c.S.Request webapp=null path=null params={qt=/get&ids=142&wt=json} status=0 QTime=0
2> 1838317 INFO (READER2) [] o.a.s.c.S.Request webapp=null path=null params={qt=/get&ids=9&wt=json} status=0 QTime=0
2> 1838317 INFO (READER4) [] o.a.s.c.S.Request webapp=null path=null params={q=id:20&omitHeader=true&wt=json} hits=0 status=0 QTime=0
2> 1838317 INFO (READER3) [] o.a.s.c.S.Request webapp=null path=null params={qt=/get&ids=31&wt=json} status=0 QTime=0
2> 1838317 INFO (READER4) [] o.a.s.c.S.Request webapp=null path=null params={qt=/get&ids=31&wt=json} status=0 QTime=0
2> 1838317 INFO (READER2) [] o.a.s.c.S.Request webapp=null path=null params={q=id:123&omitHeader=true&wt=json} hits=0 status=0 QTime=0
2> 1838317 INFO (READER4) [] o.a.s.c.S.Request webapp=null path=null params={qt=/get&ids=31&wt=json} status=0 QTime=0
2> 1838317 INFO (READER3) [] o.a.s.c.S.Request webapp=null path=null params={q=id:143&omitHeader=true&wt=json} hits=0 status=0 QTime=0
2> 1838317 INFO (READER2) [] o.a.s.c.S.Request webapp=null path=null params={qt=/get&ids=31&wt=json} status=0 QTime=0
2> 1838317 INFO (READER4) [] o.a.s.c.S.Request webapp=null path=null params={qt=/get&ids=102&wt=json} status=0 QTime=0
2> 1838317 INFO (READER2) [] o.a.s.c.S.Request webapp=null path=null params={qt=/get&ids=31&wt=json} status=0 QTime=0
2> 1838317 INFO (READER3) [] o.a.s.c.S.Request webapp=null path=null params={q=id:184&omitHeader=true&wt=json} hits=0 status=0 QTime=0
2> 1838317 INFO (READER4) [] o.a.s.c.S.Request webapp=null path=null params={qt=/get&ids=177&wt=json} status=0 QTime=0
2> 1838317 INFO (READER2) [] o.a.s.c.S.Request webapp=null path=null params={qt=/get&ids=24&wt=json} status=0 QTime=0
2> 1838317 INFO (READER4) [] o.a.s.c.S.Request webapp=null path=null params={qt=/get&ids=184&wt=json} status=0 QTime=0
2> 1838317 INFO (READER3) [] o.a.s.c.S.Request webapp=null path=null params={q=id:83&omitHeader=true&wt=json} hits=0 status=0 QTime=0
2> 1838317 INFO (READER2) [] o.a.s.c.S.Request webapp=null path=null params={qt=/get&ids=31&wt=json} status=0 QTime=0
2> 1838317 INFO (READER4) [] o.a.s.c.S.Request webapp=null path=null params={qt=/get&ids=31&wt=json} status=0 QTime=0
2> 1838317 INFO (READER3) [] o.a.s.c.S.Request webapp=null path=null params={qt=/get&ids=110&wt=json} status=0 QTime=0
2> 1838317 INFO (READER2) [] o.a.s.c.S.Request webapp=null path=null params={qt=/get&ids=76&wt=json} status=0 QTime=0
2> 1838317 INFO (READER2) [] o.a.s.c.S.Request webapp=null path=null params={qt=/get&ids=44&wt=json} status=0 QTime=0
2> 1838317 INFO (READER4) [] o.a.s.c.S.Request webapp=null path=null params={qt=/get&ids=31&wt=json} status=0 QTime=0
2> 1838318 INFO (READER3) [] o.a.s.c.S.Request webapp=null path=null params={q=id:138&omitHeader=true&wt=json} hits=0 status=0 QTime=0
2> 1838318 INFO (READER2) [] o.a.s.c.S.Request webapp=null path=null params={qt=/get&ids=31&wt=json} status=0 QTime=0
2> 1838318 INFO (READER3) [] o.a.s.c.S.Request webapp=null path=null params={q=id:112&omitHeader=true&wt=json} hits=0 status=0 QTime=0
2> 1838318 INFO (READER4) [] o.a.s.c.S.Request webapp=null path=null params={q=id:114&omitHeader=true&wt=json} hits=0 status=0 QTime=0
2> 1838318 INFO (READER2) [] o.a.s.c.S.Request webapp=null path=null params={qt=/get&ids=144&wt=json} status=0 QTime=0
2> 1838318 INFO (READER3) [] o.a.s.c.S.Request webapp=null path=null params={qt=/get&ids=3&wt=json} status=0 QTime=0
2> 1838318 INFO (READER4) [] o.a.s.c.S.Request webapp=null path=null params={qt=/get&ids=31&wt=json} status=0 QTime=0
2> 1838318 INFO (READER2) [] o.a.s.c.S.Request webapp=null path=null params={q=id:109&omitHeader=true&wt=json} hits=0 status=0 QTime=0
2> 1838318 INFO (READER3) [] o.a.s.c.S.Request webapp=null path=null params={qt=/get&ids=47&wt=json} status=0 QTime=0
2> 1838318 INFO (READER4) [] o.a.s.c.S.Request webapp=null path=null params={qt=/get&ids=112&wt=json} status=0 QTime=0
2> 1838318 INFO (READER2) [] o.a.s.c.S.Request webapp=null path=null params={qt=/get&ids=176&wt=json} status=0 QTime=0
2> 1838318 INFO (READER3) [] o.a.s.c.S.Request webapp=null path=null params={qt=/get&ids=44&wt=json} status=0 QTime=0
2> 1838318 INFO (READER4) [] o.a.s.c.S.Request webapp=null path=null params={qt=/get&ids=149&wt=json} status=0 QTime=0
2> 1838318 INFO (READER2) [] o.a.s.c.S.Request webapp=null path=null params={q=id:82&omitHeader=true&wt=json} hits=0 status=0 QTime=0
2> 1838318 INFO (READER3) [] o.a.s.c.S.Request webapp=null path=null params={q=id:31&omitHeader=true&wt=json} hits=0 status=0 QTime=0
2> 1838318 INFO (READER4) [] o.a.s.c.S.Request webapp=null path=null params={q=id:41&omitHeader=true&wt=json} hits=0 status=0 QTime=0
2> 1838318 INFO (READER2) [] o.a.s.c.S.Request webapp=null path=null params={qt=/get&ids=176&wt=json} status=0 QTime=0
2> 1838318 INFO (READER3) [] o.a.s.c.S.Request webapp=null path=null params={q=id:31&omitHeader=true&wt=json} hits=0 status=0 QTime=0
2> 1838318 INFO (READER4) [] o.a.s.c.S.Request webapp=null path=null params={q=id:171&omitHeader=true&wt=json} hits=0 status=0 QTime=0
2> 1838318 INFO (READER2) [] o.a.s.c.S.Request webapp=null path=null params={qt=/get&ids=31&wt=json} status=0 QTime=0
2> 1838318 INFO (READER3) [] o.a.s.c.S.Request webapp=null path=null params={qt=/get&ids=137&wt=json} status=0 QTime=0
2> 1838318 INFO (READER2) [] o.a.s.c.S.Request webapp=null path=null params={qt=/get&ids=54&wt=json} status=0 QTime=0
2> 1838318 INFO (READER4) [] o.a.s.c.S.Request webapp=null path=null params={qt=/get&ids=0&wt=json} status=0 QTime=0
2> 1838318 INFO (READER3) [] o.a.s.c.S.Request webapp=null path=null params={qt=/get&ids=86&wt=json} status=0 QTime=0
2> 1838318 INFO (READER2) [] o.a.s.c.S.Request webapp=null path=null params={qt=/get&ids=115&wt=json} status=0 QTime=0
2> 1838318 INFO (READER4) [] o.a.s.c.S.Request webapp=null path=null params={qt=/get&ids=31&wt=json} status=0 QTime=0
2> 1838318 INFO (READER3) [] o.a.s.c.S.Request webapp=null path=null params={qt=/get&ids=109&wt=json} status=0 QTime=0
2> 1838318 INFO (READER2) [] o.a.s.c.S.Request webapp=null path=null params={qt=/get&ids=130&wt=json} status=0 QTime=0
2> 1838318 INFO (READER4) [] o.a.s.c.S.Request webapp=null path=null params={qt=/get&ids=7&wt=json} status=0 QTime=0
2> 1838318 INFO (READER3) [] o.a.s.c.S.Request webapp=null path=null params={qt=/get&ids=63&wt=json} status=0 QTime=0
2> 1838318 INFO (READER2) [] o.a.s.c.S.Request webapp=null path=null params={qt=/get&ids=133&wt=json} status=0 QTime=0
2> 1838318 INFO (READER4) [] o.a.s.c.S.Request webapp=null path=null params={qt=/get&ids=177&wt=json} status=0 QTime=0
2> 1838318 INFO (READER3) [] o.a.s.c.S.Request webapp=null path=null params={qt=/get&ids=132&wt=json} status=0 QTime=0
2> 1838318 INFO (READER2) [] o.a.s.c.S.Request webapp=null path=null params={q=id:9&omitHeader=true&wt=json} hits=0 status=0 QTime=0
2> 1838318 INFO (READER4) [] o.a.s.c.S.Request webapp=null path=null params={q=id:31&omitHeader=true&wt=json} hits=0 status=0 QTime=0
2> 1838318 INFO (READER3) [] o.a.s.c.S.Request webapp=null path=null params={qt=/get&ids=107&wt=json} status=0 QTime=0
2> 1838318 INFO (READER3) [] o.a.s.c.S.Request webapp=null path=null params={qt=/get&ids=31&wt=json} status=0 QTime=0
2> 1838318 INFO (READER4) [] o.a.s.c.S.Request webapp=null path=null params={qt=/get&ids=9&wt=json} status=0 QTime=0
2> 1838318 INFO (READER2) [] o.a.s.c.S.Request webapp=null path=null params={q=id:68&omitHeader=true&wt=json} hits=0 status=0 QTime=0
2> 1838319 INFO (READER4) [] o.a.s.c.S.Request webapp=null path=null params={q=id:48&omitHeader=true&wt=json} hits=0 status=0 QTime=0
2> 1838319 INFO (READER2) [] o.a.s.c.S.Request webapp=null path=null params={q=id:163&omitHeader=true&wt=json} hits=0 status=0 QTime=0
2> 1838319 INFO (READER3) [] o.a.s.c.S.Request webapp=null path=null params={q=id:184&omitHeader=true&wt=json} hits=0 status=0 QTime=0
2> 1838319 INFO (READER4) [] o.a.s.c.S.Request webapp=null path=null params={qt=/get&ids=86&wt=json} status=0 QTime=0
2> 1838319 INFO (READER2) [] o.a.s.c.S.Request webapp=null path=null params={qt=/get&ids=31&wt=json} status=0 QTime=0
2> 1838319 INFO (READER3) [] o.a.s.c.S.Request webapp=null path=null params={q=id:130&omitHeader=true&wt=json} hits=0 status=0 QTime=0
2> 1838319 INFO (READER4) [] o.a.s.c.S.Request webapp=null path=null params={qt=/get&ids=98&wt=json} status=0 QTime=0
2> 1838319 INFO (READER2) [] o.a.s.c.S.Request webapp=null path=null params={qt=/get&ids=35&wt=json} status=0 QTime=0
2> 1838319 INFO (READER3) [] o.a.s.c.S.Request webapp=null path=null params={q=id:181&omitHeader=true&wt=json} hits=0 status=0 QTime=0
2> 1838319 INFO (READER2) [] o.a.s.c.S.Request webapp=null path=null params={qt=/get&ids=31&wt=json} status=0 QTime=0
2> 1838319 INFO (READER4) [] o.a.s.c.S.Request webapp=null path=null params={q=id:4&omitHeader=true&wt=json} hits=0 status=0 QTime=0
2> 1838320 INFO (READER7) [] o.a.s.c.S.Request webapp=null path=null params={q=id:10&omitHeader=true&wt=json} hits=0 status=0 QTime=0
2> 1838315 INFO (READER5) [] o.a.s.c.S.Request webapp=null path=null params={q=id:93&omitHeader=true&wt=json} hits=0 status=0 QTime=0
2> 1838320 INFO (READER7) [] o.a.s.c.S.Request webapp=null path=null params={qt=/get&ids=67&wt=json} status=0 QTime=0
2> 1838320 INFO (READER5) [] o.a.s.c.S.Request webapp=null path=null params={qt=/get&ids=126&wt=json} status=0 QTime=0
2> 1838320 INFO (READER9) [] o.a.s.c.S.Request webapp=null path=null params={q=id:33&omitHeader=true&wt=json} hits=0 status=0 QTime=0
2> 1838320 INFO (READER7) [] o.a.s.c.S.Request webapp=null path=null params={qt=/get&ids=15&wt=json} status=0 QTime=0
2> 1838320 INFO (READER5) [] o.a.s.c.S.Request webapp=null path=null params={qt=/get&ids=88&wt=json} status=0 QTime=0
2> 1838320 INFO (READER5) [] o.a.s.c.S.Request webapp=null path=null params={qt=/get&ids=24&wt=json} status=0 QTime=0
2> 1838320 INFO (READER7) [] o.a.s.c.S.Request webapp=null path=null params={qt=/get&ids=75&wt=json} status=0 QTime=0
2> 1838320 INFO (READER9) [] o.a.s.c.S.Request webapp=null path=null params={qt=/get&ids=135&wt=json} status=0 QTime=0
2> 1838320 INFO (READER5) [] o.a.s.c.S.Request webapp=null path=null params={qt=/get&ids=136&wt=json} status=0 QTime=0
2> 1838320 INFO (READER7) [] o.a.s.c.S.Request webapp=null path=null params={qt=/get&ids=185&wt=json} status=0 QTime=0
2> 1838320 INFO (READER5) [] o.a.s.c.S.Request webapp=null path=null params={qt=/get&ids=165&wt=json} status=0 QTime=0
2> 1838320 INFO (READER7) [] o.a.s.c.S.Request webapp=null path=null params={qt=/get&ids=184&wt=json} status=0 QTime=0
2> 1838320 INFO (READER9) [] o.a.s.c.S.Request webapp=null path=null params={qt=/get&ids=134&wt=json} status=0 QTime=0
2> 1838320 INFO (READER7) [] o.a.s.c.S.Request webapp=null path=null params={q=id:184&omitHeader=true&wt=json} hits=0 status=0 QTime=0
2> 1838320 INFO (READER5) [] o.a.s.c.S.Request webapp=null path=null params={qt=/get&ids=31&wt=json} status=0 QTime=0
2> 1838320 INFO (READER7) [] o.a.s.c.S.Request webapp=null path=null params={qt=/get&ids=171&wt=json} status=0 QTime=0
2> 1838320 INFO (READER9) [] o.a.s.c.S.Request webapp=null path=null params={q=id:31&omitHeader=true&wt=json} hits=0 status=0 QTime=0
2> 1838320 INFO (READER5) [] o.a.s.c.S.Request webapp=null path=null params={qt=/get&ids=31&wt=json} status=0 QTime=0
2> 1838320 INFO (READER9) [] o.a.s.c.S.Request webapp=null path=null params={q=id:15&omitHeader=true&wt=json} hits=0 status=0 QTime=0
2> 1838319 INFO (WRITER4) [] o.a.s.s.TestStressUserVersions VERBOSE: hardCommit start
2> 1838322 INFO (WRITER1) [] o.a.s.c.S.Request webapp=null path=null params={del_version=3&versions=true&wt=json&indent=true} status=0 QTime=25
2> 1838319 INFO (WRITER0) [] o.a.s.c.S.Request webapp=null path=null params={versions=true&wt=json&indent=true} status=0 QTime=24
2> 1838319 INFO (WRITER5) [] o.a.s.s.TestStressUserVersions VERBOSE: hardCommit start
2> 1838322 INFO (WRITER1) [] o.a.s.s.TestStressUserVersions VERBOSE: deleting id 0 val= 2 version 3 DONE
2> 1838322 INFO (WRITER1) [] o.a.s.s.TestStressUserVersions VERBOSE: hardCommit start
2> 1838319 INFO (WRITER6) [] o.a.s.c.S.Request webapp=null path=null params={versions=true&wt=json&indent=true} status=0 QTime=22
2> 1838319 INFO (READER0) [] o.a.s.c.S.Request webapp=null path=null params={q=id:31&omitHeader=true&wt=json} hits=0 status=0 QTime=0
2> 1838319 INFO (READER1) [] o.a.s.c.S.Request webapp=null path=null params={qt=/get&ids=31&wt=json} status=0 QTime=3
2> 1838319 INFO (READER3) [] o.a.s.c.S.Request webapp=null path=null params={q=id:164&omitHeader=true&wt=json} hits=0 status=0 QTime=0
2> 1838323 INFO (READER3) [] o.a.s.c.S.Request webapp=null path=null params={qt=/get&ids=1&wt=json} status=0 QTime=0
2> 1838319 INFO (READER2) [] o.a.s.c.S.Request webapp=null path=null params={qt=/get&ids=19&wt=json} status=0 QTime=0
2> 1838323 INFO (READER9) [] o.a.s.c.S.Request webapp=null path=null params={qt=/get&ids=159&wt=json} status=0 QTime=0
2> 1838324 INFO (WRITER3) [] o.a.s.c.S.Request webapp=null path=null params={versions=true&wt=json&indent=true} status=0 QTime=26
2> 1838324 INFO (READER9) [] o.a.s.c.S.Request webapp=null path=null params={q=id:68&omitHeader=true&wt=json} hits=0 status=0 QTime=0
2> 1838324 INFO (READER9) [] o.a.s.c.S.Request webapp=null path=null params={q=id:132&omitHeader=true&wt=json} hits=0 status=0 QTime=0
2> 1838324 INFO (READER9) [] o.a.s.c.S.Request webapp=null path=null params={q=id:182&omitHeader=true&wt=json} hits=0 status=0 QTime=0
2> 1838324 INFO (READER9) [] o.a.s.c.S.Request webapp=null path=null params={q=id:34&omitHeader=true&wt=json} hits=0 status=0 QTime=0
2> 1838324 INFO (READER9) [] o.a.s.c.S.Request webapp=null path=null params={qt=/get&ids=17&wt=json} status=0 QTime=0
2> 1838325 INFO (READER9) [] o.a.s.c.S.Request webapp=null path=null params={qt=/get&ids=80&wt=json} status=0 QTime=0
2> 1838325 INFO (READER9) [] o.a.s.c.S.Request webapp=null path=null params={qt=/get&ids=94&wt=json} status=0 QTime=0
2> 1838325 INFO (READER9) [] o.a.s.c.S.Request webapp=null path=null params={qt=/get&ids=64&wt=json} status=0 QTime=0
2> 1838325 INFO (READER9) [] o.a.s.c.S.Request webapp=null path=null params={qt=/get&ids=80&wt=json} status=0 QTime=0
2> 1838325 INFO (READER9) [] o.a.s.c.S.Request webapp=null path=null params={q=id:137&omitHeader=true&wt=json} hits=0 status=0 QTime=0
2> 1838325 INFO (READER9) [] o.a.s.c.S.Request webapp=null path=null params={q=id:112&omitHeader=true&wt=json} hits=0 status=0 QTime=0
2> 1838325 INFO (READER9) [] o.a.s.c.S.Request webapp=null path=null params={q=id:6&omitHeader=true&wt=json} hits=0 status=0 QTime=0
2> 1838326 INFO (READER9) [] o.a.s.c.S.Request webapp=null path=null params={qt=/get&ids=80&wt=json} status=0 QTime=0
2> 1838326 INFO (READER9) [] o.a.s.c.S.Request webapp=null path=null params={qt=/get&ids=72&wt=json} status=0 QTime=0
2> 1838326 INFO (READER9) [] o.a.s.c.S.Request webapp=null path=null params={qt=/get&ids=80&wt=json} status=0 QTime=0
2> 1838326 INFO (READER9) [] o.a.s.c.S.Request webapp=null path=null params={qt=/get&ids=80&wt=json} status=0 QTime=0
2> 1838323 INFO (READER8) [] o.a.s.c.S.Request webapp=null path=null params={q=id:68&omitHeader=true&wt=json} hits=0 status=0 QTime=1
2> 1838323 INFO (READER1) [] o.a.s.c.S.Request webapp=null path=null params={qt=/get&ids=80&wt=json} status=0 QTime=0
2> 1838323 INFO (READER10) [] o.a.s.c.S.Request webapp=null path=null params={q=id:184&omitHeader=true&wt=json} hits=0 status=0 QTime=4
2> 1838323 INFO (WRITER6) [] o.a.s.s.TestStressUserVersions VERBOSE: adding id 80 val= 2 version 11
2> 1838323 INFO (WRITER0) [] o.a.s.s.TestStressUserVersions VERBOSE: adding id 80 val= 2 version 10
2> 1838322 INFO (WRITER9) [] o.a.s.c.S.Request webapp=null path=null params={versions=true&wt=json&indent=true} status=0 QTime=22
2> 1838327 INFO (WRITER9) [] o.a.s.s.TestStressUserVersions VERBOSE: adding id 80 val= 2 version 12
2> 1838321 INFO (READER5) [] o.a.s.c.S.Request webapp=null path=null params={q=id:108&omitHeader=true&wt=json} hits=0 status=0 QTime=0
2> 1838328 INFO (searcherExecutor-27202-thread-1-processing-collection1) [ x:collection1] o.a.s.c.SolrCore Registered new searcher autowarm time: 0 ms
2> 1838322 INFO (WRITER10) [] o.a.s.c.S.Request webapp=null path=null params={versions=true&wt=json&indent=true} status=0 QTime=18
2> 1838322 INFO (WRITER2) [] o.a.s.c.S.Request webapp=null path=null params={versions=true&wt=json&indent=true} status=0 QTime=27
2> 1838328 INFO (READER5) [] o.a.s.c.S.Request webapp=null path=null params={qt=/get&ids=101&wt=json} status=0 QTime=0
2> 1838328 INFO (WRITER10) [] o.a.s.s.TestStressUserVersions VERBOSE: deleting id 31 val= 3 version 13
2> 1838328 INFO (WRITER2) [] o.a.s.s.TestStressUserVersions VERBOSE: deleting id 138 val= 2 version 14
2> 1838328 INFO (READER5) [] o.a.s.c.S.Request webapp=null path=null params={q=id:23&omitHeader=true&wt=json} hits=0 status=0 QTime=0
2> 1838328 INFO (READER5) [] o.a.s.c.S.Request webapp=null path=null params={q=id:138&omitHeader=true&wt=json} hits=0 status=0 QTime=0
2> 1838328 INFO (READER5) [] o.a.s.c.S.Request webapp=null path=null params={qt=/get&ids=81&wt=json} status=0 QTime=0
2> 1838328 INFO (WRITER2) [] o.a.s.c.S.Request webapp=null path=null params={del_version=14&versions=true&wt=json&indent=true} status=0 QTime=0
2> 1838328 INFO (WRITER10) [] o.a.s.c.S.Request webapp=null path=null params={del_version=13&versions=true&wt=json&indent=true} status=0 QTime=0
2> 1838328 INFO (WRITER2) [] o.a.s.s.TestStressUserVersions VERBOSE: deleting id 138 val= 2 version 14 DONE
2> 1838328 INFO (WRITER2) [] o.a.s.s.TestStressUserVersions VERBOSE: softCommit start
2> 1838328 INFO (WRITER4) [ x:collection1] o.a.s.c.S.Request webapp=null path=null params={} status=0 QTime=6
2> 1838329 INFO (READER5) [] o.a.s.c.S.Request webapp=null path=null params={qt=/get&ids=138&wt=json} status=0 QTime=0
2> 1838329 INFO (READER5) [] o.a.s.c.S.Request webapp=null path=null params={qt=/get&ids=45&wt=json} status=0 QTime=0
2> 1838329 INFO (READER5) [] o.a.s.c.S.Request webapp=null path=null params={q=id:80&omitHeader=true&wt=json} hits=0 status=0 QTime=0
2> 1838329 INFO (READER5) [] o.a.s.c.S.Request webapp=null path=null params={qt=/get&ids=126&w
[...truncated too long message...]
Test, TestSolrCloudSnapshots, TestDistribPackageStore, CSVRequestHandlerTest, FieldAnalysisRequestHandlerTest, MoreLikeThisHandlerTest, RequestHandlerBaseTest, RequestLoggingTest, TestBlobHandler, TestConfigReload, TestHealthCheckHandlerLegacyMode, TestIncrementalCoreBackup, TestReplicationHandlerBackup, TestReqParamsAPI, TestRestoreCore, TestSnapshotCoreBackup, TestSolrConfigHandlerConcurrent, TestStressThreadBackup, V2ApiIntegrationTest, V2StandaloneTest, XmlUpdateRequestHandlerTest, Core
2> AdminCreateDiscoverTest, CoreAdminHandlerTest, CoreAdminRequestStatusTest, DaemonStreamApiTest, IndexSizeEstimatorTest, LoggingHandlerTest, MBeansHandlerTest, PropertiesRequestHandlerTest, SegmentsInfoRequestHandlerTest, SolrEnvironmentTest, StatsReloadRaceTest, TestApiFramework, TestCoreAdminApis, V2BlobAPIMappingTest, V2CoresAPIMappingTest, ZookeeperReadAPITest, ZookeeperStatusHandlerTest, BalanceShardUniqueAPITest, CoreSnapshotAPITest, CreateCollectionAPITest, CreateReplicaAPITest, DeleteAliasAPITest, DeleteCollectionBackupAPITest, DeleteNodeAPITest, DeleteReplicaPropertyAPITest, ForceLeaderAPITest, GetSchemaFieldsAPITest, ListAliasesAPITest, ReplaceNodeAPITest, SyncShardAPITest, V2CollectionBackupApiTest, V2NodeAPIMappingTest, V2ShardsAPIMappingTest, BadComponentTest, CustomHighlightComponentTest, DistributedDebugComponentTest, DistributedFacetExistsSmallTest, DistributedFacetPivotLongTailTest, DistributedFacetPivotSmallTest, DistributedMLTComponentTest, DistributedQueryComponentOptimizationTest, DistributedSpellCheckComponentTest, DistributedTermsComponentTest, FacetPivotSmallTest, MoreLikeThisComponentTest, QueryComponentPartialResultsTest, ResponseBuilderTest, SearchHandlerAppendsCloudTest, ShardRequestTest, SpellCheckComponentTest, SuggestComponentContextFilterQueryTest, TermVectorComponentDistributedTest, TermsComponentTest, TestExpandComponent, TestPivotHelperCode, UpdateLogCloudTest, ManagedSchemaDiffTest, TestSchemaDesignerConfigSetHelper, TestExportWriter, EmbeddedSolrNoSerializeTest, Tagger2Test, TaggingAttributeTest, FastVectorHighlighterTest, HighlighterMaxOffsetTest, HighlighterWithoutStoredIdTest, TestUnifiedSolrHighlighterWithoutStoredId, WrapperMergePolicyFactoryTest, CSVPrinterTest, CSVUtilsTest, ExtendedBufferedReaderTest, JerseyApplicationSharingTest, TestLegacyField, TestLegacyNumericUtils, TestMultiValuedNumericRangeQuery, TestNumericRangeQuery64, TestLogWatcher, JvmMetricsTest, MetricsDisabledCloudTest, SolrMetricManagerTest, SolrMetricsIntegrationTest, SolrJmxReporterCloudTest, SolrSlf4jReporterTest, TestPackages, SimpleFacetsTest, TestFacetMethods, TestIntervalFaceting, TestSolrRequestInfo, TestUnInvertedFieldException, TestMacroExpander, JSONWriterTest, TestBinaryResponseWriter, TestCustomDocTransformer, TestGraphMLResponseWriter, TestPHPSerializedResponseWriter, TestRawResponseWriter, TestRetrieveFieldsOptimizer, TestChildDocTransformer, TestExplainDocTransformer, TestSubQueryTransformerCrossCore, TestManagedFileStorage, TestManagedResourceStorage, TestBulkSchemaAPI, TestDynamicFieldCollectionResource, TestFieldCollectionResource, TestFieldTypeCollectionResource, TestSchemaNameResource, TestSchemaSimilarityResource, TestSerializedLuceneMatchVersion, TestManagedStopFilterFactory, TestManagedSynonymGraphFilterFactory, BadIndexSchemaTest, ChangedSchemaMergeTest, CurrencyFieldTypeTest, DateRangeFieldTest, DocValuesMissingTest, DocValuesTest, ExternalFileFieldSortTest, IndexSchemaTest, NotRequiredUniqueKeyTest, OpenExchangeRatesOrgProviderTest, PreAnalyzedFieldManagedSchemaCloudTest, PrimitiveFieldTypeTest, RequiredFieldsTest, SchemaApiFailureTest, SynonymTokenizerTest, TestBulkSchemaConcurrent, TestCloudSchemaless, TestCollationFieldDocValues, TestManagedSchemaAPI, TestManagedSchemaWithMultipleAdd, TestPointFields, TestSchemaManager, TestSortableTextField, TestUseDocValuesAsStored, UUIDFieldTest, AnalyticsQueryTest, CursorMarkTest, MaxScoreCollectorTest, QueryEqualityTest, QueryUtilsTest, RankQueryTest, SignificantTermsQParserPluginTest, SortSpecParsingTest, TestAddFieldRealTimeGet, TestCaffeineCache, TestCollapseQParserPlugin, TestComplexPhraseQParserPlugin, TestCoordinatorRole, TestDocSet, TestExtendedDismaxParser, TestFilteredDocIdSet, TestFiltersQueryCaching, TestGraphTermsQParserPlugin, TestIndexSearcher, TestLegacyNumericRangeQueryBuilder, TestMaxScoreQueryParser, TestMissingGroups, TestMultiWordSynonyms, TestOverriddenPrefixQueryForCustomFieldType, TestPayloadScoreQParserPlugin, TestQueryTypes, TestRTGBase, TestRangeQuery, TestRealTimeGet, TestReload, TestSearchPerf, TestSimpleQParserPlug
2> in, TestSolr4Spatial, TestSolrCachePerf, TestSolrFieldCacheBean, TestSolrQueryParser, TestStandardQParsers, TestStressRecovery, TestStressUserVersions]
WARNING: Test org.apache.solr.search.facet.TestJsonFacetRefinement wrote 27,974,114 bytes of output.
> Task :solr:benchmark:test
:solr:benchmark:test (SUCCESS): 11 test(s)
> Task :solr:benchmark:wipeTaskTemp
> Task :solr:prometheus-exporter:processResources NO-SOURCE
> Task :solr:prometheus-exporter:classes
> Task :solr:prometheus-exporter:compileTestJava
Note: /home/jenkins/jenkins-slave/workspace/Solr/Solr-Smoketest-9.3/_tmp/smoke_1692024812/unpack/solr-9.3.1/solr/prometheus-exporter/src/test/org/apache/solr/prometheus/exporter/MetricsQueryTemplateTest.java uses or overrides a deprecated API.
Note: Recompile with -Xlint:deprecation for details.
> Task :solr:prometheus-exporter:processTestResources
> Task :solr:prometheus-exporter:testClasses
> Task :solr:prometheus-exporter:test
:solr:prometheus-exporter:test (SUCCESS): 22 test(s)
> Task :solr:prometheus-exporter:wipeTaskTemp
> Task :solr:server:compileJava SKIPPED
> Task :solr:server:processResources NO-SOURCE
> Task :solr:server:classes UP-TO-DATE
> Task :solr:server:compileTestJava NO-SOURCE
> Task :solr:server:processTestResources NO-SOURCE
> Task :solr:server:testClasses UP-TO-DATE
> Task :solr:server:test NO-SOURCE
> Task :solr:server:wipeTaskTemp
> Task :solr:solr-ref-guide:compileJava NO-SOURCE
> Task :solr:solr-ref-guide:processResources NO-SOURCE
> Task :solr:solr-ref-guide:classes UP-TO-DATE
> Task :solr:solr-ref-guide:compileTestJava
Note: Some input files use or override a deprecated API.
Note: Recompile with -Xlint:deprecation for details.
> Task :solr:solr-ref-guide:copySolrjTestResources
> Task :solr:solr-ref-guide:processTestResources NO-SOURCE
> Task :solr:solr-ref-guide:testClasses
> Task :solr:solr-ref-guide:test
:solr:solr-ref-guide:test (SUCCESS): 32 test(s)
> Task :solr:solr-ref-guide:wipeTaskTemp
> Task :solr:solrj:compileTestJava
Note: Some input files use or override a deprecated API.
Note: Recompile with -Xlint:deprecation for details.
> Task :solr:solrj:processTestResources
> Task :solr:solrj:testClasses
> Task :solr:solrj:test
> Task :solr:core:test
:solr:core:test (FAILURE): 4847 test(s), 1 failure(s), 214 skipped
4847 tests completed, 1 failed, 214 skipped
> Task :solr:core:test FAILED
> Task :solr:core:wipeTaskTemp
> Task :solr:solrj:test
:solr:solrj:test (SUCCESS): 1134 test(s), 40 skipped
> Task :solr:solrj:wipeTaskTemp
ERROR: The following test(s) have failed:
- org.apache.solr.search.TestStressUserVersions.testStressReorderVersions (:solr:core)
Test output: /home/jenkins/jenkins-slave/workspace/Solr/Solr-Smoketest-9.3/_tmp/smoke_1692024812/unpack/solr-9.3.1/solr/core/build/test-results/test/outputs/OUTPUT-org.apache.solr.search.TestStressUserVersions.txt
Reproduce with: gradlew :solr:core:test --tests "org.apache.solr.search.TestStressUserVersions.testStressReorderVersions" -Ptests.jvms=2 "-Ptests.jvmargs=-XX:TieredStopAtLevel=1 -XX:+UseParallelGC -XX:ActiveProcessorCount=1 -XX:ReservedCodeCacheSize=120m" -Ptests.seed=88DB9DF441205B7D -Ptests.badapples=false -Ptests.file.encoding=ISO-8859-1
FAILURE: Build failed with an exception.
* What went wrong:
Execution failed for task ':solr:core:test'.
> There were failing tests. See the results at: file:///home/jenkins/jenkins-slave/workspace/Solr/Solr-Smoketest-9.3/_tmp/smoke_1692024812/unpack/solr-9.3.1/solr/core/build/test-results/test/
* Try:
> Run with --stacktrace option to get the stack trace.
> Run with --info or --debug option to get more log output.
* Get more help at https://help.gradle.org
BUILD FAILED in 40m 37s
44 actionable tasks: 31 executed, 13 up-to-date
Publishing build scan...
https://ge.apache.org/s/kfftlpbhlow6o
Traceback (most recent call last):
File "dev-tools/scripts/smokeTestRelease.py", line 1174, in <module>
main()
File "dev-tools/scripts/smokeTestRelease.py", line 1100, in main
smokeTest(c.java, c.url, c.revision, c.version, c.tmp_dir, c.is_signed, c.local_keys, ' '.join(c.test_args),
File "dev-tools/scripts/smokeTestRelease.py", line 1162, in smokeTest
unpackAndVerify(java, tmpDir, 'solr-%s-src.tgz' % version, gitRevision, version, testArgs)
File "dev-tools/scripts/smokeTestRelease.py", line 553, in unpackAndVerify
verifyUnpacked(java, artifact, unpackPath, gitRevision, version, testArgs)
File "dev-tools/scripts/smokeTestRelease.py", line 644, in verifyUnpacked
java.run_java11('./gradlew --no-daemon test %s' % testArgs, '%s/test.log' % unpackPath)
File "dev-tools/scripts/smokeTestRelease.py", line 1010, in run_java
run('%s; %s' % (cmd_prefix, cmd), logfile)
File "dev-tools/scripts/smokeTestRelease.py", line 483, in run
raise RuntimeError('command "%s" failed; see log file %s' % (command, logPath))
RuntimeError: command "export JAVA_HOME="/home/jenkins/tools/java/latest11" PATH="/home/jenkins/tools/java/latest11/bin:$PATH" JAVACMD="/home/jenkins/tools/java/latest11/bin/java"; ./gradlew --no-daemon test -Dtests.nightly=false -Dtests.badapples=false " failed; see log file /home/jenkins/jenkins-slave/workspace/Solr/Solr-Smoketest-9.3/_tmp/smoke_1692024812/unpack/solr-9.3.1/test.log
Build step 'Run with timeout' marked build as failure
Email was triggered for: Failure - Any
Sending email for trigger: Failure - Any