You are viewing a plain text version of this content. The canonical link for it is here.
Posted to yarn-dev@hadoop.apache.org by Apache Jenkins Server <je...@builds.apache.org> on 2013/07/27 04:43:47 UTC
Failed: YARN-934 PreCommit Build #1597
Jira: https://issues.apache.org/jira/browse/YARN-934
Build: https://builds.apache.org/job/PreCommit-YARN-Build/1597/
###################################################################################
########################## LAST 60 LINES OF THE CONSOLE ###########################
[...truncated 2603 lines...]
NOP
{color:red}-1 overall{color}. Here are the results of testing the latest attachment
http://issues.apache.org/jira/secure/attachment/12594508/YARN-934.3.patch
against trunk revision .
{color:green}+1 @author{color}. The patch does not contain any @author tags.
{color:red}-1 tests included{color}. The patch doesn't appear to include any new or modified tests.
Please justify why no new tests are needed for this patch.
Also please list what manual steps were performed to verify this patch.
{color:green}+1 javac{color}. The applied patch does not increase the total number of javac compiler warnings.
{color:green}+1 javadoc{color}. The javadoc tool did not generate any warning messages.
{color:green}+1 eclipse:eclipse{color}. The patch built with eclipse:eclipse.
{color:green}+1 findbugs{color}. The patch does not introduce any new Findbugs (version 1.3.9) warnings.
{color:green}+1 release audit{color}. The applied patch does not increase the total number of release audit warnings.
{color:green}+1 core tests{color}. The patch passed unit tests in .
{color:green}+1 contrib tests{color}. The patch passed contrib unit tests.
Test results: https://builds.apache.org/job/PreCommit-YARN-Build/1597//testReport/
Console output: https://builds.apache.org/job/PreCommit-YARN-Build/1597//console
This message is automatically generated.
======================================================================
======================================================================
Adding comment to Jira.
======================================================================
======================================================================
Comment added.
22ea0d1566b4863dd36305496d2cfff0a651c66f logged out
======================================================================
======================================================================
Finished build.
======================================================================
======================================================================
Build step 'Execute shell' marked build as failure
Archiving artifacts
[description-setter] Could not determine description.
Recording test results
Email was triggered for: Failure
Sending email for trigger: Failure
###################################################################################
############################## FAILED TESTS (if any) ##############################
No tests ran.
Success: YARN-961 PreCommit Build #1606
Posted by Apache Jenkins Server <je...@builds.apache.org>.
Jira: https://issues.apache.org/jira/browse/YARN-961
Build: https://builds.apache.org/job/PreCommit-YARN-Build/1606/
###################################################################################
########################## LAST 60 LINES OF THE CONSOLE ###########################
[...truncated 3135 lines...]
/bin/kill -9 2561
kill: No such process
NOP
{color:green}+1 overall{color}. Here are the results of testing the latest attachment
http://issues.apache.org/jira/secure/attachment/12594773/YARN-961-20130729.1.patch
against trunk revision .
{color:green}+1 @author{color}. The patch does not contain any @author tags.
{color:green}+1 tests included{color}. The patch appears to include 2 new or modified test files.
{color:green}+1 javac{color}. The applied patch does not increase the total number of javac compiler warnings.
{color:green}+1 javadoc{color}. The javadoc tool did not generate any warning messages.
{color:green}+1 eclipse:eclipse{color}. The patch built with eclipse:eclipse.
{color:green}+1 findbugs{color}. The patch does not introduce any new Findbugs (version 1.3.9) warnings.
{color:green}+1 release audit{color}. The applied patch does not increase the total number of release audit warnings.
{color:green}+1 core tests{color}. The patch passed unit tests in hadoop-yarn-project/hadoop-yarn/hadoop-yarn-server/hadoop-yarn-server-nodemanager hadoop-yarn-project/hadoop-yarn/hadoop-yarn-server/hadoop-yarn-server-resourcemanager hadoop-yarn-project/hadoop-yarn/hadoop-yarn-server/hadoop-yarn-server-tests.
{color:green}+1 contrib tests{color}. The patch passed contrib unit tests.
Test results: https://builds.apache.org/job/PreCommit-YARN-Build/1606//testReport/
Console output: https://builds.apache.org/job/PreCommit-YARN-Build/1606//console
This message is automatically generated.
======================================================================
======================================================================
Adding comment to Jira.
======================================================================
======================================================================
Comment added.
5c3653ed0cff3d4b21c3e174d0133a32bf3cea72 logged out
======================================================================
======================================================================
Finished build.
======================================================================
======================================================================
Archiving artifacts
Description set: YARN-961
Recording test results
Email was triggered for: Success
Sending email for trigger: Success
###################################################################################
############################## FAILED TESTS (if any) ##############################
All tests passed
Failed: YARN-948 PreCommit Build #1605
Posted by Apache Jenkins Server <je...@builds.apache.org>.
Jira: https://issues.apache.org/jira/browse/YARN-948
Build: https://builds.apache.org/job/PreCommit-YARN-Build/1605/
###################################################################################
########################## LAST 60 LINES OF THE CONSOLE ###########################
[...truncated 2894 lines...]
NOP
{color:red}-1 overall{color}. Here are the results of testing the latest attachment
http://issues.apache.org/jira/secure/attachment/12594776/YARN-948-20130729.1.patch
against trunk revision .
{color:green}+1 @author{color}. The patch does not contain any @author tags.
{color:green}+1 tests included{color}. The patch appears to include 2 new or modified test files.
{color:green}+1 javac{color}. The applied patch does not increase the total number of javac compiler warnings.
{color:green}+1 javadoc{color}. The javadoc tool did not generate any warning messages.
{color:green}+1 eclipse:eclipse{color}. The patch built with eclipse:eclipse.
{color:green}+1 findbugs{color}. The patch does not introduce any new Findbugs (version 1.3.9) warnings.
{color:green}+1 release audit{color}. The applied patch does not increase the total number of release audit warnings.
{color:red}-1 core tests{color}. The patch failed these unit tests in hadoop-yarn-project/hadoop-yarn/hadoop-yarn-api hadoop-yarn-project/hadoop-yarn/hadoop-yarn-server/hadoop-yarn-server-resourcemanager:
org.apache.hadoop.yarn.server.resourcemanager.TestAMAuthorization
{color:green}+1 contrib tests{color}. The patch passed contrib unit tests.
Test results: https://builds.apache.org/job/PreCommit-YARN-Build/1605//testReport/
Console output: https://builds.apache.org/job/PreCommit-YARN-Build/1605//console
This message is automatically generated.
======================================================================
======================================================================
Adding comment to Jira.
======================================================================
======================================================================
Comment added.
e3e677edba7d9fe970222ea4d4e392fbc94ad9a4 logged out
======================================================================
======================================================================
Finished build.
======================================================================
======================================================================
Build step 'Execute shell' marked build as failure
Archiving artifacts
[description-setter] Could not determine description.
Recording test results
Email was triggered for: Failure
Sending email for trigger: Failure
###################################################################################
############################## FAILED TESTS (if any) ##############################
1 tests failed.
FAILED: org.apache.hadoop.yarn.server.resourcemanager.TestAMAuthorization.testUnauthorizedAccess[1]
Error Message:
null
Stack Trace:
java.lang.AssertionError
at org.junit.Assert.fail(Assert.java:92)
at org.junit.Assert.assertTrue(Assert.java:43)
at org.junit.Assert.assertTrue(Assert.java:54)
at org.apache.hadoop.yarn.server.resourcemanager.TestAMAuthorization.testUnauthorizedAccess(TestAMAuthorization.java:262)
at sun.reflect.NativeMethodAccessorImpl.invoke0(Native Method)
at sun.reflect.NativeMethodAccessorImpl.invoke(NativeMethodAccessorImpl.java:39)
at sun.reflect.DelegatingMethodAccessorImpl.invoke(DelegatingMethodAccessorImpl.java:25)
at java.lang.reflect.Method.invoke(Method.java:597)
at org.junit.runners.model.FrameworkMethod$1.runReflectiveCall(FrameworkMethod.java:45)
at org.junit.internal.runners.model.ReflectiveCallable.run(ReflectiveCallable.java:15)
at org.junit.runners.model.FrameworkMethod.invokeExplosively(FrameworkMethod.java:42)
at org.junit.internal.runners.statements.InvokeMethod.evaluate(InvokeMethod.java:20)
at org.junit.internal.runners.statements.RunAfters.evaluate(RunAfters.java:30)
at org.junit.runners.ParentRunner.runLeaf(ParentRunner.java:263)
at org.junit.runners.BlockJUnit4ClassRunner.runChild(BlockJUnit4ClassRunner.java:68)
at org.junit.runners.BlockJUnit4ClassRunner.runChild(BlockJUnit4ClassRunner.java:47)
at org.junit.runners.ParentRunner$3.run(ParentRunner.java:231)
at org.junit.runners.ParentRunner$1.schedule(ParentRunner.java:60)
at org.junit.runners.ParentRunner.runChildren(ParentRunner.java:229)
at org.junit.runners.ParentRunner.access$000(ParentRunner.java:50)
at org.junit.runners.ParentRunner$2.evaluate(ParentRunner.java:222)
at org.junit.runners.ParentRunner.run(ParentRunner.java:300)
at org.junit.runners.Suite.runChild(Suite.java:128)
at org.junit.runners.Suite.runChild(Suite.java:24)
at org.junit.runners.ParentRunner$3.run(ParentRunner.java:231)
at org.junit.runners.ParentRunner$1.schedule(ParentRunner.java:60)
at org.junit.runners.ParentRunner.runChildren(ParentRunner.java:229)
at org.junit.runners.ParentRunner.access$000(ParentRunner.java:50)
at org.junit.runners.ParentRunner$2.evaluate(ParentRunner.java:222)
at org.junit.runners.ParentRunner.run(ParentRunner.java:300)
at org.apache.maven.surefire.junit4.JUnit4Provider.execute(JUnit4Provider.java:252)
at org.apache.maven.surefire.junit4.JUnit4Provider.executeTestSet(JUnit4Provider.java:141)
at org.apache.maven.surefire.junit4.JUnit4Provider.invoke(JUnit4Provider.java:112)
at sun.reflect.NativeMethodAccessorImpl.invoke0(Native Method)
at sun.reflect.NativeMethodAccessorImpl.invoke(NativeMethodAccessorImpl.java:39)
at sun.reflect.DelegatingMethodAccessorImpl.invoke(DelegatingMethodAccessorImpl.java:25)
at java.lang.reflect.Method.invoke(Method.java:597)
at org.apache.maven.surefire.util.ReflectionUtils.invokeMethodWithArray(ReflectionUtils.java:189)
at org.apache.maven.surefire.booter.ProviderFactory$ProviderProxy.invoke(ProviderFactory.java:165)
at org.apache.maven.surefire.booter.ProviderFactory.invokeProvider(ProviderFactory.java:85)
at org.apache.maven.surefire.booter.ForkedBooter.runSuitesInProcess(ForkedBooter.java:115)
at org.apache.maven.surefire.booter.ForkedBooter.main(ForkedBooter.java:75)
Failed: YARN-956 PreCommit Build #1604
Posted by Apache Jenkins Server <je...@builds.apache.org>.
Jira: https://issues.apache.org/jira/browse/YARN-956
Build: https://builds.apache.org/job/PreCommit-YARN-Build/1604/
###################################################################################
########################## LAST 60 LINES OF THE CONSOLE ###########################
[...truncated 2605 lines...]
{color:red}-1 overall{color}. Here are the results of testing the latest attachment
http://issues.apache.org/jira/secure/attachment/12594748/YARN-956-1.patch
against trunk revision .
{color:green}+1 @author{color}. The patch does not contain any @author tags.
{color:red}-1 tests included{color}. The patch doesn't appear to include any new or modified tests.
Please justify why no new tests are needed for this patch.
Also please list what manual steps were performed to verify this patch.
{color:green}+1 javac{color}. The applied patch does not increase the total number of javac compiler warnings.
{color:green}+1 javadoc{color}. The javadoc tool did not generate any warning messages.
{color:green}+1 eclipse:eclipse{color}. The patch built with eclipse:eclipse.
{color:green}+1 findbugs{color}. The patch does not introduce any new Findbugs (version 1.3.9) warnings.
{color:red}-1 release audit{color}. The applied patch generated 1 release audit warnings.
{color:green}+1 core tests{color}. The patch passed unit tests in .
{color:green}+1 contrib tests{color}. The patch passed contrib unit tests.
Test results: https://builds.apache.org/job/PreCommit-YARN-Build/1604//testReport/
Release audit warnings: https://builds.apache.org/job/PreCommit-YARN-Build/1604//artifact/trunk/patchprocess/patchReleaseAuditProblems.txt
Console output: https://builds.apache.org/job/PreCommit-YARN-Build/1604//console
This message is automatically generated.
======================================================================
======================================================================
Adding comment to Jira.
======================================================================
======================================================================
Comment added.
7f02d6be0e22937e528b25ea5cf05053d5c9c694 logged out
======================================================================
======================================================================
Finished build.
======================================================================
======================================================================
Build step 'Execute shell' marked build as failure
Archiving artifacts
[description-setter] Could not determine description.
Recording test results
Email was triggered for: Failure
Sending email for trigger: Failure
###################################################################################
############################## FAILED TESTS (if any) ##############################
No tests ran.
Failed: YARN-945 PreCommit Build #1603
Posted by Apache Jenkins Server <je...@builds.apache.org>.
Jira: https://issues.apache.org/jira/browse/YARN-945
Build: https://builds.apache.org/job/PreCommit-YARN-Build/1603/
###################################################################################
########################## LAST 60 LINES OF THE CONSOLE ###########################
[...truncated 3258 lines...]
{color:red}-1 overall{color}. Here are the results of testing the latest attachment
http://issues.apache.org/jira/secure/attachment/12594734/YARN-945-20130729.txt
against trunk revision .
{color:green}+1 @author{color}. The patch does not contain any @author tags.
{color:green}+1 tests included{color}. The patch appears to include 5 new or modified test files.
{color:green}+1 javac{color}. The applied patch does not increase the total number of javac compiler warnings.
{color:green}+1 javadoc{color}. The javadoc tool did not generate any warning messages.
{color:green}+1 eclipse:eclipse{color}. The patch built with eclipse:eclipse.
{color:green}+1 findbugs{color}. The patch does not introduce any new Findbugs (version 1.3.9) warnings.
{color:green}+1 release audit{color}. The applied patch does not increase the total number of release audit warnings.
{color:red}-1 core tests{color}. The patch failed these unit tests in hadoop-yarn-project/hadoop-yarn/hadoop-yarn-applications/hadoop-yarn-applications-unmanaged-am-launcher hadoop-yarn-project/hadoop-yarn/hadoop-yarn-client hadoop-yarn-project/hadoop-yarn/hadoop-yarn-common hadoop-yarn-project/hadoop-yarn/hadoop-yarn-server/hadoop-yarn-server-common hadoop-yarn-project/hadoop-yarn/hadoop-yarn-server/hadoop-yarn-server-resourcemanager:
org.apache.hadoop.yarn.client.api.impl.TestNMClient
org.apache.hadoop.yarn.server.resourcemanager.TestAMAuthorization
{color:green}+1 contrib tests{color}. The patch passed contrib unit tests.
Test results: https://builds.apache.org/job/PreCommit-YARN-Build/1603//testReport/
Console output: https://builds.apache.org/job/PreCommit-YARN-Build/1603//console
This message is automatically generated.
======================================================================
======================================================================
Adding comment to Jira.
======================================================================
======================================================================
Comment added.
816d05157bf9be102d71a18b52dd1219112250e7 logged out
======================================================================
======================================================================
Finished build.
======================================================================
======================================================================
Build step 'Execute shell' marked build as failure
Archiving artifacts
[description-setter] Could not determine description.
Recording test results
Email was triggered for: Failure
Sending email for trigger: Failure
###################################################################################
############################## FAILED TESTS (if any) ##############################
2 tests failed.
FAILED: org.apache.hadoop.yarn.client.api.impl.TestNMClient.testNMClientNoCleanupOnStop
Error Message:
test timed out after 180000 milliseconds
Stack Trace:
java.lang.Exception: test timed out after 180000 milliseconds
at java.lang.Throwable.getStackTraceElement(Native Method)
at java.lang.Throwable.getOurStackTrace(Throwable.java:591)
at java.lang.Throwable.printStackTrace(Throwable.java:462)
at java.lang.Throwable.printStackTrace(Throwable.java:451)
at org.apache.hadoop.yarn.client.api.impl.TestNMClient.testGetContainerStatus(TestNMClient.java:365)
at org.apache.hadoop.yarn.client.api.impl.TestNMClient.testContainerManagement(TestNMClient.java:333)
at org.apache.hadoop.yarn.client.api.impl.TestNMClient.testNMClientNoCleanupOnStop(TestNMClient.java:198)
at sun.reflect.NativeMethodAccessorImpl.invoke0(Native Method)
at sun.reflect.NativeMethodAccessorImpl.invoke(NativeMethodAccessorImpl.java:39)
at sun.reflect.DelegatingMethodAccessorImpl.invoke(DelegatingMethodAccessorImpl.java:25)
at java.lang.reflect.Method.invoke(Method.java:597)
at org.junit.runners.model.FrameworkMethod$1.runReflectiveCall(FrameworkMethod.java:45)
at org.junit.internal.runners.model.ReflectiveCallable.run(ReflectiveCallable.java:15)
at org.junit.runners.model.FrameworkMethod.invokeExplosively(FrameworkMethod.java:42)
at org.junit.internal.runners.statements.InvokeMethod.evaluate(InvokeMethod.java:20)
at org.junit.internal.runners.statements.FailOnTimeout$StatementThread.run(FailOnTimeout.java:62)
FAILED: org.apache.hadoop.yarn.server.resourcemanager.TestAMAuthorization.testUnauthorizedAccess[1]
Error Message:
null
Stack Trace:
java.lang.AssertionError
at org.junit.Assert.fail(Assert.java:92)
at org.junit.Assert.assertTrue(Assert.java:43)
at org.junit.Assert.assertTrue(Assert.java:54)
at org.apache.hadoop.yarn.server.resourcemanager.TestAMAuthorization.testUnauthorizedAccess(TestAMAuthorization.java:283)
at sun.reflect.NativeMethodAccessorImpl.invoke0(Native Method)
at sun.reflect.NativeMethodAccessorImpl.invoke(NativeMethodAccessorImpl.java:39)
at sun.reflect.DelegatingMethodAccessorImpl.invoke(DelegatingMethodAccessorImpl.java:25)
at java.lang.reflect.Method.invoke(Method.java:597)
at org.junit.runners.model.FrameworkMethod$1.runReflectiveCall(FrameworkMethod.java:45)
at org.junit.internal.runners.model.ReflectiveCallable.run(ReflectiveCallable.java:15)
at org.junit.runners.model.FrameworkMethod.invokeExplosively(FrameworkMethod.java:42)
at org.junit.internal.runners.statements.InvokeMethod.evaluate(InvokeMethod.java:20)
at org.junit.internal.runners.statements.RunAfters.evaluate(RunAfters.java:30)
at org.junit.runners.ParentRunner.runLeaf(ParentRunner.java:263)
at org.junit.runners.BlockJUnit4ClassRunner.runChild(BlockJUnit4ClassRunner.java:68)
at org.junit.runners.BlockJUnit4ClassRunner.runChild(BlockJUnit4ClassRunner.java:47)
at org.junit.runners.ParentRunner$3.run(ParentRunner.java:231)
at org.junit.runners.ParentRunner$1.schedule(ParentRunner.java:60)
at org.junit.runners.ParentRunner.runChildren(ParentRunner.java:229)
at org.junit.runners.ParentRunner.access$000(ParentRunner.java:50)
at org.junit.runners.ParentRunner$2.evaluate(ParentRunner.java:222)
at org.junit.runners.ParentRunner.run(ParentRunner.java:300)
at org.junit.runners.Suite.runChild(Suite.java:128)
at org.junit.runners.Suite.runChild(Suite.java:24)
at org.junit.runners.ParentRunner$3.run(ParentRunner.java:231)
at org.junit.runners.ParentRunner$1.schedule(ParentRunner.java:60)
at org.junit.runners.ParentRunner.runChildren(ParentRunner.java:229)
at org.junit.runners.ParentRunner.access$000(ParentRunner.java:50)
at org.junit.runners.ParentRunner$2.evaluate(ParentRunner.java:222)
at org.junit.runners.ParentRunner.run(ParentRunner.java:300)
at org.apache.maven.surefire.junit4.JUnit4Provider.execute(JUnit4Provider.java:252)
at org.apache.maven.surefire.junit4.JUnit4Provider.executeTestSet(JUnit4Provider.java:141)
at org.apache.maven.surefire.junit4.JUnit4Provider.invoke(JUnit4Provider.java:112)
at sun.reflect.NativeMethodAccessorImpl.invoke0(Native Method)
at sun.reflect.NativeMethodAccessorImpl.invoke(NativeMethodAccessorImpl.java:39)
at sun.reflect.DelegatingMethodAccessorImpl.invoke(DelegatingMethodAccessorImpl.java:25)
at java.lang.reflect.Method.invoke(Method.java:597)
at org.apache.maven.surefire.util.ReflectionUtils.invokeMethodWithArray(ReflectionUtils.java:189)
at org.apache.maven.surefire.booter.ProviderFactory$ProviderProxy.invoke(ProviderFactory.java:165)
at org.apache.maven.surefire.booter.ProviderFactory.invokeProvider(ProviderFactory.java:85)
at org.apache.maven.surefire.booter.ForkedBooter.runSuitesInProcess(ForkedBooter.java:115)
at org.apache.maven.surefire.booter.ForkedBooter.main(ForkedBooter.java:75)
Failed: YARN-985 PreCommit Build #1602
Posted by Apache Jenkins Server <je...@builds.apache.org>.
Jira: https://issues.apache.org/jira/browse/YARN-985
Build: https://builds.apache.org/job/PreCommit-YARN-Build/1602/
###################################################################################
########################## LAST 60 LINES OF THE CONSOLE ###########################
[...truncated 2859 lines...]
NOP
{color:red}-1 overall{color}. Here are the results of testing the latest attachment
http://issues.apache.org/jira/secure/attachment/12594726/YARN-985.patch
against trunk revision .
{color:green}+1 @author{color}. The patch does not contain any @author tags.
{color:red}-1 tests included{color}. The patch doesn't appear to include any new or modified tests.
Please justify why no new tests are needed for this patch.
Also please list what manual steps were performed to verify this patch.
{color:green}+1 javac{color}. The applied patch does not increase the total number of javac compiler warnings.
{color:green}+1 javadoc{color}. The javadoc tool did not generate any warning messages.
{color:green}+1 eclipse:eclipse{color}. The patch built with eclipse:eclipse.
{color:green}+1 findbugs{color}. The patch does not introduce any new Findbugs (version 1.3.9) warnings.
{color:green}+1 release audit{color}. The applied patch does not increase the total number of release audit warnings.
{color:green}+1 core tests{color}. The patch passed unit tests in hadoop-yarn-project/hadoop-yarn/hadoop-yarn-server/hadoop-yarn-server-nodemanager.
{color:green}+1 contrib tests{color}. The patch passed contrib unit tests.
Test results: https://builds.apache.org/job/PreCommit-YARN-Build/1602//testReport/
Console output: https://builds.apache.org/job/PreCommit-YARN-Build/1602//console
This message is automatically generated.
======================================================================
======================================================================
Adding comment to Jira.
======================================================================
======================================================================
Comment added.
3244f161f1c5bf71388a20e826b877ff10f7f3ef logged out
======================================================================
======================================================================
Finished build.
======================================================================
======================================================================
Build step 'Execute shell' marked build as failure
Archiving artifacts
[description-setter] Could not determine description.
Recording test results
Email was triggered for: Failure
Sending email for trigger: Failure
###################################################################################
############################## FAILED TESTS (if any) ##############################
All tests passed
Failed: YARN-984 PreCommit Build #1601
Posted by Apache Jenkins Server <je...@builds.apache.org>.
Jira: https://issues.apache.org/jira/browse/YARN-984
Build: https://builds.apache.org/job/PreCommit-YARN-Build/1601/
###################################################################################
########################## LAST 60 LINES OF THE CONSOLE ###########################
[...truncated 9 lines...]
no change for http://svn.apache.org/repos/asf/hadoop/nightly since the previous build
No emails were triggered.
[PreCommit-YARN-Build] $ /bin/bash /tmp/hudson1184054609067725920.sh
60000
Running in Jenkins mode
======================================================================
======================================================================
Testing patch for YARN-984.
======================================================================
======================================================================
At revision 1508041.
YARN-984 patch is being downloaded at Mon Jul 29 13:02:58 UTC 2013 from
http://issues.apache.org/jira/secure/attachment/12594685/YARN-984-1.patch
cp: cannot stat `/home/jenkins/buildSupport/lib/*': No such file or directory
The patch does not appear to apply with p0 to p2
PATCH APPLICATION FAILED
{color:red}-1 overall{color}. Here are the results of testing the latest attachment
http://issues.apache.org/jira/secure/attachment/12594685/YARN-984-1.patch
against trunk revision .
{color:red}-1 patch{color}. The patch command could not apply the patch.
Console output: https://builds.apache.org/job/PreCommit-YARN-Build/1601//console
This message is automatically generated.
======================================================================
======================================================================
Adding comment to Jira.
======================================================================
======================================================================
Comment added.
31760e39093f1eeff1c799b987d6cfbec8b2ebb6 logged out
======================================================================
======================================================================
Finished build.
======================================================================
======================================================================
Build step 'Execute shell' marked build as failure
Archiving artifacts
[description-setter] Could not determine description.
Recording test results
Email was triggered for: Failure
Sending email for trigger: Failure
###################################################################################
############################## FAILED TESTS (if any) ##############################
No tests ran.
Failed: YARN-954 PreCommit Build #1600
Posted by Apache Jenkins Server <je...@builds.apache.org>.
Jira: https://issues.apache.org/jira/browse/YARN-954
Build: https://builds.apache.org/job/PreCommit-YARN-Build/1600/
###################################################################################
########################## LAST 60 LINES OF THE CONSOLE ###########################
[...truncated 110 lines...]
no change for http://svn.apache.org/repos/asf/hadoop/nightly since the previous build
No emails were triggered.
[PreCommit-YARN-Build] $ /bin/bash /tmp/hudson1529070519447627790.sh
60000
Running in Jenkins mode
======================================================================
======================================================================
Testing patch for YARN-954.
======================================================================
======================================================================
At revision 1508041.
YARN-954 patch is being downloaded at Mon Jul 29 13:02:36 UTC 2013 from
http://issues.apache.org/jira/secure/attachment/12594686/YARN-954-v0.patch
cp: cannot stat `/home/jenkins/buildSupport/lib/*': No such file or directory
The patch does not appear to apply with p0 to p2
PATCH APPLICATION FAILED
{color:red}-1 overall{color}. Here are the results of testing the latest attachment
http://issues.apache.org/jira/secure/attachment/12594686/YARN-954-v0.patch
against trunk revision .
{color:red}-1 patch{color}. The patch command could not apply the patch.
Console output: https://builds.apache.org/job/PreCommit-YARN-Build/1600//console
This message is automatically generated.
======================================================================
======================================================================
Adding comment to Jira.
======================================================================
======================================================================
Comment added.
5c08a7edc7ca6f14ab8d955004eb8341d04d5142 logged out
======================================================================
======================================================================
Finished build.
======================================================================
======================================================================
Build step 'Execute shell' marked build as failure
Archiving artifacts
[description-setter] Could not determine description.
Recording test results
Email was triggered for: Failure
Sending email for trigger: Failure
###################################################################################
############################## FAILED TESTS (if any) ##############################
No tests ran.
Failed: YARN-984 PreCommit Build #1599
Posted by Apache Jenkins Server <je...@builds.apache.org>.
Jira: https://issues.apache.org/jira/browse/YARN-984
Build: https://builds.apache.org/job/PreCommit-YARN-Build/1599/
###################################################################################
########################## LAST 60 LINES OF THE CONSOLE ###########################
[...truncated 9 lines...]
no change for http://svn.apache.org/repos/asf/hadoop/nightly since the previous build
No emails were triggered.
[PreCommit-YARN-Build] $ /bin/bash /tmp/hudson8726158885188483918.sh
32768
Running in Jenkins mode
======================================================================
======================================================================
Testing patch for YARN-984.
======================================================================
======================================================================
At revision 1507884.
YARN-984 patch is being downloaded at Mon Jul 29 02:41:29 UTC 2013 from
http://issues.apache.org/jira/secure/attachment/12594623/YARN-984.patch
cp: cannot stat `/home/jenkins/buildSupport/lib/*': No such file or directory
The patch does not appear to apply with p0 to p2
PATCH APPLICATION FAILED
{color:red}-1 overall{color}. Here are the results of testing the latest attachment
http://issues.apache.org/jira/secure/attachment/12594623/YARN-984.patch
against trunk revision .
{color:red}-1 patch{color}. The patch command could not apply the patch.
Console output: https://builds.apache.org/job/PreCommit-YARN-Build/1599//console
This message is automatically generated.
======================================================================
======================================================================
Adding comment to Jira.
======================================================================
======================================================================
Comment added.
47cd55d20c5dce5b72f94f3d409a0cd190ac740c logged out
======================================================================
======================================================================
Finished build.
======================================================================
======================================================================
Build step 'Execute shell' marked build as failure
Archiving artifacts
[description-setter] Could not determine description.
Recording test results
Email was triggered for: Failure
Sending email for trigger: Failure
###################################################################################
############################## FAILED TESTS (if any) ##############################
No tests ran.
Failed: YARN-945 PreCommit Build #1598
Posted by Apache Jenkins Server <je...@builds.apache.org>.
Jira: https://issues.apache.org/jira/browse/YARN-945
Build: https://builds.apache.org/job/PreCommit-YARN-Build/1598/
###################################################################################
########################## LAST 60 LINES OF THE CONSOLE ###########################
[...truncated 3160 lines...]
NOP
{color:red}-1 overall{color}. Here are the results of testing the latest attachment
http://issues.apache.org/jira/secure/attachment/12594608/YARN-945-20130728.txt
against trunk revision .
{color:green}+1 @author{color}. The patch does not contain any @author tags.
{color:green}+1 tests included{color}. The patch appears to include 5 new or modified test files.
{color:green}+1 javac{color}. The applied patch does not increase the total number of javac compiler warnings.
{color:green}+1 javadoc{color}. The javadoc tool did not generate any warning messages.
{color:green}+1 eclipse:eclipse{color}. The patch built with eclipse:eclipse.
{color:green}+1 findbugs{color}. The patch does not introduce any new Findbugs (version 1.3.9) warnings.
{color:green}+1 release audit{color}. The applied patch does not increase the total number of release audit warnings.
{color:red}-1 core tests{color}. The patch failed these unit tests in hadoop-yarn-project/hadoop-yarn/hadoop-yarn-client hadoop-yarn-project/hadoop-yarn/hadoop-yarn-common hadoop-yarn-project/hadoop-yarn/hadoop-yarn-server/hadoop-yarn-server-common hadoop-yarn-project/hadoop-yarn/hadoop-yarn-server/hadoop-yarn-server-resourcemanager:
org.apache.hadoop.yarn.client.api.impl.TestNMClient
{color:green}+1 contrib tests{color}. The patch passed contrib unit tests.
Test results: https://builds.apache.org/job/PreCommit-YARN-Build/1598//testReport/
Console output: https://builds.apache.org/job/PreCommit-YARN-Build/1598//console
This message is automatically generated.
======================================================================
======================================================================
Adding comment to Jira.
======================================================================
======================================================================
Comment added.
9d07e4f8132f49be0aea9bdd5527bf6ce5958a61 logged out
======================================================================
======================================================================
Finished build.
======================================================================
======================================================================
Build step 'Execute shell' marked build as failure
Archiving artifacts
[description-setter] Could not determine description.
Recording test results
Email was triggered for: Failure
Sending email for trigger: Failure
###################################################################################
############################## FAILED TESTS (if any) ##############################
1 tests failed.
FAILED: org.apache.hadoop.yarn.client.api.impl.TestNMClient.testNMClientNoCleanupOnStop
Error Message:
test timed out after 180000 milliseconds
Stack Trace:
java.lang.Exception: test timed out after 180000 milliseconds
at org.apache.maven.surefire.booter.ForkingRunListener.writeTestOutput(ForkingRunListener.java:167)
at org.apache.maven.surefire.report.ConsoleOutputCapture$ForwardingPrintStream.write(ConsoleOutputCapture.java:56)
at sun.nio.cs.StreamEncoder.writeBytes(StreamEncoder.java:202)
at sun.nio.cs.StreamEncoder.implFlushBuffer(StreamEncoder.java:272)
at sun.nio.cs.StreamEncoder.flushBuffer(StreamEncoder.java:85)
at java.io.OutputStreamWriter.flushBuffer(OutputStreamWriter.java:168)
at java.io.PrintStream.newLine(PrintStream.java:496)
at java.io.PrintStream.println(PrintStream.java:774)
at java.lang.Throwable.printStackTrace(Throwable.java:461)
at java.lang.Throwable.printStackTrace(Throwable.java:451)
at org.apache.hadoop.yarn.client.api.impl.TestNMClient.testGetContainerStatus(TestNMClient.java:365)
at org.apache.hadoop.yarn.client.api.impl.TestNMClient.testContainerManagement(TestNMClient.java:333)
at org.apache.hadoop.yarn.client.api.impl.TestNMClient.testNMClientNoCleanupOnStop(TestNMClient.java:198)
at sun.reflect.NativeMethodAccessorImpl.invoke0(Native Method)
at sun.reflect.NativeMethodAccessorImpl.invoke(NativeMethodAccessorImpl.java:39)
at sun.reflect.DelegatingMethodAccessorImpl.invoke(DelegatingMethodAccessorImpl.java:25)
at java.lang.reflect.Method.invoke(Method.java:597)
at org.junit.runners.model.FrameworkMethod$1.runReflectiveCall(FrameworkMethod.java:45)
at org.junit.internal.runners.model.ReflectiveCallable.run(ReflectiveCallable.java:15)
at org.junit.runners.model.FrameworkMethod.invokeExplosively(FrameworkMethod.java:42)
at org.junit.internal.runners.statements.InvokeMethod.evaluate(InvokeMethod.java:20)
at org.junit.internal.runners.statements.FailOnTimeout$StatementThread.run(FailOnTimeout.java:62)