You are viewing a plain text version of this content. The canonical link for it is here.
Posted to builds@beam.apache.org by Apache Jenkins Server <je...@builds.apache.org> on 2021/03/19 05:30:44 UTC
beam_PostCommit_Java_VR_Dataflow_V2_Streaming - Build # 539 -
Aborted!
beam_PostCommit_Java_VR_Dataflow_V2_Streaming - Build # 539 - Aborted:
Check console output at https://ci-beam.apache.org/job/beam_PostCommit_Java_VR_Dataflow_V2_Streaming/539/ to view the results.
Jenkins build is back to normal :
beam_PostCommit_Java_VR_Dataflow_V2_Streaming #543
Posted by Apache Jenkins Server <je...@builds.apache.org>.
See <https://ci-beam.apache.org/job/beam_PostCommit_Java_VR_Dataflow_V2_Streaming/543/display/redirect?page=changes>
---------------------------------------------------------------------
To unsubscribe, e-mail: builds-unsubscribe@beam.apache.org
For additional commands, e-mail: builds-help@beam.apache.org
Build failed in Jenkins:
beam_PostCommit_Java_VR_Dataflow_V2_Streaming #542
Posted by Apache Jenkins Server <je...@builds.apache.org>.
See <https://ci-beam.apache.org/job/beam_PostCommit_Java_VR_Dataflow_V2_Streaming/542/display/redirect?page=changes>
Changes:
[Kenneth Knowles] Sickbay committed metrics, not attempted metrics, for Dataflow streaming
[Ismaël Mejía] [BEAM-11992] Run CrossLanguage ValidatesRunner for Spark 3
[noreply] Add an option to create Dataflow piplines from a snapshot for python sdk
------------------------------------------
[...truncated 340.30 KB...]
File "/usr/lib/python3.5/urllib/request.py", line 472, in open
response = meth(req, response)
File "/usr/lib/python3.5/urllib/request.py", line 582, in http_response
'http', request, response, code, msg, hdrs)
File "/usr/lib/python3.5/urllib/request.py", line 510, in error
return self._call_chain(*args)
File "/usr/lib/python3.5/urllib/request.py", line 444, in _call_chain
result = func(*args)
File "/usr/lib/python3.5/urllib/request.py", line 590, in http_error_default
raise HTTPError(req.full_url, code, msg, hdrs, fp)
urllib.error.HTTPError: HTTP Error 502: Bad Gateway
ERROR:root:Invalid url for grpc-core-1.35.0: https://opensource.org/licenses/Apache-2.0. Retrying...
Traceback (most recent call last):
File "<https://ci-beam.apache.org/job/beam_PostCommit_Java_VR_Dataflow_V2_Streaming/ws/src/sdks/java/container/license_scripts/pull_licenses_java.py",> line 53, in pull_from_url
url_read = urlopen(url)
File "/usr/lib/python3.5/urllib/request.py", line 163, in urlopen
return opener.open(url, data, timeout)
File "/usr/lib/python3.5/urllib/request.py", line 472, in open
response = meth(req, response)
File "/usr/lib/python3.5/urllib/request.py", line 582, in http_response
'http', request, response, code, msg, hdrs)
File "/usr/lib/python3.5/urllib/request.py", line 504, in error
result = self._call_chain(*args)
File "/usr/lib/python3.5/urllib/request.py", line 444, in _call_chain
result = func(*args)
File "/usr/lib/python3.5/urllib/request.py", line 696, in http_error_302
return self.parent.open(new, timeout=req.timeout)
File "/usr/lib/python3.5/urllib/request.py", line 472, in open
response = meth(req, response)
File "/usr/lib/python3.5/urllib/request.py", line 582, in http_response
'http', request, response, code, msg, hdrs)
File "/usr/lib/python3.5/urllib/request.py", line 504, in error
result = self._call_chain(*args)
File "/usr/lib/python3.5/urllib/request.py", line 444, in _call_chain
result = func(*args)
File "/usr/lib/python3.5/urllib/request.py", line 696, in http_error_302
return self.parent.open(new, timeout=req.timeout)
File "/usr/lib/python3.5/urllib/request.py", line 472, in open
response = meth(req, response)
File "/usr/lib/python3.5/urllib/request.py", line 582, in http_response
'http', request, response, code, msg, hdrs)
File "/usr/lib/python3.5/urllib/request.py", line 510, in error
return self._call_chain(*args)
File "/usr/lib/python3.5/urllib/request.py", line 444, in _call_chain
result = func(*args)
File "/usr/lib/python3.5/urllib/request.py", line 590, in http_error_default
raise HTTPError(req.full_url, code, msg, hdrs, fp)
urllib.error.HTTPError: HTTP Error 502: Bad Gateway
ERROR:root:Invalid url for slf4j-jdk14-1.7.30: http://www.opensource.org/licenses/mit-license.php. Retrying...
Traceback (most recent call last):
File "<https://ci-beam.apache.org/job/beam_PostCommit_Java_VR_Dataflow_V2_Streaming/ws/src/sdks/java/container/license_scripts/pull_licenses_java.py",> line 53, in pull_from_url
url_read = urlopen(url)
File "/usr/lib/python3.5/urllib/request.py", line 163, in urlopen
return opener.open(url, data, timeout)
File "/usr/lib/python3.5/urllib/request.py", line 472, in open
response = meth(req, response)
File "/usr/lib/python3.5/urllib/request.py", line 582, in http_response
'http', request, response, code, msg, hdrs)
File "/usr/lib/python3.5/urllib/request.py", line 510, in error
return self._call_chain(*args)
File "/usr/lib/python3.5/urllib/request.py", line 444, in _call_chain
result = func(*args)
File "/usr/lib/python3.5/urllib/request.py", line 590, in http_error_default
raise HTTPError(req.full_url, code, msg, hdrs, fp)
urllib.error.HTTPError: HTTP Error 502: Bad Gateway
ERROR:root:Invalid url for grpc-core-1.35.0: https://opensource.org/licenses/Apache-2.0. Retrying...
Traceback (most recent call last):
File "<https://ci-beam.apache.org/job/beam_PostCommit_Java_VR_Dataflow_V2_Streaming/ws/src/sdks/java/container/license_scripts/pull_licenses_java.py",> line 53, in pull_from_url
url_read = urlopen(url)
File "/usr/lib/python3.5/urllib/request.py", line 163, in urlopen
return opener.open(url, data, timeout)
File "/usr/lib/python3.5/urllib/request.py", line 472, in open
response = meth(req, response)
File "/usr/lib/python3.5/urllib/request.py", line 582, in http_response
'http', request, response, code, msg, hdrs)
File "/usr/lib/python3.5/urllib/request.py", line 510, in error
return self._call_chain(*args)
File "/usr/lib/python3.5/urllib/request.py", line 444, in _call_chain
result = func(*args)
File "/usr/lib/python3.5/urllib/request.py", line 590, in http_error_default
raise HTTPError(req.full_url, code, msg, hdrs, fp)
urllib.error.HTTPError: HTTP Error 502: Bad Gateway
ERROR:root:Invalid url for grpc-core-1.35.0: https://opensource.org/licenses/Apache-2.0. Retrying...
Traceback (most recent call last):
File "<https://ci-beam.apache.org/job/beam_PostCommit_Java_VR_Dataflow_V2_Streaming/ws/src/sdks/java/container/license_scripts/pull_licenses_java.py",> line 53, in pull_from_url
url_read = urlopen(url)
File "/usr/lib/python3.5/urllib/request.py", line 163, in urlopen
return opener.open(url, data, timeout)
File "/usr/lib/python3.5/urllib/request.py", line 472, in open
response = meth(req, response)
File "/usr/lib/python3.5/urllib/request.py", line 582, in http_response
'http', request, response, code, msg, hdrs)
File "/usr/lib/python3.5/urllib/request.py", line 504, in error
result = self._call_chain(*args)
File "/usr/lib/python3.5/urllib/request.py", line 444, in _call_chain
result = func(*args)
File "/usr/lib/python3.5/urllib/request.py", line 696, in http_error_302
return self.parent.open(new, timeout=req.timeout)
File "/usr/lib/python3.5/urllib/request.py", line 472, in open
response = meth(req, response)
File "/usr/lib/python3.5/urllib/request.py", line 582, in http_response
'http', request, response, code, msg, hdrs)
File "/usr/lib/python3.5/urllib/request.py", line 504, in error
result = self._call_chain(*args)
File "/usr/lib/python3.5/urllib/request.py", line 444, in _call_chain
result = func(*args)
File "/usr/lib/python3.5/urllib/request.py", line 696, in http_error_302
return self.parent.open(new, timeout=req.timeout)
File "/usr/lib/python3.5/urllib/request.py", line 472, in open
response = meth(req, response)
File "/usr/lib/python3.5/urllib/request.py", line 582, in http_response
'http', request, response, code, msg, hdrs)
File "/usr/lib/python3.5/urllib/request.py", line 510, in error
return self._call_chain(*args)
File "/usr/lib/python3.5/urllib/request.py", line 444, in _call_chain
result = func(*args)
File "/usr/lib/python3.5/urllib/request.py", line 590, in http_error_default
raise HTTPError(req.full_url, code, msg, hdrs, fp)
urllib.error.HTTPError: HTTP Error 502: Bad Gateway
ERROR:root:Invalid url for slf4j-jdk14-1.7.30: http://www.opensource.org/licenses/mit-license.php after 9 retries.
> Task :sdks:java:container:java8:copyGolangLicenses
> Task :sdks:java:container:pullLicenses
Traceback (most recent call last):
File "<https://ci-beam.apache.org/job/beam_PostCommit_Java_VR_Dataflow_V2_Streaming/ws/src/sdks/java/container/license_scripts/pull_licenses_java.py",> line 53, in pull_from_url
url_read = urlopen(url)
File "/usr/lib/python3.5/urllib/request.py", line 163, in urlopen
return opener.open(url, data, timeout)
File "/usr/lib/python3.5/urllib/request.py", line 472, in open
response = meth(req, response)
File "/usr/lib/python3.5/urllib/request.py", line 582, in http_response
'http', request, response, code, msg, hdrs)
File "/usr/lib/python3.5/urllib/request.py", line 510, in error
return self._call_chain(*args)
File "/usr/lib/python3.5/urllib/request.py", line 444, in _call_chain
result = func(*args)
File "/usr/lib/python3.5/urllib/request.py", line 590, in http_error_default
raise HTTPError(req.full_url, code, msg, hdrs, fp)
urllib.error.HTTPError: HTTP Error 502: Bad Gateway
ERROR:root:Invalid url for grpc-core-1.35.0: https://opensource.org/licenses/Apache-2.0. Retrying...
Traceback (most recent call last):
File "<https://ci-beam.apache.org/job/beam_PostCommit_Java_VR_Dataflow_V2_Streaming/ws/src/sdks/java/container/license_scripts/pull_licenses_java.py",> line 53, in pull_from_url
url_read = urlopen(url)
File "/usr/lib/python3.5/urllib/request.py", line 163, in urlopen
return opener.open(url, data, timeout)
File "/usr/lib/python3.5/urllib/request.py", line 472, in open
response = meth(req, response)
File "/usr/lib/python3.5/urllib/request.py", line 582, in http_response
'http', request, response, code, msg, hdrs)
File "/usr/lib/python3.5/urllib/request.py", line 510, in error
return self._call_chain(*args)
File "/usr/lib/python3.5/urllib/request.py", line 444, in _call_chain
result = func(*args)
File "/usr/lib/python3.5/urllib/request.py", line 590, in http_error_default
raise HTTPError(req.full_url, code, msg, hdrs, fp)
urllib.error.HTTPError: HTTP Error 502: Bad Gateway
ERROR:root:Invalid url for grpc-core-1.35.0: https://opensource.org/licenses/Apache-2.0. Retrying...
Traceback (most recent call last):
File "<https://ci-beam.apache.org/job/beam_PostCommit_Java_VR_Dataflow_V2_Streaming/ws/src/sdks/java/container/license_scripts/pull_licenses_java.py",> line 53, in pull_from_url
url_read = urlopen(url)
File "/usr/lib/python3.5/urllib/request.py", line 163, in urlopen
return opener.open(url, data, timeout)
File "/usr/lib/python3.5/urllib/request.py", line 472, in open
response = meth(req, response)
File "/usr/lib/python3.5/urllib/request.py", line 582, in http_response
'http', request, response, code, msg, hdrs)
File "/usr/lib/python3.5/urllib/request.py", line 510, in error
return self._call_chain(*args)
File "/usr/lib/python3.5/urllib/request.py", line 444, in _call_chain
result = func(*args)
File "/usr/lib/python3.5/urllib/request.py", line 590, in http_error_default
raise HTTPError(req.full_url, code, msg, hdrs, fp)
urllib.error.HTTPError: HTTP Error 502: Bad Gateway
ERROR:root:Invalid url for grpc-core-1.35.0: https://opensource.org/licenses/Apache-2.0. Retrying...
Traceback (most recent call last):
File "<https://ci-beam.apache.org/job/beam_PostCommit_Java_VR_Dataflow_V2_Streaming/ws/src/sdks/java/container/license_scripts/pull_licenses_java.py",> line 53, in pull_from_url
url_read = urlopen(url)
File "/usr/lib/python3.5/urllib/request.py", line 163, in urlopen
return opener.open(url, data, timeout)
File "/usr/lib/python3.5/urllib/request.py", line 472, in open
response = meth(req, response)
File "/usr/lib/python3.5/urllib/request.py", line 582, in http_response
'http', request, response, code, msg, hdrs)
File "/usr/lib/python3.5/urllib/request.py", line 510, in error
return self._call_chain(*args)
File "/usr/lib/python3.5/urllib/request.py", line 444, in _call_chain
result = func(*args)
File "/usr/lib/python3.5/urllib/request.py", line 590, in http_error_default
raise HTTPError(req.full_url, code, msg, hdrs, fp)
urllib.error.HTTPError: HTTP Error 502: Bad Gateway
ERROR:root:Invalid url for grpc-core-1.35.0: https://opensource.org/licenses/Apache-2.0 after 9 retries.
ERROR:root:['zstd-jni-1.4.3-1', 'google-auth-library-credentials-0.22.2', 'reflectasm-1.07', 'checker-compat-qual-2.5.3', 'hamcrest-2.1', 'pcollections-2.1.2', 'kafka-1.15.1', 'checker-compat-qual-2.5.5', 'minlog-1.2', 'grpc-context-1.35.0', 'slf4j-jdk14-1.7.30', 'grpc-core-1.35.0']
ERROR:root:**************************************** Licenses were not able to be pulled automatically for some dependencies. Please search source code of the dependencies on the internet and add "license" and "notice" (if available) field to <https://ci-beam.apache.org/job/beam_PostCommit_Java_VR_Dataflow_V2_Streaming/ws/src/sdks/java/container/license_scripts/dep_urls_java.yaml> for each missing license. Dependency List: [checker-compat-qual-2.5.3,checker-compat-qual-2.5.5,google-auth-library-credentials-0.22.2,grpc-context-1.35.0,grpc-core-1.35.0,hamcrest-2.1,kafka-1.15.1,minlog-1.2,pcollections-2.1.2,reflectasm-1.07,slf4j-jdk14-1.7.30,zstd-jni-1.4.3-1]
INFO:root:pull_licenses_java.py failed. It took 138.379617 seconds with 16 threads.
Traceback (most recent call last):
File "<https://ci-beam.apache.org/job/beam_PostCommit_Java_VR_Dataflow_V2_Streaming/ws/src/sdks/java/container/license_scripts/pull_licenses_java.py",> line 315, in <module>
error_msg)
RuntimeError: ('1 error(s) occurred.', ['**************************************** Licenses were not able to be pulled automatically for some dependencies. Please search source code of the dependencies on the internet and add "license" and "notice" (if available) field to <https://ci-beam.apache.org/job/beam_PostCommit_Java_VR_Dataflow_V2_Streaming/ws/src/sdks/java/container/license_scripts/dep_urls_java.yaml> for each missing license. Dependency List: [checker-compat-qual-2.5.3,checker-compat-qual-2.5.5,google-auth-library-credentials-0.22.2,grpc-context-1.35.0,grpc-core-1.35.0,hamcrest-2.1,kafka-1.15.1,minlog-1.2,pcollections-2.1.2,reflectasm-1.07,slf4j-jdk14-1.7.30,zstd-jni-1.4.3-1]'])
> Task :sdks:java:container:pullLicenses FAILED
> Task :sdks:go:resolveBuildDependencies
Resolving golang.org/x/text: commit='23ae387dee1f90d29a23c0e87ee0b46038fbed0e', urls=[https://go.googlesource.com/text]
Resolving cached github.com/etcd-io/etcd: commit='11214aa33bf5a47d3d9d8dafe0f6b97237dfe921', urls=[https://github.com/etcd-io/etcd.git, git@github.com:etcd-io/etcd.git]
Resolving google.golang.org/api: commit='0324d5e90dc7753607860272666845fad9ceb97e', urls=[https://code.googlesource.com/google-api-go-client]
Resolving google.golang.org/genproto: commit='4d944d34d83c502a5f761500a14d8842648415c3', urls=[https://github.com/google/go-genproto]
Resolving google.golang.org/grpc: commit='5e8f83304c0563d1ba74db05fee83d9c18ab9a58', urls=[https://github.com/grpc/grpc-go]
Resolving google.golang.org/protobuf: commit='d165be301fb1e13390ad453281ded24385fd8ebc', urls=[https://go.googlesource.com/protobuf]
Resolving cached github.com/etcd-io/etcd: commit='11214aa33bf5a47d3d9d8dafe0f6b97237dfe921', urls=[https://github.com/etcd-io/etcd.git, git@github.com:etcd-io/etcd.git]
Resolving cached github.com/etcd-io/etcd: commit='11214aa33bf5a47d3d9d8dafe0f6b97237dfe921', urls=[https://github.com/etcd-io/etcd.git, git@github.com:etcd-io/etcd.git]
> Task :sdks:go:installDependencies
> Task :sdks:go:buildLinuxAmd64
> Task :sdks:go:goBuild
> Task :sdks:java:container:resolveBuildDependencies
Unable to watch the file system for changes. The inotify watches limit is too low.
Resolving ./github.com/apache/beam/sdks/go@<https://ci-beam.apache.org/job/beam_PostCommit_Java_VR_Dataflow_V2_Streaming/ws/src/sdks/go>
> Task :sdks:java:container:installDependencies
> Task :sdks:java:container:buildLinuxAmd64
> Task :sdks:java:container:goBuild
> Task :sdks:java:container:java8:copySdkHarnessLauncher
FAILURE: Build failed with an exception.
* What went wrong:
Execution failed for task ':sdks:java:container:pullLicenses'.
> Process 'command './license_scripts/license_script.sh'' finished with non-zero exit value 1
* Try:
Run with --stacktrace option to get the stack trace. Run with --info or --debug option to get more log output. Run with --scan to get full insights.
* Get more help at https://help.gradle.org
Deprecated Gradle features were used in this build, making it incompatible with Gradle 7.0.
Use '--warning-mode all' to show the individual deprecation warnings.
See https://docs.gradle.org/6.8/userguide/command_line_interface.html#sec:command_line_warnings
BUILD FAILED in 10m 48s
115 actionable tasks: 77 executed, 36 from cache, 2 up-to-date
Gradle was unable to watch the file system for changes. The inotify watches limit is too low.
Publishing build scan...
https://gradle.com/s/xp35s6mhmuvi4
Build step 'Invoke Gradle script' changed build result to FAILURE
Build step 'Invoke Gradle script' marked build as failure
---------------------------------------------------------------------
To unsubscribe, e-mail: builds-unsubscribe@beam.apache.org
For additional commands, e-mail: builds-help@beam.apache.org
Build failed in Jenkins:
beam_PostCommit_Java_VR_Dataflow_V2_Streaming #541
Posted by Apache Jenkins Server <je...@builds.apache.org>.
See <https://ci-beam.apache.org/job/beam_PostCommit_Java_VR_Dataflow_V2_Streaming/541/display/redirect>
Changes:
------------------------------------------
[...truncated 42.47 KB...]
> Task :sdks:go:resolveBuildDependencies
Resolving github.com/google/pprof: commit='a8f279b7952b27edbcb72e5a6c69ee9be4c8ad93', urls=[https://github.com/google/pprof.git, git@github.com:google/pprof.git]
Resolving github.com/googleapis/gax-go: commit='bd5b16380fd03dc758d11cef74ba2e3bc8b0e8c2', urls=[https://github.com/googleapis/gax-go.git, git@github.com:googleapis/gax-go.git]
Resolving cached github.com/etcd-io/etcd: commit='11214aa33bf5a47d3d9d8dafe0f6b97237dfe921', urls=[https://github.com/etcd-io/etcd.git, git@github.com:etcd-io/etcd.git]
Resolving cached github.com/etcd-io/etcd: commit='11214aa33bf5a47d3d9d8dafe0f6b97237dfe921', urls=[https://github.com/etcd-io/etcd.git, git@github.com:etcd-io/etcd.git]
Resolving cached github.com/etcd-io/etcd: commit='11214aa33bf5a47d3d9d8dafe0f6b97237dfe921', urls=[https://github.com/etcd-io/etcd.git, git@github.com:etcd-io/etcd.git]
Resolving github.com/hashicorp/hcl: commit='23c074d0eceb2b8a5bfdbb271ab780cde70f05a8', urls=[https://github.com/hashicorp/hcl.git, git@github.com:hashicorp/hcl.git]
Resolving github.com/ianlancetaylor/demangle: commit='4883227f66371e02c4948937d3e2be1664d9be38', urls=[https://github.com/ianlancetaylor/demangle.git, git@github.com:ianlancetaylor/demangle.git]
Resolving cached github.com/etcd-io/etcd: commit='11214aa33bf5a47d3d9d8dafe0f6b97237dfe921', urls=[https://github.com/etcd-io/etcd.git, git@github.com:etcd-io/etcd.git]
Resolving cached github.com/etcd-io/etcd: commit='11214aa33bf5a47d3d9d8dafe0f6b97237dfe921', urls=[https://github.com/etcd-io/etcd.git, git@github.com:etcd-io/etcd.git]
Resolving github.com/kr/fs: commit='2788f0dbd16903de03cb8186e5c7d97b69ad387b', urls=[https://github.com/kr/fs.git, git@github.com:kr/fs.git]
Resolving cached github.com/etcd-io/etcd: commit='11214aa33bf5a47d3d9d8dafe0f6b97237dfe921', urls=[https://github.com/etcd-io/etcd.git, git@github.com:etcd-io/etcd.git]
Resolving github.com/linkedin/goavro: commit='94a7a9db615f35a39dd2b82089398b92fabad2ba', urls=[https://github.com/linkedin/goavro.git, git@github.com:linkedin/goavro.git]
Resolving github.com/magiconair/properties: commit='49d762b9817ba1c2e9d0c69183c2b4a8b8f1d934', urls=[https://github.com/magiconair/properties.git, git@github.com:magiconair/properties.git]
Resolving cached github.com/etcd-io/etcd: commit='11214aa33bf5a47d3d9d8dafe0f6b97237dfe921', urls=[https://github.com/etcd-io/etcd.git, git@github.com:etcd-io/etcd.git]
Resolving cached github.com/etcd-io/etcd: commit='11214aa33bf5a47d3d9d8dafe0f6b97237dfe921', urls=[https://github.com/etcd-io/etcd.git, git@github.com:etcd-io/etcd.git]
Resolving github.com/mitchellh/go-homedir: commit='b8bc1bf767474819792c23f32d8286a45736f1c6', urls=[https://github.com/mitchellh/go-homedir.git, git@github.com:mitchellh/go-homedir.git]
Resolving github.com/mitchellh/mapstructure: commit='a4e142e9c047c904fa2f1e144d9a84e6133024bc', urls=[https://github.com/mitchellh/mapstructure.git, git@github.com:mitchellh/mapstructure.git]
Resolving github.com/nightlyone/lockfile: commit='0ad87eef1443f64d3d8c50da647e2b1552851124', urls=[https://github.com/nightlyone/lockfile, git@github.com:nightlyone/lockfile.git]
Resolving cached github.com/etcd-io/etcd: commit='11214aa33bf5a47d3d9d8dafe0f6b97237dfe921', urls=[https://github.com/etcd-io/etcd.git, git@github.com:etcd-io/etcd.git]
Resolving github.com/openzipkin/zipkin-go: commit='3741243b287094fda649c7f0fa74bd51f37dc122', urls=[https://github.com/openzipkin/zipkin-go.git, git@github.com:openzipkin/zipkin-go.git]
> Task :runners:core-construction-java:compileTestJava FROM-CACHE
> Task :runners:core-construction-java:testClasses UP-TO-DATE
> Task :sdks:java:extensions:google-cloud-platform-core:compileTestJava FROM-CACHE
> Task :sdks:java:extensions:google-cloud-platform-core:testClasses UP-TO-DATE
> Task :sdks:java:extensions:google-cloud-platform-core:testJar
> Task :runners:core-construction-java:testJar
> Task :sdks:java:harness:shadowJar FROM-CACHE
> Task :sdks:go:resolveBuildDependencies
Resolving github.com/pelletier/go-toml: commit='acdc4509485b587f5e675510c4f2c63e90ff68a8', urls=[https://github.com/pelletier/go-toml.git, git@github.com:pelletier/go-toml.git]
Resolving cached github.com/etcd-io/etcd: commit='11214aa33bf5a47d3d9d8dafe0f6b97237dfe921', urls=[https://github.com/etcd-io/etcd.git, git@github.com:etcd-io/etcd.git]
Resolving github.com/pierrec/lz4: commit='ed8d4cc3b461464e69798080a0092bd028910298', urls=[https://github.com/pierrec/lz4.git, git@github.com:pierrec/lz4.git]
Resolving github.com/pierrec/xxHash: commit='a0006b13c722f7f12368c00a3d3c2ae8a999a0c6', urls=[https://github.com/pierrec/xxHash.git, git@github.com:pierrec/xxHash.git]
Resolving github.com/pkg/errors: commit='30136e27e2ac8d167177e8a583aa4c3fea5be833', urls=[https://github.com/pkg/errors.git, git@github.com:pkg/errors.git]
Resolving github.com/pkg/sftp: commit='22e9c1ccc02fc1b9fa3264572e49109b68a86947', urls=[https://github.com/pkg/sftp.git, git@github.com:pkg/sftp.git]
Resolving github.com/prometheus/client_golang: commit='9bb6ab929dcbe1c8393cd9ef70387cb69811bd1c', urls=[https://github.com/prometheus/client_golang.git, git@github.com:prometheus/client_golang.git]
Resolving cached github.com/etcd-io/etcd: commit='11214aa33bf5a47d3d9d8dafe0f6b97237dfe921', urls=[https://github.com/etcd-io/etcd.git, git@github.com:etcd-io/etcd.git]
Resolving cached github.com/etcd-io/etcd: commit='11214aa33bf5a47d3d9d8dafe0f6b97237dfe921', urls=[https://github.com/etcd-io/etcd.git, git@github.com:etcd-io/etcd.git]
Resolving github.com/prometheus/procfs: commit='cb4147076ac75738c9a7d279075a253c0cc5acbd', urls=[https://github.com/prometheus/procfs.git, git@github.com:prometheus/procfs.git]
Resolving github.com/rcrowley/go-metrics: commit='8732c616f52954686704c8645fe1a9d59e9df7c1', urls=[https://github.com/rcrowley/go-metrics.git, git@github.com:rcrowley/go-metrics.git]
Resolving github.com/cpuguy83/go-md2man: commit='dc9f53734905c233adfc09fd4f063dce63ce3daf', urls=[https://github.com/cpuguy83/go-md2man.git, git@github.com:cpuguy83/go-md2man.git]
Resolving cached github.com/cpuguy83/go-md2man: commit='dc9f53734905c233adfc09fd4f063dce63ce3daf', urls=[https://github.com/cpuguy83/go-md2man.git, git@github.com:cpuguy83/go-md2man.git]
Resolving cached github.com/etcd-io/etcd: commit='11214aa33bf5a47d3d9d8dafe0f6b97237dfe921', urls=[https://github.com/etcd-io/etcd.git, git@github.com:etcd-io/etcd.git]
Resolving cached github.com/etcd-io/etcd: commit='11214aa33bf5a47d3d9d8dafe0f6b97237dfe921', urls=[https://github.com/etcd-io/etcd.git, git@github.com:etcd-io/etcd.git]
Resolving github.com/spf13/afero: commit='bb8f1927f2a9d3ab41c9340aa034f6b803f4359c', urls=[https://github.com/spf13/afero.git, git@github.com:spf13/afero.git]
Resolving github.com/spf13/cast: commit='acbeb36b902d72a7a4c18e8f3241075e7ab763e4', urls=[https://github.com/spf13/cast.git, git@github.com:spf13/cast.git]
Resolving github.com/spf13/cobra: commit='93959269ad99e80983c9ba742a7e01203a4c0e4f', urls=[https://github.com/spf13/cobra.git, git@github.com:spf13/cobra.git]
Resolving github.com/spf13/jwalterweatherman: commit='7c0cea34c8ece3fbeb2b27ab9b59511d360fb394', urls=[https://github.com/spf13/jwalterweatherman.git, git@github.com:spf13/jwalterweatherman.git]
Resolving cached github.com/etcd-io/etcd: commit='11214aa33bf5a47d3d9d8dafe0f6b97237dfe921', urls=[https://github.com/etcd-io/etcd.git, git@github.com:etcd-io/etcd.git]
Resolving github.com/spf13/viper: commit='aafc9e6bc7b7bb53ddaa75a5ef49a17d6e654be5', urls=[https://github.com/spf13/viper.git, git@github.com:spf13/viper.git]
Resolving github.com/stathat/go: commit='74669b9f388d9d788c97399a0824adbfee78400e', urls=[https://github.com/stathat/go.git, git@github.com:stathat/go.git]
Resolving cached github.com/etcd-io/etcd: commit='11214aa33bf5a47d3d9d8dafe0f6b97237dfe921', urls=[https://github.com/etcd-io/etcd.git, git@github.com:etcd-io/etcd.git]
Resolving cached github.com/etcd-io/etcd: commit='11214aa33bf5a47d3d9d8dafe0f6b97237dfe921', urls=[https://github.com/etcd-io/etcd.git, git@github.com:etcd-io/etcd.git]
Resolving cached github.com/etcd-io/etcd: commit='11214aa33bf5a47d3d9d8dafe0f6b97237dfe921', urls=[https://github.com/etcd-io/etcd.git, git@github.com:etcd-io/etcd.git]
Resolving cached github.com/etcd-io/etcd: commit='11214aa33bf5a47d3d9d8dafe0f6b97237dfe921', urls=[https://github.com/etcd-io/etcd.git, git@github.com:etcd-io/etcd.git]
Resolving github.com/xordataexchange/crypt: commit='b2862e3d0a775f18c7cfe02273500ae307b61218', urls=[https://github.com/xordataexchange/crypt.git, git@github.com:xordataexchange/crypt.git]
Resolving go.opencensus.io: commit='3fb168f674736c026e623310bfccb0691e6dec8a', urls=[https://github.com/census-instrumentation/opencensus-go]
Resolving golang.org/x/crypto: commit='d9133f5469342136e669e85192a26056b587f503', urls=[https://go.googlesource.com/crypto]
Resolving golang.org/x/debug: commit='95515998a8a4bd7448134b2cb5971dbeb12e0b77', urls=[https://go.googlesource.com/debug]
> Task :sdks:java:container:generateLicenseReport
> Task :runners:java-fn-execution:compileJava FROM-CACHE
> Task :runners:java-fn-execution:classes UP-TO-DATE
> Task :runners:java-fn-execution:jar
> Task :sdks:java:container:pullLicenses
Copying already-fetched licenses from <https://ci-beam.apache.org/job/beam_PostCommit_Java_VR_Dataflow_V2_Streaming/ws/src/sdks/java/container/build/reports/dependency-license> to <https://ci-beam.apache.org/job/beam_PostCommit_Java_VR_Dataflow_V2_Streaming/ws/src/sdks/java/container/build/target/java_third_party_licenses>
> Task :sdks:java:expansion-service:compileJava FROM-CACHE
> Task :sdks:java:expansion-service:classes UP-TO-DATE
> Task :sdks:java:expansion-service:jar
> Task :runners:direct-java:compileJava FROM-CACHE
> Task :runners:direct-java:classes UP-TO-DATE
> Task :sdks:java:io:kafka:compileJava FROM-CACHE
> Task :sdks:java:io:kafka:classes UP-TO-DATE
> Task :runners:direct-java:shadowJar FROM-CACHE
> Task :sdks:java:io:kafka:jar
> Task :sdks:java:io:google-cloud-platform:compileJava FROM-CACHE
> Task :sdks:java:io:google-cloud-platform:classes UP-TO-DATE
> Task :sdks:java:io:google-cloud-platform:jar
> Task :sdks:go:resolveBuildDependencies
Resolving golang.org/x/net: commit='2fb46b16b8dda405028c50f7c7f0f9dd1fa6bfb1', urls=[https://go.googlesource.com/net]
Resolving golang.org/x/oauth2: commit='5d25da1a8d43b66f2898c444f899c7bcfd6a407e', urls=[https://go.googlesource.com/oauth2]
Resolving golang.org/x/sync: commit='fd80eb99c8f653c847d294a001bdf2a3a6f768f5', urls=[https://go.googlesource.com/sync]
> Task :runners:google-cloud-dataflow-java:compileJava FROM-CACHE
> Task :runners:google-cloud-dataflow-java:classes
> Task :sdks:java:container:pullLicenses
Already using interpreter /usr/bin/python3
Using base prefix '/usr'
New python executable in <https://ci-beam.apache.org/job/beam_PostCommit_Java_VR_Dataflow_V2_Streaming/ws/src/sdks/java/container/build/virtualenv/bin/python3>
Also creating executable in <https://ci-beam.apache.org/job/beam_PostCommit_Java_VR_Dataflow_V2_Streaming/ws/src/sdks/java/container/build/virtualenv/bin/python>
Installing setuptools, pip, wheel...
> Task :runners:google-cloud-dataflow-java:jar
> Task :sdks:java:container:java8:copyDockerfileDependencies
> Task :sdks:java:io:google-cloud-platform:compileTestJava FROM-CACHE
> Task :sdks:java:io:google-cloud-platform:testClasses
> Task :sdks:java:io:google-cloud-platform:testJar
> Task :runners:google-cloud-dataflow-java:compileTestJava FROM-CACHE
> Task :runners:google-cloud-dataflow-java:testClasses UP-TO-DATE
> Task :runners:google-cloud-dataflow-java:testJar
> Task :sdks:go:resolveBuildDependencies
Resolving golang.org/x/sys: commit='fde4db37ae7ad8191b03d30d27f258b5291ae4e3', urls=[https://go.googlesource.com/sys]
> Task :sdks:java:container:pullLicenses
done.
DEPRECATION: Python 3.5 reached the end of its life on September 13th, 2020. Please upgrade your Python as Python 3.5 is no longer maintained. pip 21.0 will drop support for Python 3.5 in January 2021. pip 21.0 will remove support for this functionality.
Collecting beautifulsoup4<5.0,>=4.9.0
Using cached beautifulsoup4-4.9.3-py3-none-any.whl (115 kB)
Collecting future<1.0.0,>=0.16.0
Using cached future-0.18.2-cp35-none-any.whl
Collecting pyyaml<6.0.0,>=3.12
Using cached PyYAML-5.3.1-cp35-cp35m-linux_x86_64.whl
Collecting tenacity<6.0,>=5.0.2
Using cached tenacity-5.1.5-py2.py3-none-any.whl (34 kB)
Collecting soupsieve>1.2
Using cached soupsieve-2.1-py3-none-any.whl (32 kB)
Collecting six>=1.9.0
Using cached six-1.15.0-py2.py3-none-any.whl (10 kB)
Installing collected packages: soupsieve, six, tenacity, pyyaml, future, beautifulsoup4
Successfully installed beautifulsoup4-4.9.3 future-0.18.2 pyyaml-5.3.1 six-1.15.0 soupsieve-2.1 tenacity-5.1.5
Executing <https://ci-beam.apache.org/job/beam_PostCommit_Java_VR_Dataflow_V2_Streaming/ws/src/sdks/java/container/build/virtualenv/bin/python> <https://ci-beam.apache.org/job/beam_PostCommit_Java_VR_Dataflow_V2_Streaming/ws/src/sdks/java/container/license_scripts/pull_licenses_java.py> --license_index=<https://ci-beam.apache.org/job/beam_PostCommit_Java_VR_Dataflow_V2_Streaming/ws/src/sdks/java/container/build/reports/dependency-license/index.json> --output_dir=<https://ci-beam.apache.org/job/beam_PostCommit_Java_VR_Dataflow_V2_Streaming/ws/src/sdks/java/container/build/target/java_third_party_licenses> --dep_url_yaml=<https://ci-beam.apache.org/job/beam_PostCommit_Java_VR_Dataflow_V2_Streaming/ws/src/sdks/java/container/license_scripts/dep_urls_java.yaml>
INFO:root:Pulling license for 206 dependencies using 16 threads.
INFO:root:pull_licenses_java.py succeed. It took 3.110388 seconds with 16 threads.
Copying licenses from <https://ci-beam.apache.org/job/beam_PostCommit_Java_VR_Dataflow_V2_Streaming/ws/src/sdks/java/container/build/target/java_third_party_licenses> to <https://ci-beam.apache.org/job/beam_PostCommit_Java_VR_Dataflow_V2_Streaming/ws/src/sdks/java/container/build/target/third_party_licenses.>
Finished license_scripts.sh
> Task :sdks:java:container:java8:copyJavaThirdPartyLicenses NO-SOURCE
> Task :sdks:go:resolveBuildDependencies
Resolving golang.org/x/text: commit='23ae387dee1f90d29a23c0e87ee0b46038fbed0e', urls=[https://go.googlesource.com/text]
Resolving cached github.com/etcd-io/etcd: commit='11214aa33bf5a47d3d9d8dafe0f6b97237dfe921', urls=[https://github.com/etcd-io/etcd.git, git@github.com:etcd-io/etcd.git]
> Task :release:go-licenses:java:dockerRun
+ go-licenses save github.com/apache/beam/sdks/java/container --save_path=/output/licenses
+ go-licenses csv github.com/apache/beam/sdks/java/container
+ tee /output/licenses/list.csv
github.com/golang/protobuf,https://github.com/golang/protobuf/blob/master/LICENSE,BSD-3-Clause
google.golang.org/grpc,https://github.com/grpc/grpc-go/blob/master/LICENSE,Apache-2.0
golang.org/x/net,https://go.googlesource.com/net/+/refs/heads/master/LICENSE,BSD-3-Clause
google.golang.org/genproto/googleapis/rpc/status,https://github.com/googleapis/go-genproto/blob/master/LICENSE,Apache-2.0
github.com/apache/beam/sdks/java/container,https://github.com/apache/beam/blob/master/LICENSE,Apache-2.0
github.com/apache/beam/sdks/go/pkg/beam,https://github.com/apache/beam/blob/master/sdks/go/README.md,Apache-2.0
google.golang.org/protobuf,https://go.googlesource.com/protobuf/+/refs/heads/master/LICENSE,BSD-3-Clause
golang.org/x/sys,https://go.googlesource.com/sys/+/refs/heads/master/LICENSE,BSD-3-Clause
golang.org/x/text,https://go.googlesource.com/text/+/refs/heads/master/LICENSE,BSD-3-Clause
+ chmod -R a+w /output/licenses
> Task :release:go-licenses:java:createLicenses
> Task :sdks:java:container:java8:copyGolangLicenses
> Task :sdks:go:resolveBuildDependencies
Resolving google.golang.org/api: commit='0324d5e90dc7753607860272666845fad9ceb97e', urls=[https://code.googlesource.com/google-api-go-client]
Resolving google.golang.org/genproto: commit='4d944d34d83c502a5f761500a14d8842648415c3', urls=[https://github.com/google/go-genproto]
Resolving google.golang.org/grpc: commit='5e8f83304c0563d1ba74db05fee83d9c18ab9a58', urls=[https://github.com/grpc/grpc-go]
Resolving google.golang.org/protobuf: commit='d165be301fb1e13390ad453281ded24385fd8ebc', urls=[https://go.googlesource.com/protobuf]
Resolving cached github.com/etcd-io/etcd: commit='11214aa33bf5a47d3d9d8dafe0f6b97237dfe921', urls=[https://github.com/etcd-io/etcd.git, git@github.com:etcd-io/etcd.git]
Resolving cached github.com/etcd-io/etcd: commit='11214aa33bf5a47d3d9d8dafe0f6b97237dfe921', urls=[https://github.com/etcd-io/etcd.git, git@github.com:etcd-io/etcd.git]
> Task :sdks:go:installDependencies
> Task :sdks:go:buildLinuxAmd64
> Task :sdks:go:goBuild
> Task :sdks:java:container:resolveBuildDependencies
Resolving ./github.com/apache/beam/sdks/go@<https://ci-beam.apache.org/job/beam_PostCommit_Java_VR_Dataflow_V2_Streaming/ws/src/sdks/go>
> Task :sdks:java:container:installDependencies
> Task :sdks:java:container:buildLinuxAmd64
> Task :sdks:java:container:goBuild
> Task :sdks:java:container:java8:copySdkHarnessLauncher
Unable to watch the file system for changes. The inotify watches limit is too low.
> Task :sdks:java:container:java8:dockerPrepare
> Task :sdks:java:container:java8:docker
> Task :runners:google-cloud-dataflow-java:buildAndPushDockerContainer
WARNING: `gcloud docker` will not be supported for Docker client versions above 18.03.
As an alternative, use `gcloud auth configure-docker` to configure `docker` to
use `gcloud` as a credential helper, then use `docker` as you would for non-GCR
registries, e.g. `docker pull gcr.io/project-id/my-image`. Add
`--verbosity=error` to silence this warning: `gcloud docker
--verbosity=error -- pull gcr.io/project-id/my-image`.
See: https://cloud.google.com/container-registry/docs/support/deprecation-notices#gcloud-docker
> Task :runners:google-cloud-dataflow-java:validatesRunnerV2TestStreaming
org.apache.beam.sdk.transforms.ParDoTest$StateCoderInferenceTests > testCombiningStateCoderInference FAILED
java.lang.RuntimeException at ParDoTest.java:3360
org.apache.beam.sdk.testing.PAssertTest > testEmptyFalse FAILED
java.lang.AssertionError at PAssertTest.java:491
org.apache.beam.sdk.PipelineTest > testTupleProjectionTransform FAILED
java.lang.RuntimeException at PipelineTest.java:340
org.apache.beam.sdk.transforms.CombineTest$BasicTests > testCombinePerKeyInstanceMethodReference FAILED
java.lang.RuntimeException at CombineTest.java:934
org.apache.beam.sdk.metrics.MetricsTest$CommittedMetricTests > testCommittedDistributionMetrics FAILED
java.lang.UnsupportedOperationException at MetricsTest.java:258
223 tests completed, 5 failed, 2 skipped
> Task :runners:google-cloud-dataflow-java:validatesRunnerV2TestStreaming FAILED
> Task :runners:google-cloud-dataflow-java:cleanUpDockerImages
Digests:
- us.gcr.io/apache-beam-testing/java-postcommit-it/java@sha256:cc93d0ef3a4fd9dc8bd7e8b345084f6fe2783f24f87e4c02ff9c65f892e14fa8
Associated tags:
- 20210319120052
Tags:
- us.gcr.io/apache-beam-testing/java-postcommit-it/java:20210319120052
Deleted [us.gcr.io/apache-beam-testing/java-postcommit-it/java:20210319120052].
Deleted [us.gcr.io/apache-beam-testing/java-postcommit-it/java@sha256:cc93d0ef3a4fd9dc8bd7e8b345084f6fe2783f24f87e4c02ff9c65f892e14fa8].
FAILURE: Build failed with an exception.
* What went wrong:
Execution failed for task ':runners:google-cloud-dataflow-java:validatesRunnerV2TestStreaming'.
> There were failing tests. See the report at: file://<https://ci-beam.apache.org/job/beam_PostCommit_Java_VR_Dataflow_V2_Streaming/ws/src/runners/google-cloud-dataflow-java/build/reports/tests/validatesRunnerV2TestStreaming/index.html>
* Try:
Run with --stacktrace option to get the stack trace. Run with --info or --debug option to get more log output. Run with --scan to get full insights.
* Get more help at https://help.gradle.org
Deprecated Gradle features were used in this build, making it incompatible with Gradle 7.0.
Use '--warning-mode all' to show the individual deprecation warnings.
See https://docs.gradle.org/6.8/userguide/command_line_interface.html#sec:command_line_warnings
BUILD FAILED in 4h 16m 5s
120 actionable tasks: 82 executed, 36 from cache, 2 up-to-date
Gradle was unable to watch the file system for changes. The inotify watches limit is too low.
Publishing build scan...
https://gradle.com/s/zz6ms2louqk3s
Build step 'Invoke Gradle script' changed build result to FAILURE
Build step 'Invoke Gradle script' marked build as failure
---------------------------------------------------------------------
To unsubscribe, e-mail: builds-unsubscribe@beam.apache.org
For additional commands, e-mail: builds-help@beam.apache.org
Build failed in Jenkins:
beam_PostCommit_Java_VR_Dataflow_V2_Streaming #540
Posted by Apache Jenkins Server <je...@builds.apache.org>.
See <https://ci-beam.apache.org/job/beam_PostCommit_Java_VR_Dataflow_V2_Streaming/540/display/redirect?page=changes>
Changes:
[Kyle Weaver] [BEAM-12010] Create separate merge rules for different Calc
[Kyle Weaver] [BEAM-12010] Use simpler rule constructor so we don't have to pass null.
------------------------------------------
[...truncated 47.27 KB...]
Resolving github.com/mitchellh/go-homedir: commit='b8bc1bf767474819792c23f32d8286a45736f1c6', urls=[https://github.com/mitchellh/go-homedir.git, git@github.com:mitchellh/go-homedir.git]
Resolving github.com/mitchellh/mapstructure: commit='a4e142e9c047c904fa2f1e144d9a84e6133024bc', urls=[https://github.com/mitchellh/mapstructure.git, git@github.com:mitchellh/mapstructure.git]
Resolving github.com/nightlyone/lockfile: commit='0ad87eef1443f64d3d8c50da647e2b1552851124', urls=[https://github.com/nightlyone/lockfile, git@github.com:nightlyone/lockfile.git]
Resolving cached github.com/etcd-io/etcd: commit='11214aa33bf5a47d3d9d8dafe0f6b97237dfe921', urls=[https://github.com/etcd-io/etcd.git, git@github.com:etcd-io/etcd.git]
Resolving github.com/openzipkin/zipkin-go: commit='3741243b287094fda649c7f0fa74bd51f37dc122', urls=[https://github.com/openzipkin/zipkin-go.git, git@github.com:openzipkin/zipkin-go.git]
Resolving github.com/pelletier/go-toml: commit='acdc4509485b587f5e675510c4f2c63e90ff68a8', urls=[https://github.com/pelletier/go-toml.git, git@github.com:pelletier/go-toml.git]
Resolving cached github.com/etcd-io/etcd: commit='11214aa33bf5a47d3d9d8dafe0f6b97237dfe921', urls=[https://github.com/etcd-io/etcd.git, git@github.com:etcd-io/etcd.git]
> Task :runners:java-fn-execution:compileJava FROM-CACHE
> Task :runners:java-fn-execution:classes UP-TO-DATE
> Task :sdks:java:container:pullLicenses
Copying already-fetched licenses from <https://ci-beam.apache.org/job/beam_PostCommit_Java_VR_Dataflow_V2_Streaming/ws/src/sdks/java/container/build/reports/dependency-license> to <https://ci-beam.apache.org/job/beam_PostCommit_Java_VR_Dataflow_V2_Streaming/ws/src/sdks/java/container/build/target/java_third_party_licenses>
Already using interpreter /usr/bin/python3
Using base prefix '/usr'
New python executable in <https://ci-beam.apache.org/job/beam_PostCommit_Java_VR_Dataflow_V2_Streaming/ws/src/sdks/java/container/build/virtualenv/bin/python3>
Also creating executable in <https://ci-beam.apache.org/job/beam_PostCommit_Java_VR_Dataflow_V2_Streaming/ws/src/sdks/java/container/build/virtualenv/bin/python>
Installing setuptools, pip, wheel...
> Task :runners:java-fn-execution:jar
> Task :sdks:java:expansion-service:compileJava FROM-CACHE
> Task :sdks:java:expansion-service:classes UP-TO-DATE
> Task :sdks:java:expansion-service:jar
> Task :runners:direct-java:compileJava FROM-CACHE
> Task :runners:direct-java:classes UP-TO-DATE
> Task :runners:direct-java:shadowJar FROM-CACHE
> Task :sdks:java:io:kafka:compileJava FROM-CACHE
> Task :sdks:java:io:kafka:classes UP-TO-DATE
> Task :sdks:java:io:kafka:jar
> Task :sdks:java:io:google-cloud-platform:compileJava FROM-CACHE
> Task :sdks:java:io:google-cloud-platform:classes UP-TO-DATE
> Task :sdks:go:resolveBuildDependencies
Resolving github.com/pierrec/lz4: commit='ed8d4cc3b461464e69798080a0092bd028910298', urls=[https://github.com/pierrec/lz4.git, git@github.com:pierrec/lz4.git]
Resolving github.com/pierrec/xxHash: commit='a0006b13c722f7f12368c00a3d3c2ae8a999a0c6', urls=[https://github.com/pierrec/xxHash.git, git@github.com:pierrec/xxHash.git]
Resolving github.com/pkg/errors: commit='30136e27e2ac8d167177e8a583aa4c3fea5be833', urls=[https://github.com/pkg/errors.git, git@github.com:pkg/errors.git]
> Task :sdks:java:io:google-cloud-platform:jar
> Task :sdks:java:container:pullLicenses
done.
DEPRECATION: Python 3.5 reached the end of its life on September 13th, 2020. Please upgrade your Python as Python 3.5 is no longer maintained. pip 21.0 will drop support for Python 3.5 in January 2021. pip 21.0 will remove support for this functionality.
Collecting beautifulsoup4<5.0,>=4.9.0
Using cached beautifulsoup4-4.9.3-py3-none-any.whl (115 kB)
Collecting future<1.0.0,>=0.16.0
Using cached future-0.18.2-cp35-none-any.whl
Collecting pyyaml<6.0.0,>=3.12
Using cached PyYAML-5.3.1-cp35-cp35m-linux_x86_64.whl
Collecting tenacity<6.0,>=5.0.2
Using cached tenacity-5.1.5-py2.py3-none-any.whl (34 kB)
> Task :runners:google-cloud-dataflow-java:compileJava FROM-CACHE
> Task :runners:google-cloud-dataflow-java:classes
> Task :runners:google-cloud-dataflow-java:jar
> Task :sdks:java:io:google-cloud-platform:compileTestJava FROM-CACHE
> Task :sdks:java:io:google-cloud-platform:testClasses
> Task :sdks:java:io:google-cloud-platform:testJar
> Task :sdks:go:resolveBuildDependencies
Resolving github.com/pkg/sftp: commit='22e9c1ccc02fc1b9fa3264572e49109b68a86947', urls=[https://github.com/pkg/sftp.git, git@github.com:pkg/sftp.git]
Resolving github.com/prometheus/client_golang: commit='9bb6ab929dcbe1c8393cd9ef70387cb69811bd1c', urls=[https://github.com/prometheus/client_golang.git, git@github.com:prometheus/client_golang.git]
Resolving cached github.com/etcd-io/etcd: commit='11214aa33bf5a47d3d9d8dafe0f6b97237dfe921', urls=[https://github.com/etcd-io/etcd.git, git@github.com:etcd-io/etcd.git]
Resolving cached github.com/etcd-io/etcd: commit='11214aa33bf5a47d3d9d8dafe0f6b97237dfe921', urls=[https://github.com/etcd-io/etcd.git, git@github.com:etcd-io/etcd.git]
> Task :sdks:java:container:java8:copyDockerfileDependencies
> Task :sdks:java:container:pullLicenses
Collecting soupsieve>1.2
Using cached soupsieve-2.1-py3-none-any.whl (32 kB)
Collecting six>=1.9.0
Using cached six-1.15.0-py2.py3-none-any.whl (10 kB)
Installing collected packages: soupsieve, six, tenacity, pyyaml, future, beautifulsoup4
Successfully installed beautifulsoup4-4.9.3 future-0.18.2 pyyaml-5.3.1 six-1.15.0 soupsieve-2.1 tenacity-5.1.5
Executing <https://ci-beam.apache.org/job/beam_PostCommit_Java_VR_Dataflow_V2_Streaming/ws/src/sdks/java/container/build/virtualenv/bin/python> <https://ci-beam.apache.org/job/beam_PostCommit_Java_VR_Dataflow_V2_Streaming/ws/src/sdks/java/container/license_scripts/pull_licenses_java.py> --license_index=<https://ci-beam.apache.org/job/beam_PostCommit_Java_VR_Dataflow_V2_Streaming/ws/src/sdks/java/container/build/reports/dependency-license/index.json> --output_dir=<https://ci-beam.apache.org/job/beam_PostCommit_Java_VR_Dataflow_V2_Streaming/ws/src/sdks/java/container/build/target/java_third_party_licenses> --dep_url_yaml=<https://ci-beam.apache.org/job/beam_PostCommit_Java_VR_Dataflow_V2_Streaming/ws/src/sdks/java/container/license_scripts/dep_urls_java.yaml>
INFO:root:Pulling license for 206 dependencies using 16 threads.
INFO:root:pull_licenses_java.py succeed. It took 2.921285 seconds with 16 threads.
Copying licenses from <https://ci-beam.apache.org/job/beam_PostCommit_Java_VR_Dataflow_V2_Streaming/ws/src/sdks/java/container/build/target/java_third_party_licenses> to <https://ci-beam.apache.org/job/beam_PostCommit_Java_VR_Dataflow_V2_Streaming/ws/src/sdks/java/container/build/target/third_party_licenses.>
> Task :runners:google-cloud-dataflow-java:compileTestJava FROM-CACHE
> Task :runners:google-cloud-dataflow-java:testClasses UP-TO-DATE
> Task :runners:google-cloud-dataflow-java:testJar
> Task :sdks:go:resolveBuildDependencies
Resolving github.com/prometheus/procfs: commit='cb4147076ac75738c9a7d279075a253c0cc5acbd', urls=[https://github.com/prometheus/procfs.git, git@github.com:prometheus/procfs.git]
Resolving github.com/rcrowley/go-metrics: commit='8732c616f52954686704c8645fe1a9d59e9df7c1', urls=[https://github.com/rcrowley/go-metrics.git, git@github.com:rcrowley/go-metrics.git]
Resolving github.com/cpuguy83/go-md2man: commit='dc9f53734905c233adfc09fd4f063dce63ce3daf', urls=[https://github.com/cpuguy83/go-md2man.git, git@github.com:cpuguy83/go-md2man.git]
Resolving cached github.com/cpuguy83/go-md2man: commit='dc9f53734905c233adfc09fd4f063dce63ce3daf', urls=[https://github.com/cpuguy83/go-md2man.git, git@github.com:cpuguy83/go-md2man.git]
Resolving cached github.com/etcd-io/etcd: commit='11214aa33bf5a47d3d9d8dafe0f6b97237dfe921', urls=[https://github.com/etcd-io/etcd.git, git@github.com:etcd-io/etcd.git]
Resolving cached github.com/etcd-io/etcd: commit='11214aa33bf5a47d3d9d8dafe0f6b97237dfe921', urls=[https://github.com/etcd-io/etcd.git, git@github.com:etcd-io/etcd.git]
Resolving github.com/spf13/afero: commit='bb8f1927f2a9d3ab41c9340aa034f6b803f4359c', urls=[https://github.com/spf13/afero.git, git@github.com:spf13/afero.git]
Resolving github.com/spf13/cast: commit='acbeb36b902d72a7a4c18e8f3241075e7ab763e4', urls=[https://github.com/spf13/cast.git, git@github.com:spf13/cast.git]
Resolving github.com/spf13/cobra: commit='93959269ad99e80983c9ba742a7e01203a4c0e4f', urls=[https://github.com/spf13/cobra.git, git@github.com:spf13/cobra.git]
Resolving github.com/spf13/jwalterweatherman: commit='7c0cea34c8ece3fbeb2b27ab9b59511d360fb394', urls=[https://github.com/spf13/jwalterweatherman.git, git@github.com:spf13/jwalterweatherman.git]
Resolving cached github.com/etcd-io/etcd: commit='11214aa33bf5a47d3d9d8dafe0f6b97237dfe921', urls=[https://github.com/etcd-io/etcd.git, git@github.com:etcd-io/etcd.git]
Resolving github.com/spf13/viper: commit='aafc9e6bc7b7bb53ddaa75a5ef49a17d6e654be5', urls=[https://github.com/spf13/viper.git, git@github.com:spf13/viper.git]
Resolving github.com/stathat/go: commit='74669b9f388d9d788c97399a0824adbfee78400e', urls=[https://github.com/stathat/go.git, git@github.com:stathat/go.git]
Resolving cached github.com/etcd-io/etcd: commit='11214aa33bf5a47d3d9d8dafe0f6b97237dfe921', urls=[https://github.com/etcd-io/etcd.git, git@github.com:etcd-io/etcd.git]
Resolving cached github.com/etcd-io/etcd: commit='11214aa33bf5a47d3d9d8dafe0f6b97237dfe921', urls=[https://github.com/etcd-io/etcd.git, git@github.com:etcd-io/etcd.git]
Resolving cached github.com/etcd-io/etcd: commit='11214aa33bf5a47d3d9d8dafe0f6b97237dfe921', urls=[https://github.com/etcd-io/etcd.git, git@github.com:etcd-io/etcd.git]
Resolving cached github.com/etcd-io/etcd: commit='11214aa33bf5a47d3d9d8dafe0f6b97237dfe921', urls=[https://github.com/etcd-io/etcd.git, git@github.com:etcd-io/etcd.git]
Resolving github.com/xordataexchange/crypt: commit='b2862e3d0a775f18c7cfe02273500ae307b61218', urls=[https://github.com/xordataexchange/crypt.git, git@github.com:xordataexchange/crypt.git]
Resolving go.opencensus.io: commit='3fb168f674736c026e623310bfccb0691e6dec8a', urls=[https://github.com/census-instrumentation/opencensus-go]
> Task :sdks:java:container:pullLicenses
Finished license_scripts.sh
> Task :sdks:java:container:java8:copyJavaThirdPartyLicenses NO-SOURCE
> Task :sdks:go:resolveBuildDependencies
Resolving golang.org/x/crypto: commit='d9133f5469342136e669e85192a26056b587f503', urls=[https://go.googlesource.com/crypto]
Resolving golang.org/x/debug: commit='95515998a8a4bd7448134b2cb5971dbeb12e0b77', urls=[https://go.googlesource.com/debug]
Resolving golang.org/x/net: commit='2fb46b16b8dda405028c50f7c7f0f9dd1fa6bfb1', urls=[https://go.googlesource.com/net]
Resolving golang.org/x/oauth2: commit='5d25da1a8d43b66f2898c444f899c7bcfd6a407e', urls=[https://go.googlesource.com/oauth2]
Resolving golang.org/x/sync: commit='fd80eb99c8f653c847d294a001bdf2a3a6f768f5', urls=[https://go.googlesource.com/sync]
Resolving golang.org/x/sys: commit='fde4db37ae7ad8191b03d30d27f258b5291ae4e3', urls=[https://go.googlesource.com/sys]
> Task :release:go-licenses:java:dockerRun
+ go-licenses save github.com/apache/beam/sdks/java/container --save_path=/output/licenses
+ go-licenses csv github.com/apache/beam/sdks/java/container
+ tee /output/licenses/list.csv
github.com/apache/beam/sdks/go/pkg/beam,https://github.com/apache/beam/blob/master/sdks/go/README.md,Apache-2.0
github.com/golang/protobuf,https://github.com/golang/protobuf/blob/master/LICENSE,BSD-3-Clause
google.golang.org/protobuf,https://go.googlesource.com/protobuf/+/refs/heads/master/LICENSE,BSD-3-Clause
golang.org/x/net,https://go.googlesource.com/net/+/refs/heads/master/LICENSE,BSD-3-Clause
golang.org/x/sys,https://go.googlesource.com/sys/+/refs/heads/master/LICENSE,BSD-3-Clause
github.com/apache/beam/sdks/java/container,https://github.com/apache/beam/blob/master/LICENSE,Apache-2.0
google.golang.org/grpc,https://github.com/grpc/grpc-go/blob/master/LICENSE,Apache-2.0
google.golang.org/genproto/googleapis/rpc/status,https://github.com/googleapis/go-genproto/blob/master/LICENSE,Apache-2.0
golang.org/x/text,https://go.googlesource.com/text/+/refs/heads/master/LICENSE,BSD-3-Clause
+ chmod -R a+w /output/licenses
> Task :sdks:go:resolveBuildDependencies
Resolving golang.org/x/text: commit='23ae387dee1f90d29a23c0e87ee0b46038fbed0e', urls=[https://go.googlesource.com/text]
Resolving cached github.com/etcd-io/etcd: commit='11214aa33bf5a47d3d9d8dafe0f6b97237dfe921', urls=[https://github.com/etcd-io/etcd.git, git@github.com:etcd-io/etcd.git]
> Task :release:go-licenses:java:createLicenses
> Task :sdks:java:container:java8:copyGolangLicenses
> Task :sdks:go:resolveBuildDependencies
Resolving google.golang.org/api: commit='0324d5e90dc7753607860272666845fad9ceb97e', urls=[https://code.googlesource.com/google-api-go-client]
Resolving google.golang.org/genproto: commit='4d944d34d83c502a5f761500a14d8842648415c3', urls=[https://github.com/google/go-genproto]
Resolving google.golang.org/grpc: commit='5e8f83304c0563d1ba74db05fee83d9c18ab9a58', urls=[https://github.com/grpc/grpc-go]
Resolving google.golang.org/protobuf: commit='d165be301fb1e13390ad453281ded24385fd8ebc', urls=[https://go.googlesource.com/protobuf]
Resolving cached github.com/etcd-io/etcd: commit='11214aa33bf5a47d3d9d8dafe0f6b97237dfe921', urls=[https://github.com/etcd-io/etcd.git, git@github.com:etcd-io/etcd.git]
Resolving cached github.com/etcd-io/etcd: commit='11214aa33bf5a47d3d9d8dafe0f6b97237dfe921', urls=[https://github.com/etcd-io/etcd.git, git@github.com:etcd-io/etcd.git]
> Task :sdks:go:installDependencies
> Task :sdks:go:buildLinuxAmd64
> Task :sdks:go:goBuild
> Task :sdks:java:container:resolveBuildDependencies
Unable to watch the file system for changes. The inotify watches limit is too low.
Resolving ./github.com/apache/beam/sdks/go@<https://ci-beam.apache.org/job/beam_PostCommit_Java_VR_Dataflow_V2_Streaming/ws/src/sdks/go>
> Task :sdks:java:container:installDependencies
> Task :sdks:java:container:buildLinuxAmd64
> Task :sdks:java:container:goBuild
> Task :sdks:java:container:java8:copySdkHarnessLauncher
> Task :sdks:java:container:java8:dockerPrepare
> Task :sdks:java:container:java8:docker
> Task :runners:google-cloud-dataflow-java:buildAndPushDockerContainer
WARNING: `gcloud docker` will not be supported for Docker client versions above 18.03.
As an alternative, use `gcloud auth configure-docker` to configure `docker` to
use `gcloud` as a credential helper, then use `docker` as you would for non-GCR
registries, e.g. `docker pull gcr.io/project-id/my-image`. Add
`--verbosity=error` to silence this warning: `gcloud docker
--verbosity=error -- pull gcr.io/project-id/my-image`.
See: https://cloud.google.com/container-registry/docs/support/deprecation-notices#gcloud-docker
> Task :runners:google-cloud-dataflow-java:validatesRunnerV2TestStreaming
org.apache.beam.sdk.testing.PAssertTest > testAssertionSiteIsCapturedWithMessage FAILED
java.lang.AssertionError at PAssertTest.java:531
org.apache.beam.sdk.testing.PAssertTest > testContainsInAnyOrder FAILED
java.lang.RuntimeException at PAssertTest.java:401
org.apache.beam.sdk.transforms.ReshuffleTest > testJustReshuffle FAILED
java.lang.RuntimeException at ReshuffleTest.java:102
org.apache.beam.sdk.transforms.CombineTest$WindowingTests > testWindowedCombineEmpty FAILED
java.lang.RuntimeException at CombineTest.java:1330
org.apache.beam.sdk.transforms.ViewTest > testIterableSideInputIsImmutable FAILED
java.lang.RuntimeException at ViewTest.java:547
org.apache.beam.sdk.transforms.CombineTest$WindowingTests > testCombineGloballyInstanceMethodReference FAILED
java.lang.RuntimeException at CombineTest.java:1433
org.apache.beam.sdk.transforms.ViewTest > testWindowedMapAsEntrySetSideInput FAILED
java.lang.RuntimeException at ViewTest.java:1141
org.apache.beam.sdk.transforms.GroupByKeyTest > org.apache.beam.sdk.transforms.GroupByKeyTest$BasicTests.testTimestampCombinerEarliest FAILED
java.lang.RuntimeException at GroupByKeyTest.java:374
org.apache.beam.sdk.transforms.ParDoTest$MultipleInputsAndOutputTests > testMultiOutputParDoWithSideInputsIsCumulative FAILED
java.lang.RuntimeException at ParDoTest.java:1244
org.apache.beam.sdk.transforms.ParDoTest$MultipleInputsAndOutputTests > testParDoWithSideInputs FAILED
java.lang.RuntimeException at ParDoTest.java:817
org.apache.beam.sdk.transforms.ParDoLifecycleTest > testFnCallSequenceStateful FAILED
java.lang.RuntimeException at ParDoLifecycleTest.java:108
org.apache.beam.sdk.metrics.MetricsTest$CommittedMetricTests > testCommittedDistributionMetrics FAILED
java.lang.UnsupportedOperationException at MetricsTest.java:258
223 tests completed, 12 failed, 2 skipped
> Task :runners:google-cloud-dataflow-java:validatesRunnerV2TestStreaming FAILED
> Task :runners:google-cloud-dataflow-java:cleanUpDockerImages
Digests:
- us.gcr.io/apache-beam-testing/java-postcommit-it/java@sha256:fe2c8e3f16b09363b3fb74dfaba5c20ec7851d382927adf9cad24923bb4939ad
Associated tags:
- 20210319060103
Tags:
- us.gcr.io/apache-beam-testing/java-postcommit-it/java:20210319060103
Deleted [us.gcr.io/apache-beam-testing/java-postcommit-it/java:20210319060103].
Deleted [us.gcr.io/apache-beam-testing/java-postcommit-it/java@sha256:fe2c8e3f16b09363b3fb74dfaba5c20ec7851d382927adf9cad24923bb4939ad].
FAILURE: Build failed with an exception.
* What went wrong:
Execution failed for task ':runners:google-cloud-dataflow-java:validatesRunnerV2TestStreaming'.
> There were failing tests. See the report at: file://<https://ci-beam.apache.org/job/beam_PostCommit_Java_VR_Dataflow_V2_Streaming/ws/src/runners/google-cloud-dataflow-java/build/reports/tests/validatesRunnerV2TestStreaming/index.html>
* Try:
Run with --stacktrace option to get the stack trace. Run with --info or --debug option to get more log output. Run with --scan to get full insights.
* Get more help at https://help.gradle.org
Deprecated Gradle features were used in this build, making it incompatible with Gradle 7.0.
Use '--warning-mode all' to show the individual deprecation warnings.
See https://docs.gradle.org/6.8/userguide/command_line_interface.html#sec:command_line_warnings
BUILD FAILED in 4h 42m 44s
120 actionable tasks: 82 executed, 36 from cache, 2 up-to-date
Gradle was unable to watch the file system for changes. The inotify watches limit is too low.
Publishing build scan...
https://gradle.com/s/cvyk5rajslyhc
Build step 'Invoke Gradle script' changed build result to FAILURE
Build step 'Invoke Gradle script' marked build as failure
---------------------------------------------------------------------
To unsubscribe, e-mail: builds-unsubscribe@beam.apache.org
For additional commands, e-mail: builds-help@beam.apache.org