You are viewing a plain text version of this content. The canonical link for it is here.
Posted to commits@tamaya.apache.org by Apache Jenkins Server <je...@builds.apache.org> on 2015/01/24 23:44:33 UTC

Build failed in Jenkins: Tamaya-Master-branch #179

See <https://builds.apache.org/job/Tamaya-Master-branch/179/changes>

Changes:

[plexus] TAMAYA-60 Started to extract a common base class out ouf DefaultConfigurationContext.

------------------------------------------
[...truncated 1147 lines...]
[INFO] --- findbugs-maven-plugin:3.0.0:check (findbugs-analyze) @ tamaya-api ---
[INFO] BugInstance size is 0
[INFO] Error size is 0
[INFO] No errors/warnings found
[INFO] 
[INFO] --- maven-checkstyle-plugin:2.13:check (verify-style) @ tamaya-api ---
[INFO] 
[INFO] 
[INFO] --- maven-resources-plugin:2.6:testResources (default-testResources) @ tamaya-api ---
[INFO] Using 'UTF-8' encoding to copy filtered resources.
[INFO] Copying 3 resources
[INFO] Copying 3 resources
[INFO] Copying 3 resources
[INFO] 
[INFO] --- maven-compiler-plugin:3.1:testCompile (default-testCompile) @ tamaya-api ---
[INFO] Nothing to compile - all classes are up to date
[INFO] 
[INFO] --- maven-surefire-plugin:2.17:test (default-test) @ tamaya-api ---
[INFO] Skipping execution of surefire because it has already been run for this configuration
[JENKINS] Recording test results
[INFO] 
[INFO] --- maven-jar-plugin:2.5:jar (default-jar) @ tamaya-api ---
[INFO] 
[INFO] --- maven-site-plugin:3.3:attach-descriptor (attach-descriptor) @ tamaya-api ---
[INFO] 
[INFO] --- maven-javadoc-plugin:2.9.1:jar (attach-javadocs) @ tamaya-api ---
[INFO] Skipping javadoc generation
[INFO] 
[INFO] --- maven-install-plugin:2.5.2:install (default-install) @ tamaya-api ---
[INFO] Installing <https://builds.apache.org/job/Tamaya-Master-branch/ws/java8/api/target/tamaya-api-0.1-incubating-SNAPSHOT.jar> to /home/jenkins/jenkins-slave/maven-repositories/0/org/apache/tamaya/tamaya-api/0.1-incubating-SNAPSHOT/tamaya-api-0.1-incubating-SNAPSHOT.jar
[INFO] Installing <https://builds.apache.org/job/Tamaya-Master-branch/ws/java8/api/pom.xml> to /home/jenkins/jenkins-slave/maven-repositories/0/org/apache/tamaya/tamaya-api/0.1-incubating-SNAPSHOT/tamaya-api-0.1-incubating-SNAPSHOT.pom
[INFO] 
[INFO] --- maven-deploy-plugin:2.8.2:deploy (default-deploy) @ tamaya-api ---
[INFO] Downloading: https://repository.apache.org/content/repositories/snapshots/org/apache/tamaya/tamaya-api/0.1-incubating-SNAPSHOT/maven-metadata.xml
[INFO] Downloaded: https://repository.apache.org/content/repositories/snapshots/org/apache/tamaya/tamaya-api/0.1-incubating-SNAPSHOT/maven-metadata.xml (807 B at 9.6 KB/sec)
[INFO] Uploading: https://repository.apache.org/content/repositories/snapshots/org/apache/tamaya/tamaya-api/0.1-incubating-SNAPSHOT/tamaya-api-0.1-incubating-20150124.224403-47.jar
[INFO] Uploaded: https://repository.apache.org/content/repositories/snapshots/org/apache/tamaya/tamaya-api/0.1-incubating-SNAPSHOT/tamaya-api-0.1-incubating-20150124.224403-47.jar (17 KB at 1.1 KB/sec)
[INFO] Uploading: https://repository.apache.org/content/repositories/snapshots/org/apache/tamaya/tamaya-api/0.1-incubating-SNAPSHOT/tamaya-api-0.1-incubating-20150124.224403-47.pom
[INFO] Uploaded: https://repository.apache.org/content/repositories/snapshots/org/apache/tamaya/tamaya-api/0.1-incubating-SNAPSHOT/tamaya-api-0.1-incubating-20150124.224403-47.pom (2 KB at 1.0 KB/sec)
[INFO] Downloading: https://repository.apache.org/content/repositories/snapshots/org/apache/tamaya/tamaya-api/maven-metadata.xml
[INFO] Downloaded: https://repository.apache.org/content/repositories/snapshots/org/apache/tamaya/tamaya-api/maven-metadata.xml (490 B at 2.3 KB/sec)
[INFO] Uploading: https://repository.apache.org/content/repositories/snapshots/org/apache/tamaya/tamaya-api/0.1-incubating-SNAPSHOT/maven-metadata.xml
[INFO] Uploaded: https://repository.apache.org/content/repositories/snapshots/org/apache/tamaya/tamaya-api/0.1-incubating-SNAPSHOT/maven-metadata.xml (807 B at 1.9 KB/sec)
[INFO] Uploading: https://repository.apache.org/content/repositories/snapshots/org/apache/tamaya/tamaya-api/maven-metadata.xml
[INFO] Uploaded: https://repository.apache.org/content/repositories/snapshots/org/apache/tamaya/tamaya-api/maven-metadata.xml (490 B at 2.1 KB/sec)
[INFO]                                                                         
[INFO] ------------------------------------------------------------------------
[INFO] Building Apache Tamaya Java 8 Core 0.1-incubating-SNAPSHOT
[INFO] ------------------------------------------------------------------------
[INFO] 
[INFO] --- maven-clean-plugin:2.5:clean (default-clean) @ tamaya-core ---
[INFO] Deleting <https://builds.apache.org/job/Tamaya-Master-branch/ws/java8/core/target>
[INFO] 
[INFO] --- maven-enforcer-plugin:1.3.1:enforce (enforce-versions) @ tamaya-core ---
[INFO] 
[INFO] --- apache-rat-plugin:0.11:check (default) @ tamaya-core ---
[INFO] 51 implicit excludes (use -debug for more details).
[INFO] Exclude: **/*/MANIFEST.MF
[INFO] Exclude: .git
[INFO] Exclude: .gitignore
[INFO] Exclude: derby.log
[INFO] Exclude: **/META-INF/services/*
[INFO] Exclude: **/bootstrap-*
[INFO] Exclude: **/js/jquery-*
[INFO] Exclude: **/*.json
[INFO] 50 resources included (use -debug for more details)
Warning:  org.apache.xerces.jaxp.SAXParserImpl$JAXPSAXParser: Property 'http://www.oracle.com/xml/jaxp/properties/entityExpansionLimit' is not recognized.
Compiler warnings:
  WARNING:  'org.apache.xerces.jaxp.SAXParserImpl: Property 'http://javax.xml.XMLConstants/property/accessExternalDTD' is not recognized.'
Warning:  org.apache.xerces.parsers.SAXParser: Feature 'http://javax.xml.XMLConstants/feature/secure-processing' is not recognized.
Warning:  org.apache.xerces.parsers.SAXParser: Property 'http://javax.xml.XMLConstants/property/accessExternalDTD' is not recognized.
Warning:  org.apache.xerces.parsers.SAXParser: Property 'http://www.oracle.com/xml/jaxp/properties/entityExpansionLimit' is not recognized.
[INFO] Rat check: Summary of files. Unapproved: 0 unknown: 0 generated: 0 approved: 50 licence.
[INFO] 
[INFO] --- maven-remote-resources-plugin:1.5:process (default) @ tamaya-core ---
[INFO] 
[INFO] --- maven-resources-plugin:2.6:resources (default-resources) @ tamaya-core ---
[INFO] Using 'UTF-8' encoding to copy filtered resources.
[INFO] Copying 7 resources
[INFO] Copying 3 resources
[INFO] 
[INFO] --- maven-compiler-plugin:3.1:compile (default-compile) @ tamaya-core ---
[INFO] Changes detected - recompiling the module!
[INFO] Compiling 32 source files to <https://builds.apache.org/job/Tamaya-Master-branch/ws/java8/core/target/classes>
[WARNING] <https://builds.apache.org/job/Tamaya-Master-branch/ws/java8/core/src/main/java/org/apache/tamaya/core/internal/DefaultServiceContext.java>: Some input files use unchecked or unsafe operations.
[WARNING] <https://builds.apache.org/job/Tamaya-Master-branch/ws/java8/core/src/main/java/org/apache/tamaya/core/internal/DefaultServiceContext.java>: Recompile with -Xlint:unchecked for details.
[INFO] 
[INFO] >>> findbugs-maven-plugin:3.0.0:check (findbugs-analyze) @ tamaya-core >>>
[INFO] 
[INFO] --- findbugs-maven-plugin:3.0.0:findbugs (findbugs) @ tamaya-core ---
[INFO] Fork Value is true
[INFO] Done FindBugs Analysis....
[INFO] 
[INFO] <<< findbugs-maven-plugin:3.0.0:check (findbugs-analyze) @ tamaya-core <<<
[INFO] 
[INFO] --- findbugs-maven-plugin:3.0.0:check (findbugs-analyze) @ tamaya-core ---
[INFO] BugInstance size is 0
[INFO] Error size is 0
[INFO] No errors/warnings found
[INFO] 
[INFO] --- maven-checkstyle-plugin:2.13:check (verify-style) @ tamaya-core ---
[INFO] 
[INFO] There are 1 checkstyle errors.
[ERROR] DefaultConfigurationContext.java[22:8] (imports) UnusedImports: Unused import - org.apache.tamaya.spi.ConfigurationContext.
[INFO] ------------------------------------------------------------------------
[INFO] Reactor Summary:
[INFO] 
[INFO] Apache Tamaya ..................................... SUCCESS [  7.415 s]
[INFO] Apache Tamaya Build Configuration ................. SUCCESS [  3.238 s]
[INFO] Apache Tamaya Java 7 Parent ....................... SUCCESS [  4.255 s]
[INFO] Apache Tamaya Java 7 API .......................... SUCCESS [ 25.533 s]
[INFO] Apache Tamaya Java 7 Core ......................... SUCCESS [ 22.927 s]
[INFO] Apache Tamaya Java 8 Parent ....................... SUCCESS [  5.472 s]
[INFO] Apache Tamaya Java 8 API .......................... SUCCESS [ 29.737 s]
[INFO] Apache Tamaya Java 8 Core ......................... FAILURE [  7.584 s]
[INFO] Apache Tamaya Extension Modules ................... SKIPPED
[INFO] Apache Tamaya Builder ............................. SKIPPED
[INFO] Apache Tamaya Resource Services ................... SKIPPED
[INFO] Apache Tamaya Resolver Services ................... SKIPPED
[INFO] Apache Tamaya Injection Support ................... SKIPPED
[INFO] Apache Tamaya Format Services ..................... SKIPPED
[INFO] Apache Tamaya JSON Support ........................ SKIPPED
[INFO] ------------------------------------------------------------------------
[INFO] BUILD FAILURE
[INFO] ------------------------------------------------------------------------
[INFO] Total time: 01:52 min
[INFO] Finished at: 2015-01-24T22:44:30+00:00
[INFO] Final Memory: 56M/634M
[INFO] ------------------------------------------------------------------------
[ERROR] Failed to execute goal org.apache.maven.plugins:maven-checkstyle-plugin:2.13:check (verify-style) on project tamaya-core: You have 1 Checkstyle violation. -> [Help 1]
[ERROR] 
[ERROR] To see the full stack trace of the errors, re-run Maven with the -e switch.
[ERROR] Re-run Maven using the -X switch to enable full debug logging.
[ERROR] 
[ERROR] For more information about the errors and possible solutions, please read the following articles:
[ERROR] [Help 1] http://cwiki.apache.org/confluence/display/MAVEN/MojoFailureException
[ERROR] 
[ERROR] After correcting the problems, you can resume the build with the command
[ERROR]   mvn <goals> -rf :tamaya-core
[JENKINS] Archiving <https://builds.apache.org/job/Tamaya-Master-branch/ws/modules/injection/pom.xml> to org.apache.tamaya.ext/tamaya-injection/0.1-incubating-SNAPSHOT/tamaya-injection-0.1-incubating-SNAPSHOT.pom
Sending artifact delta relative to Tamaya-Master-branch » Apache Tamaya Injection Support #177
Archived 1 artifacts
Archive block size is 32768
Received 0 blocks and 2317 bytes
Compression is 0.0%
Took 28 ms
[JENKINS] Archiving <https://builds.apache.org/job/Tamaya-Master-branch/ws/java7/core/pom.xml> to org.apache.tamaya/tamaya-java7-core/0.1-incubating-SNAPSHOT/tamaya-java7-core-0.1-incubating-SNAPSHOT.pom
[JENKINS] Archiving <https://builds.apache.org/job/Tamaya-Master-branch/ws/java7/core/target/tamaya-java7-core-0.1-incubating-SNAPSHOT.jar> to org.apache.tamaya/tamaya-java7-core/0.1-incubating-20150124.224337-4/tamaya-java7-core-0.1-incubating-20150124.224337-4.jar
Sending artifact delta relative to Tamaya-Master-branch » Apache Tamaya Java 7 Core #178
Archived 2 artifacts
Archive block size is 32768
Received 0 blocks and 50859 bytes
Compression is 0.0%
Took 0.12 sec
[JENKINS] Archiving <https://builds.apache.org/job/Tamaya-Master-branch/ws/modules/json/pom.xml> to org.apache.tamaya.ext/json/0.1-incubating-SNAPSHOT/json-0.1-incubating-SNAPSHOT.pom
Sending artifact delta relative to Tamaya-Master-branch » Apache Tamaya JSON Support #177
Archived 1 artifacts
Archive block size is 32768
Received 0 blocks and 2661 bytes
Compression is 0.0%
Took 28 ms
[JENKINS] Archiving <https://builds.apache.org/job/Tamaya-Master-branch/ws/modules/resolver/pom.xml> to org.apache.tamaya.ext/tamaya-resolver/0.1-incubating-SNAPSHOT/tamaya-resolver-0.1-incubating-SNAPSHOT.pom
Sending artifact delta relative to Tamaya-Master-branch » Apache Tamaya Resolver Services #177
Archived 1 artifacts
Archive block size is 32768
Received 0 blocks and 2311 bytes
Compression is 0.0%
Took 28 ms
[JENKINS] Archiving <https://builds.apache.org/job/Tamaya-Master-branch/ws/java8/pom.xml> to org.apache.tamaya/tamaya-java8/0.1-incubating-SNAPSHOT/tamaya-java8-0.1-incubating-SNAPSHOT.pom
Sending artifact delta relative to Tamaya-Master-branch » Apache Tamaya Java 8 Parent #178
Archived 1 artifacts
Archive block size is 32768
Received 0 blocks and 3741 bytes
Compression is 0.0%
Took 40 ms
[JENKINS] Archiving <https://builds.apache.org/job/Tamaya-Master-branch/ws/modules/formats/pom.xml> to org.apache.tamaya.ext/tamaya-formats/0.1-incubating-SNAPSHOT/tamaya-formats-0.1-incubating-SNAPSHOT.pom
Sending artifact delta relative to Tamaya-Master-branch » Apache Tamaya Format Services #177
Archived 1 artifacts
Archive block size is 32768
Received 0 blocks and 2113 bytes
Compression is 0.0%
Took 28 ms
[JENKINS] Archiving <https://builds.apache.org/job/Tamaya-Master-branch/ws/java8/core/pom.xml> to org.apache.tamaya/tamaya-core/0.1-incubating-SNAPSHOT/tamaya-core-0.1-incubating-SNAPSHOT.pom
Sending artifact delta relative to Tamaya-Master-branch » Apache Tamaya Java 8 Core #178
Archived 1 artifacts
Archive block size is 32768
Received 0 blocks and 2222 bytes
Compression is 0.0%
Took 37 ms
[JENKINS] Archiving <https://builds.apache.org/job/Tamaya-Master-branch/ws/java7/pom.xml> to org.apache.tamaya/tamaya-java7/0.1-incubating-SNAPSHOT/tamaya-java7-0.1-incubating-SNAPSHOT.pom
Sending artifact delta relative to Tamaya-Master-branch » Apache Tamaya Java 7 Parent #178
Archived 1 artifacts
Archive block size is 32768
Received 0 blocks and 4284 bytes
Compression is 0.0%
Took 62 ms
[JENKINS] Archiving <https://builds.apache.org/job/Tamaya-Master-branch/ws/pom.xml> to org.apache.tamaya/tamaya-all/0.1-incubating-SNAPSHOT/tamaya-all-0.1-incubating-SNAPSHOT.pom
Sending artifact delta relative to Tamaya-Master-branch » Apache Tamaya #178
Archived 1 artifacts
Archive block size is 32768
Received 0 blocks and 26128 bytes
Compression is 0.0%
Took 31 ms
[JENKINS] Archiving <https://builds.apache.org/job/Tamaya-Master-branch/ws/modules/builder/pom.xml> to org.apache.tamaya.ext/tamaya-builder/0.1-incubating-SNAPSHOT/tamaya-builder-0.1-incubating-SNAPSHOT.pom
Sending artifact delta relative to Tamaya-Master-branch » Apache Tamaya Builder #177
Archived 1 artifacts
Archive block size is 32768
Received 0 blocks and 2280 bytes
Compression is 0.0%
Took 28 ms
[JENKINS] Archiving <https://builds.apache.org/job/Tamaya-Master-branch/ws/modules/pom.xml> to org.apache.tamaya.ext/tamaya-extensions/0.1-incubating-SNAPSHOT/tamaya-extensions-0.1-incubating-SNAPSHOT.pom
Sending artifact delta relative to Tamaya-Master-branch » Apache Tamaya Extension Modules #178
Archived 1 artifacts
Archive block size is 32768
Received 0 blocks and 4144 bytes
Compression is 0.0%
Took 29 ms
[JENKINS] Archiving <https://builds.apache.org/job/Tamaya-Master-branch/ws/java8/api/pom.xml> to org.apache.tamaya/tamaya-api/0.1-incubating-SNAPSHOT/tamaya-api-0.1-incubating-SNAPSHOT.pom
[JENKINS] Archiving <https://builds.apache.org/job/Tamaya-Master-branch/ws/java8/api/target/tamaya-api-0.1-incubating-SNAPSHOT.jar> to org.apache.tamaya/tamaya-api/0.1-incubating-20150124.224403-47/tamaya-api-0.1-incubating-20150124.224403-47.jar
Sending artifact delta relative to Tamaya-Master-branch » Apache Tamaya Java 8 API #178
Archived 2 artifacts
Archive block size is 32768
Received 0 blocks and 18599 bytes
Compression is 0.0%
Took 32 ms
[JENKINS] Archiving <https://builds.apache.org/job/Tamaya-Master-branch/ws/modules/resources/pom.xml> to org.apache.tamaya.ext/tamaya-resources/0.1-incubating-SNAPSHOT/tamaya-resources-0.1-incubating-SNAPSHOT.pom
Sending artifact delta relative to Tamaya-Master-branch » Apache Tamaya Resource Services #177
Archived 1 artifacts
Archive block size is 32768
Received 0 blocks and 1853 bytes
Compression is 0.0%
Took 28 ms
[JENKINS] Archiving <https://builds.apache.org/job/Tamaya-Master-branch/ws/java7/api/pom.xml> to org.apache.tamaya/tamaya-java7-api/0.1-incubating-SNAPSHOT/tamaya-java7-api-0.1-incubating-SNAPSHOT.pom
[JENKINS] Archiving <https://builds.apache.org/job/Tamaya-Master-branch/ws/java7/api/target/tamaya-java7-api-0.1-incubating-SNAPSHOT.jar> to org.apache.tamaya/tamaya-java7-api/0.1-incubating-20150124.224313-51/tamaya-java7-api-0.1-incubating-20150124.224313-51.jar
Sending artifact delta relative to Tamaya-Master-branch » Apache Tamaya Java 7 API #178
Archived 2 artifacts
Archive block size is 32768
Received 0 blocks and 17475 bytes
Compression is 0.0%
Took 0.1 sec
[JENKINS] Archiving <https://builds.apache.org/job/Tamaya-Master-branch/ws/buildconfigurations/pom.xml> to org.apache.tamaya/buildconfigurations/0.1-incubating-SNAPSHOT/buildconfigurations-0.1-incubating-SNAPSHOT.pom
[JENKINS] Archiving <https://builds.apache.org/job/Tamaya-Master-branch/ws/buildconfigurations/target/buildconfigurations-0.1-incubating-SNAPSHOT.jar> to org.apache.tamaya/buildconfigurations/0.1-incubating-20150124.224249-31/buildconfigurations-0.1-incubating-20150124.224249-31.jar
Sending artifact delta relative to Tamaya-Master-branch » Apache Tamaya Build Configuration #178
Archived 2 artifacts
Archive block size is 32768
Received 0 blocks and 10692 bytes
Compression is 0.0%
Took 63 ms
channel stopped

Jenkins build is back to normal : Tamaya-Master-branch #182

Posted by Apache Jenkins Server <je...@builds.apache.org>.
See <https://builds.apache.org/job/Tamaya-Master-branch/182/changes>


Build failed in Jenkins: Tamaya-Master-branch #181

Posted by Apache Jenkins Server <je...@builds.apache.org>.
See <https://builds.apache.org/job/Tamaya-Master-branch/181/changes>

Changes:

[plexus] TAMAYA-60 Small changes to the core implementation of some classes needed for the builder.

------------------------------------------
[...truncated 1546 lines...]
[INFO] 
[INFO] --- apache-rat-plugin:0.11:check (default) @ tamaya-extensions ---
[INFO] 57 implicit excludes (use -debug for more details).
[INFO] Exclude: **/*/MANIFEST.MF
[INFO] Exclude: .git
[INFO] Exclude: .gitignore
[INFO] Exclude: derby.log
[INFO] Exclude: **/META-INF/services/*
[INFO] Exclude: **/bootstrap-*
[INFO] Exclude: **/js/jquery-*
[INFO] Exclude: **/*.json
[INFO] 1 resources included (use -debug for more details)
Warning:  org.apache.xerces.jaxp.SAXParserImpl$JAXPSAXParser: Property 'http://www.oracle.com/xml/jaxp/properties/entityExpansionLimit' is not recognized.
Compiler warnings:
  WARNING:  'org.apache.xerces.jaxp.SAXParserImpl: Property 'http://javax.xml.XMLConstants/property/accessExternalDTD' is not recognized.'
Warning:  org.apache.xerces.parsers.SAXParser: Feature 'http://javax.xml.XMLConstants/feature/secure-processing' is not recognized.
Warning:  org.apache.xerces.parsers.SAXParser: Property 'http://javax.xml.XMLConstants/property/accessExternalDTD' is not recognized.
Warning:  org.apache.xerces.parsers.SAXParser: Property 'http://www.oracle.com/xml/jaxp/properties/entityExpansionLimit' is not recognized.
[INFO] Rat check: Summary of files. Unapproved: 0 unknown: 0 generated: 0 approved: 1 licence.
[INFO] 
[INFO] --- maven-remote-resources-plugin:1.5:process (default) @ tamaya-extensions ---
[INFO] 
[INFO] >>> findbugs-maven-plugin:3.0.0:check (findbugs-analyze) @ tamaya-extensions >>>
[INFO] 
[INFO] --- findbugs-maven-plugin:3.0.0:findbugs (findbugs) @ tamaya-extensions ---
[INFO] 
[INFO] <<< findbugs-maven-plugin:3.0.0:check (findbugs-analyze) @ tamaya-extensions <<<
[INFO] 
[INFO] --- findbugs-maven-plugin:3.0.0:check (findbugs-analyze) @ tamaya-extensions ---
[INFO] 
[INFO] --- maven-checkstyle-plugin:2.13:check (verify-style) @ tamaya-extensions ---
[INFO] 
[INFO] 
[INFO] --- maven-site-plugin:3.3:attach-descriptor (attach-descriptor) @ tamaya-extensions ---
[INFO] 
[INFO] --- maven-javadoc-plugin:2.9.1:jar (attach-javadocs) @ tamaya-extensions ---
[INFO] Skipping javadoc generation
[INFO] 
[INFO] --- maven-install-plugin:2.5.2:install (default-install) @ tamaya-extensions ---
[INFO] Installing <https://builds.apache.org/job/Tamaya-Master-branch/ws/modules/pom.xml> to /home/jenkins/jenkins-slave/maven-repositories/0/org/apache/tamaya/ext/tamaya-extensions/0.1-incubating-SNAPSHOT/tamaya-extensions-0.1-incubating-SNAPSHOT.pom
[INFO] 
[INFO] --- maven-enforcer-plugin:1.3.1:enforce (enforce-versions) @ tamaya-extensions ---
[INFO] 
[INFO] --- apache-rat-plugin:0.11:check (default) @ tamaya-extensions ---
[INFO] 57 implicit excludes (use -debug for more details).
[INFO] Exclude: **/*/MANIFEST.MF
[INFO] Exclude: .git
[INFO] Exclude: .gitignore
[INFO] Exclude: derby.log
[INFO] Exclude: **/META-INF/services/*
[INFO] Exclude: **/bootstrap-*
[INFO] Exclude: **/js/jquery-*
[INFO] Exclude: **/*.json
[INFO] 1 resources included (use -debug for more details)
Warning:  org.apache.xerces.jaxp.SAXParserImpl$JAXPSAXParser: Property 'http://www.oracle.com/xml/jaxp/properties/entityExpansionLimit' is not recognized.
Compiler warnings:
  WARNING:  'org.apache.xerces.jaxp.SAXParserImpl: Property 'http://javax.xml.XMLConstants/property/accessExternalDTD' is not recognized.'
Warning:  org.apache.xerces.parsers.SAXParser: Feature 'http://javax.xml.XMLConstants/feature/secure-processing' is not recognized.
Warning:  org.apache.xerces.parsers.SAXParser: Property 'http://javax.xml.XMLConstants/property/accessExternalDTD' is not recognized.
Warning:  org.apache.xerces.parsers.SAXParser: Property 'http://www.oracle.com/xml/jaxp/properties/entityExpansionLimit' is not recognized.
[INFO] Rat check: Summary of files. Unapproved: 0 unknown: 0 generated: 0 approved: 1 licence.
[INFO] 
[INFO] --- maven-remote-resources-plugin:1.5:process (default) @ tamaya-extensions ---
[INFO] 
[INFO] >>> findbugs-maven-plugin:3.0.0:check (findbugs-analyze) @ tamaya-extensions >>>
[INFO] 
[INFO] --- findbugs-maven-plugin:3.0.0:findbugs (findbugs) @ tamaya-extensions ---
[INFO] 
[INFO] <<< findbugs-maven-plugin:3.0.0:check (findbugs-analyze) @ tamaya-extensions <<<
[INFO] 
[INFO] --- findbugs-maven-plugin:3.0.0:check (findbugs-analyze) @ tamaya-extensions ---
[INFO] 
[INFO] --- maven-checkstyle-plugin:2.13:check (verify-style) @ tamaya-extensions ---
[INFO] 
[INFO] 
[INFO] --- maven-site-plugin:3.3:attach-descriptor (attach-descriptor) @ tamaya-extensions ---
[INFO] 
[INFO] --- maven-javadoc-plugin:2.9.1:jar (attach-javadocs) @ tamaya-extensions ---
[INFO] Skipping javadoc generation
[INFO] 
[INFO] --- maven-install-plugin:2.5.2:install (default-install) @ tamaya-extensions ---
[INFO] Installing <https://builds.apache.org/job/Tamaya-Master-branch/ws/modules/pom.xml> to /home/jenkins/jenkins-slave/maven-repositories/0/org/apache/tamaya/ext/tamaya-extensions/0.1-incubating-SNAPSHOT/tamaya-extensions-0.1-incubating-SNAPSHOT.pom
[INFO] 
[INFO] --- maven-deploy-plugin:2.8.2:deploy (default-deploy) @ tamaya-extensions ---
[INFO] Downloading: https://repository.apache.org/content/repositories/snapshots/org/apache/tamaya/ext/tamaya-extensions/0.1-incubating-SNAPSHOT/maven-metadata.xml
[INFO] Downloaded: https://repository.apache.org/content/repositories/snapshots/org/apache/tamaya/ext/tamaya-extensions/0.1-incubating-SNAPSHOT/maven-metadata.xml (635 B at 1.9 KB/sec)
[INFO] Uploading: https://repository.apache.org/content/repositories/snapshots/org/apache/tamaya/ext/tamaya-extensions/0.1-incubating-SNAPSHOT/tamaya-extensions-0.1-incubating-20150125.125920-42.pom
[INFO] Uploaded: https://repository.apache.org/content/repositories/snapshots/org/apache/tamaya/ext/tamaya-extensions/0.1-incubating-SNAPSHOT/tamaya-extensions-0.1-incubating-20150125.125920-42.pom (4 KB at 3.9 KB/sec)
[INFO] Downloading: https://repository.apache.org/content/repositories/snapshots/org/apache/tamaya/ext/tamaya-extensions/maven-metadata.xml
[INFO] Downloaded: https://repository.apache.org/content/repositories/snapshots/org/apache/tamaya/ext/tamaya-extensions/maven-metadata.xml (463 B at 3.6 KB/sec)
[INFO] Uploading: https://repository.apache.org/content/repositories/snapshots/org/apache/tamaya/ext/tamaya-extensions/0.1-incubating-SNAPSHOT/maven-metadata.xml
[INFO] Uploaded: https://repository.apache.org/content/repositories/snapshots/org/apache/tamaya/ext/tamaya-extensions/0.1-incubating-SNAPSHOT/maven-metadata.xml (635 B at 1.1 KB/sec)
[INFO] Uploading: https://repository.apache.org/content/repositories/snapshots/org/apache/tamaya/ext/tamaya-extensions/maven-metadata.xml
[INFO] Uploaded: https://repository.apache.org/content/repositories/snapshots/org/apache/tamaya/ext/tamaya-extensions/maven-metadata.xml (463 B at 2.5 KB/sec)
[INFO]                                                                         
[INFO] ------------------------------------------------------------------------
[INFO] Building Apache Tamaya Builder 0.1-incubating-SNAPSHOT
[INFO] ------------------------------------------------------------------------
[INFO] Downloading: http://repository.apache.org/snapshots/org/mockito/mockito-core/1.10.6/mockito-core-1.10.6.pom
[INFO] Downloading: http://repo.maven.apache.org/maven2/org/mockito/mockito-core/1.10.6/mockito-core-1.10.6.pom
[WARNING] The POM for org.mockito:mockito-core:jar:1.10.6 is missing, no dependency information available
[INFO] Downloading: http://repository.apache.org/snapshots/org/mockito/mockito-core/1.10.6/mockito-core-1.10.6.jar
[INFO] Downloading: http://repo.maven.apache.org/maven2/org/mockito/mockito-core/1.10.6/mockito-core-1.10.6.jar
[INFO] ------------------------------------------------------------------------
[INFO] Reactor Summary:
[INFO] 
[INFO] Apache Tamaya ..................................... SUCCESS [  8.184 s]
[INFO] Apache Tamaya Build Configuration ................. SUCCESS [  4.276 s]
[INFO] Apache Tamaya Java 7 Parent ....................... SUCCESS [  2.613 s]
[INFO] Apache Tamaya Java 7 API .......................... SUCCESS [ 18.850 s]
[INFO] Apache Tamaya Java 7 Core ......................... SUCCESS [ 16.818 s]
[INFO] Apache Tamaya Java 8 Parent ....................... SUCCESS [  4.877 s]
[INFO] Apache Tamaya Java 8 API .......................... SUCCESS [ 14.675 s]
[INFO] Apache Tamaya Java 8 Core ......................... SUCCESS [ 19.230 s]
[INFO] Apache Tamaya Extension Modules ................... SUCCESS [  4.161 s]
[INFO] Apache Tamaya Builder ............................. FAILURE [  0.856 s]
[INFO] Apache Tamaya Resource Services ................... SKIPPED
[INFO] Apache Tamaya Resolver Services ................... SKIPPED
[INFO] Apache Tamaya Injection Support ................... SKIPPED
[INFO] Apache Tamaya Format Services ..................... SKIPPED
[INFO] Apache Tamaya JSON Support ........................ SKIPPED
[INFO] ------------------------------------------------------------------------
[INFO] BUILD FAILURE
[INFO] ------------------------------------------------------------------------
[INFO] Total time: 01:41 min
[INFO] Finished at: 2015-01-25T12:59:25+00:00
[INFO] Final Memory: 55M/611M
[INFO] ------------------------------------------------------------------------
[ERROR] Failed to execute goal on project tamaya-builder: Could not resolve dependencies for project org.apache.tamaya.ext:tamaya-builder:jar:0.1-incubating-SNAPSHOT: Could not find artifact org.mockito:mockito-core:jar:1.10.6 in org.apache.people (http://repository.apache.org/snapshots) -> [Help 1]
[ERROR] 
[ERROR] To see the full stack trace of the errors, re-run Maven with the -e switch.
[ERROR] Re-run Maven using the -X switch to enable full debug logging.
[ERROR] 
[ERROR] For more information about the errors and possible solutions, please read the following articles:
[ERROR] [Help 1] http://cwiki.apache.org/confluence/display/MAVEN/DependencyResolutionException
[ERROR] 
[ERROR] After correcting the problems, you can resume the build with the command
[ERROR]   mvn <goals> -rf :tamaya-builder
[JENKINS] Archiving <https://builds.apache.org/job/Tamaya-Master-branch/ws/modules/injection/pom.xml> to org.apache.tamaya.ext/tamaya-injection/0.1-incubating-SNAPSHOT/tamaya-injection-0.1-incubating-SNAPSHOT.pom
Sending artifact delta relative to Tamaya-Master-branch » Apache Tamaya Injection Support #177
Archived 1 artifacts
Archive block size is 32768
Received 0 blocks and 2317 bytes
Compression is 0.0%
Took 51 ms
[JENKINS] Archiving <https://builds.apache.org/job/Tamaya-Master-branch/ws/java7/core/pom.xml> to org.apache.tamaya/tamaya-java7-core/0.1-incubating-SNAPSHOT/tamaya-java7-core-0.1-incubating-SNAPSHOT.pom
[JENKINS] Archiving <https://builds.apache.org/job/Tamaya-Master-branch/ws/java7/core/target/tamaya-java7-core-0.1-incubating-SNAPSHOT.jar> to org.apache.tamaya/tamaya-java7-core/0.1-incubating-20150125.125835-6/tamaya-java7-core-0.1-incubating-20150125.125835-6.jar
Sending artifact delta relative to Tamaya-Master-branch » Apache Tamaya Java 7 Core #180
Archived 2 artifacts
Archive block size is 32768
Received 0 blocks and 50859 bytes
Compression is 0.0%
Took 0.12 sec
[JENKINS] Archiving <https://builds.apache.org/job/Tamaya-Master-branch/ws/modules/json/pom.xml> to org.apache.tamaya.ext/json/0.1-incubating-SNAPSHOT/json-0.1-incubating-SNAPSHOT.pom
Sending artifact delta relative to Tamaya-Master-branch » Apache Tamaya JSON Support #177
Archived 1 artifacts
Archive block size is 32768
Received 0 blocks and 2661 bytes
Compression is 0.0%
Took 39 ms
[JENKINS] Archiving <https://builds.apache.org/job/Tamaya-Master-branch/ws/modules/resolver/pom.xml> to org.apache.tamaya.ext/tamaya-resolver/0.1-incubating-SNAPSHOT/tamaya-resolver-0.1-incubating-SNAPSHOT.pom
Sending artifact delta relative to Tamaya-Master-branch » Apache Tamaya Resolver Services #177
Archived 1 artifacts
Archive block size is 32768
Received 0 blocks and 2311 bytes
Compression is 0.0%
Took 48 ms
[JENKINS] Archiving <https://builds.apache.org/job/Tamaya-Master-branch/ws/java8/pom.xml> to org.apache.tamaya/tamaya-java8/0.1-incubating-SNAPSHOT/tamaya-java8-0.1-incubating-SNAPSHOT.pom
Sending artifact delta relative to Tamaya-Master-branch » Apache Tamaya Java 8 Parent #180
Archived 1 artifacts
Archive block size is 32768
Received 0 blocks and 3741 bytes
Compression is 0.0%
Took 28 ms
[JENKINS] Archiving <https://builds.apache.org/job/Tamaya-Master-branch/ws/modules/formats/pom.xml> to org.apache.tamaya.ext/tamaya-formats/0.1-incubating-SNAPSHOT/tamaya-formats-0.1-incubating-SNAPSHOT.pom
Sending artifact delta relative to Tamaya-Master-branch » Apache Tamaya Format Services #177
Archived 1 artifacts
Archive block size is 32768
Received 0 blocks and 2113 bytes
Compression is 0.0%
Took 67 ms
[JENKINS] Archiving <https://builds.apache.org/job/Tamaya-Master-branch/ws/java8/core/pom.xml> to org.apache.tamaya/tamaya-core/0.1-incubating-SNAPSHOT/tamaya-core-0.1-incubating-SNAPSHOT.pom
[JENKINS] Archiving <https://builds.apache.org/job/Tamaya-Master-branch/ws/java8/core/target/tamaya-core-0.1-incubating-SNAPSHOT.jar> to org.apache.tamaya/tamaya-core/0.1-incubating-20150125.125915-42/tamaya-core-0.1-incubating-20150125.125915-42.jar
Sending artifact delta relative to Tamaya-Master-branch » Apache Tamaya Java 8 Core #177
Archived 2 artifacts
Archive block size is 32768
Received 0 blocks and 53535 bytes
Compression is 0.0%
Took 56 ms
[JENKINS] Archiving <https://builds.apache.org/job/Tamaya-Master-branch/ws/java7/pom.xml> to org.apache.tamaya/tamaya-java7/0.1-incubating-SNAPSHOT/tamaya-java7-0.1-incubating-SNAPSHOT.pom
Sending artifact delta relative to Tamaya-Master-branch » Apache Tamaya Java 7 Parent #180
Archived 1 artifacts
Archive block size is 32768
Received 0 blocks and 4284 bytes
Compression is 0.0%
Took 28 ms
[JENKINS] Archiving <https://builds.apache.org/job/Tamaya-Master-branch/ws/pom.xml> to org.apache.tamaya/tamaya-all/0.1-incubating-SNAPSHOT/tamaya-all-0.1-incubating-SNAPSHOT.pom
Sending artifact delta relative to Tamaya-Master-branch » Apache Tamaya #180
Archived 1 artifacts
Archive block size is 32768
Received 0 blocks and 26128 bytes
Compression is 0.0%
Took 31 ms
[JENKINS] Archiving <https://builds.apache.org/job/Tamaya-Master-branch/ws/modules/builder/pom.xml> to org.apache.tamaya.ext/tamaya-builder/0.1-incubating-SNAPSHOT/tamaya-builder-0.1-incubating-SNAPSHOT.pom
Sending artifact delta relative to Tamaya-Master-branch » Apache Tamaya Builder #177
Archived 1 artifacts
Archive block size is 32768
Received 0 blocks and 2473 bytes
Compression is 0.0%
Took 44 ms
[JENKINS] Archiving <https://builds.apache.org/job/Tamaya-Master-branch/ws/modules/pom.xml> to org.apache.tamaya.ext/tamaya-extensions/0.1-incubating-SNAPSHOT/tamaya-extensions-0.1-incubating-SNAPSHOT.pom
Sending artifact delta relative to Tamaya-Master-branch » Apache Tamaya Extension Modules #177
Archived 1 artifacts
Archive block size is 32768
Received 0 blocks and 4144 bytes
Compression is 0.0%
Took 28 ms
[JENKINS] Archiving <https://builds.apache.org/job/Tamaya-Master-branch/ws/java8/api/pom.xml> to org.apache.tamaya/tamaya-api/0.1-incubating-SNAPSHOT/tamaya-api-0.1-incubating-SNAPSHOT.pom
[JENKINS] Archiving <https://builds.apache.org/job/Tamaya-Master-branch/ws/java8/api/target/tamaya-api-0.1-incubating-SNAPSHOT.jar> to org.apache.tamaya/tamaya-api/0.1-incubating-20150125.125856-49/tamaya-api-0.1-incubating-20150125.125856-49.jar
Sending artifact delta relative to Tamaya-Master-branch » Apache Tamaya Java 8 API #180
Archived 2 artifacts
Archive block size is 32768
Received 0 blocks and 18599 bytes
Compression is 0.0%
Took 32 ms
[JENKINS] Archiving <https://builds.apache.org/job/Tamaya-Master-branch/ws/modules/resources/pom.xml> to org.apache.tamaya.ext/tamaya-resources/0.1-incubating-SNAPSHOT/tamaya-resources-0.1-incubating-SNAPSHOT.pom
Sending artifact delta relative to Tamaya-Master-branch » Apache Tamaya Resource Services #177
Archived 1 artifacts
Archive block size is 32768
Received 0 blocks and 1853 bytes
Compression is 0.0%
Took 61 ms
[JENKINS] Archiving <https://builds.apache.org/job/Tamaya-Master-branch/ws/java7/api/pom.xml> to org.apache.tamaya/tamaya-java7-api/0.1-incubating-SNAPSHOT/tamaya-java7-api-0.1-incubating-SNAPSHOT.pom
[JENKINS] Archiving <https://builds.apache.org/job/Tamaya-Master-branch/ws/java7/api/target/tamaya-java7-api-0.1-incubating-SNAPSHOT.jar> to org.apache.tamaya/tamaya-java7-api/0.1-incubating-20150125.125818-53/tamaya-java7-api-0.1-incubating-20150125.125818-53.jar
Sending artifact delta relative to Tamaya-Master-branch » Apache Tamaya Java 7 API #180
Archived 2 artifacts
Archive block size is 32768
Received 0 blocks and 17475 bytes
Compression is 0.0%
Took 52 ms
[JENKINS] Archiving <https://builds.apache.org/job/Tamaya-Master-branch/ws/buildconfigurations/pom.xml> to org.apache.tamaya/buildconfigurations/0.1-incubating-SNAPSHOT/buildconfigurations-0.1-incubating-SNAPSHOT.pom
[JENKINS] Archiving <https://builds.apache.org/job/Tamaya-Master-branch/ws/buildconfigurations/target/buildconfigurations-0.1-incubating-SNAPSHOT.jar> to org.apache.tamaya/buildconfigurations/0.1-incubating-20150125.125756-33/buildconfigurations-0.1-incubating-20150125.125756-33.jar
Sending artifact delta relative to Tamaya-Master-branch » Apache Tamaya Build Configuration #180
Archived 2 artifacts
Archive block size is 32768
Received 0 blocks and 10692 bytes
Compression is 0.0%
Took 57 ms
channel stopped

Build failed in Jenkins: Tamaya-Master-branch #180

Posted by Apache Jenkins Server <je...@builds.apache.org>.
See <https://builds.apache.org/job/Tamaya-Master-branch/180/changes>

Changes:

[plexus] Fixed typo.

------------------------------------------
[...truncated 1148 lines...]
[INFO] --- findbugs-maven-plugin:3.0.0:check (findbugs-analyze) @ tamaya-api ---
[INFO] BugInstance size is 0
[INFO] Error size is 0
[INFO] No errors/warnings found
[INFO] 
[INFO] --- maven-checkstyle-plugin:2.13:check (verify-style) @ tamaya-api ---
[INFO] 
[INFO] 
[INFO] --- maven-resources-plugin:2.6:testResources (default-testResources) @ tamaya-api ---
[INFO] Using 'UTF-8' encoding to copy filtered resources.
[INFO] Copying 3 resources
[INFO] Copying 3 resources
[INFO] Copying 3 resources
[INFO] 
[INFO] --- maven-compiler-plugin:3.1:testCompile (default-testCompile) @ tamaya-api ---
[INFO] Nothing to compile - all classes are up to date
[INFO] 
[INFO] --- maven-surefire-plugin:2.17:test (default-test) @ tamaya-api ---
[INFO] Skipping execution of surefire because it has already been run for this configuration
[JENKINS] Recording test results
[INFO] 
[INFO] --- maven-jar-plugin:2.5:jar (default-jar) @ tamaya-api ---
[INFO] 
[INFO] --- maven-site-plugin:3.3:attach-descriptor (attach-descriptor) @ tamaya-api ---
[INFO] 
[INFO] --- maven-javadoc-plugin:2.9.1:jar (attach-javadocs) @ tamaya-api ---
[INFO] Skipping javadoc generation
[INFO] 
[INFO] --- maven-install-plugin:2.5.2:install (default-install) @ tamaya-api ---
[INFO] Installing <https://builds.apache.org/job/Tamaya-Master-branch/ws/java8/api/target/tamaya-api-0.1-incubating-SNAPSHOT.jar> to /home/jenkins/jenkins-slave/maven-repositories/0/org/apache/tamaya/tamaya-api/0.1-incubating-SNAPSHOT/tamaya-api-0.1-incubating-SNAPSHOT.jar
[INFO] Installing <https://builds.apache.org/job/Tamaya-Master-branch/ws/java8/api/pom.xml> to /home/jenkins/jenkins-slave/maven-repositories/0/org/apache/tamaya/tamaya-api/0.1-incubating-SNAPSHOT/tamaya-api-0.1-incubating-SNAPSHOT.pom
[INFO] 
[INFO] --- maven-deploy-plugin:2.8.2:deploy (default-deploy) @ tamaya-api ---
[INFO] Downloading: https://repository.apache.org/content/repositories/snapshots/org/apache/tamaya/tamaya-api/0.1-incubating-SNAPSHOT/maven-metadata.xml
[INFO] Downloaded: https://repository.apache.org/content/repositories/snapshots/org/apache/tamaya/tamaya-api/0.1-incubating-SNAPSHOT/maven-metadata.xml (807 B at 0.1 KB/sec)
[INFO] Uploading: https://repository.apache.org/content/repositories/snapshots/org/apache/tamaya/tamaya-api/0.1-incubating-SNAPSHOT/tamaya-api-0.1-incubating-20150125.121415-48.jar
[INFO] Uploaded: https://repository.apache.org/content/repositories/snapshots/org/apache/tamaya/tamaya-api/0.1-incubating-SNAPSHOT/tamaya-api-0.1-incubating-20150125.121415-48.jar (17 KB at 19.4 KB/sec)
[INFO] Uploading: https://repository.apache.org/content/repositories/snapshots/org/apache/tamaya/tamaya-api/0.1-incubating-SNAPSHOT/tamaya-api-0.1-incubating-20150125.121415-48.pom
[INFO] Uploaded: https://repository.apache.org/content/repositories/snapshots/org/apache/tamaya/tamaya-api/0.1-incubating-SNAPSHOT/tamaya-api-0.1-incubating-20150125.121415-48.pom (2 KB at 19.7 KB/sec)
[INFO] Downloading: https://repository.apache.org/content/repositories/snapshots/org/apache/tamaya/tamaya-api/maven-metadata.xml
[INFO] Downloaded: https://repository.apache.org/content/repositories/snapshots/org/apache/tamaya/tamaya-api/maven-metadata.xml (490 B at 1.6 KB/sec)
[INFO] Uploading: https://repository.apache.org/content/repositories/snapshots/org/apache/tamaya/tamaya-api/0.1-incubating-SNAPSHOT/maven-metadata.xml
[INFO] Uploaded: https://repository.apache.org/content/repositories/snapshots/org/apache/tamaya/tamaya-api/0.1-incubating-SNAPSHOT/maven-metadata.xml (807 B at 6.6 KB/sec)
[INFO] Uploading: https://repository.apache.org/content/repositories/snapshots/org/apache/tamaya/tamaya-api/maven-metadata.xml
[INFO] Uploaded: https://repository.apache.org/content/repositories/snapshots/org/apache/tamaya/tamaya-api/maven-metadata.xml (490 B at 1.8 KB/sec)
[INFO]                                                                         
[INFO] ------------------------------------------------------------------------
[INFO] Building Apache Tamaya Java 8 Core 0.1-incubating-SNAPSHOT
[INFO] ------------------------------------------------------------------------
[INFO] 
[INFO] --- maven-clean-plugin:2.5:clean (default-clean) @ tamaya-core ---
[INFO] Deleting <https://builds.apache.org/job/Tamaya-Master-branch/ws/java8/core/target>
[INFO] 
[INFO] --- maven-enforcer-plugin:1.3.1:enforce (enforce-versions) @ tamaya-core ---
[INFO] 
[INFO] --- apache-rat-plugin:0.11:check (default) @ tamaya-core ---
[INFO] 51 implicit excludes (use -debug for more details).
[INFO] Exclude: **/*/MANIFEST.MF
[INFO] Exclude: .git
[INFO] Exclude: .gitignore
[INFO] Exclude: derby.log
[INFO] Exclude: **/META-INF/services/*
[INFO] Exclude: **/bootstrap-*
[INFO] Exclude: **/js/jquery-*
[INFO] Exclude: **/*.json
[INFO] 50 resources included (use -debug for more details)
Warning:  org.apache.xerces.jaxp.SAXParserImpl$JAXPSAXParser: Property 'http://www.oracle.com/xml/jaxp/properties/entityExpansionLimit' is not recognized.
Compiler warnings:
  WARNING:  'org.apache.xerces.jaxp.SAXParserImpl: Property 'http://javax.xml.XMLConstants/property/accessExternalDTD' is not recognized.'
Warning:  org.apache.xerces.parsers.SAXParser: Feature 'http://javax.xml.XMLConstants/feature/secure-processing' is not recognized.
Warning:  org.apache.xerces.parsers.SAXParser: Property 'http://javax.xml.XMLConstants/property/accessExternalDTD' is not recognized.
Warning:  org.apache.xerces.parsers.SAXParser: Property 'http://www.oracle.com/xml/jaxp/properties/entityExpansionLimit' is not recognized.
[INFO] Rat check: Summary of files. Unapproved: 0 unknown: 0 generated: 0 approved: 50 licence.
[INFO] 
[INFO] --- maven-remote-resources-plugin:1.5:process (default) @ tamaya-core ---
[INFO] 
[INFO] --- maven-resources-plugin:2.6:resources (default-resources) @ tamaya-core ---
[INFO] Using 'UTF-8' encoding to copy filtered resources.
[INFO] Copying 7 resources
[INFO] Copying 3 resources
[INFO] 
[INFO] --- maven-compiler-plugin:3.1:compile (default-compile) @ tamaya-core ---
[INFO] Changes detected - recompiling the module!
[INFO] Compiling 32 source files to <https://builds.apache.org/job/Tamaya-Master-branch/ws/java8/core/target/classes>
[WARNING] <https://builds.apache.org/job/Tamaya-Master-branch/ws/java8/core/src/main/java/org/apache/tamaya/core/internal/DefaultServiceContext.java>: Some input files use unchecked or unsafe operations.
[WARNING] <https://builds.apache.org/job/Tamaya-Master-branch/ws/java8/core/src/main/java/org/apache/tamaya/core/internal/DefaultServiceContext.java>: Recompile with -Xlint:unchecked for details.
[INFO] 
[INFO] >>> findbugs-maven-plugin:3.0.0:check (findbugs-analyze) @ tamaya-core >>>
[INFO] 
[INFO] --- findbugs-maven-plugin:3.0.0:findbugs (findbugs) @ tamaya-core ---
[INFO] Fork Value is true
[INFO] Done FindBugs Analysis....
[INFO] 
[INFO] <<< findbugs-maven-plugin:3.0.0:check (findbugs-analyze) @ tamaya-core <<<
[INFO] 
[INFO] --- findbugs-maven-plugin:3.0.0:check (findbugs-analyze) @ tamaya-core ---
[INFO] BugInstance size is 0
[INFO] Error size is 0
[INFO] No errors/warnings found
[INFO] 
[INFO] --- maven-checkstyle-plugin:2.13:check (verify-style) @ tamaya-core ---
[INFO] 
[INFO] There are 1 checkstyle errors.
[ERROR] DefaultConfigurationContext.java[22:8] (imports) UnusedImports: Unused import - org.apache.tamaya.spi.ConfigurationContext.
[INFO] ------------------------------------------------------------------------
[INFO] Reactor Summary:
[INFO] 
[INFO] Apache Tamaya ..................................... SUCCESS [  8.811 s]
[INFO] Apache Tamaya Build Configuration ................. SUCCESS [  6.676 s]
[INFO] Apache Tamaya Java 7 Parent ....................... SUCCESS [  3.784 s]
[INFO] Apache Tamaya Java 7 API .......................... SUCCESS [ 19.546 s]
[INFO] Apache Tamaya Java 7 Core ......................... SUCCESS [ 17.880 s]
[INFO] Apache Tamaya Java 8 Parent ....................... SUCCESS [ 12.577 s]
[INFO] Apache Tamaya Java 8 API .......................... SUCCESS [ 19.901 s]
[INFO] Apache Tamaya Java 8 Core ......................... FAILURE [  7.458 s]
[INFO] Apache Tamaya Extension Modules ................... SKIPPED
[INFO] Apache Tamaya Builder ............................. SKIPPED
[INFO] Apache Tamaya Resource Services ................... SKIPPED
[INFO] Apache Tamaya Resolver Services ................... SKIPPED
[INFO] Apache Tamaya Injection Support ................... SKIPPED
[INFO] Apache Tamaya Format Services ..................... SKIPPED
[INFO] Apache Tamaya JSON Support ........................ SKIPPED
[INFO] ------------------------------------------------------------------------
[INFO] BUILD FAILURE
[INFO] ------------------------------------------------------------------------
[INFO] Total time: 01:42 min
[INFO] Finished at: 2015-01-25T12:14:27+00:00
[INFO] Final Memory: 55M/630M
[INFO] ------------------------------------------------------------------------
[ERROR] Failed to execute goal org.apache.maven.plugins:maven-checkstyle-plugin:2.13:check (verify-style) on project tamaya-core: You have 1 Checkstyle violation. -> [Help 1]
[ERROR] 
[ERROR] To see the full stack trace of the errors, re-run Maven with the -e switch.
[ERROR] Re-run Maven using the -X switch to enable full debug logging.
[ERROR] 
[ERROR] For more information about the errors and possible solutions, please read the following articles:
[ERROR] [Help 1] http://cwiki.apache.org/confluence/display/MAVEN/MojoFailureException
[ERROR] 
[ERROR] After correcting the problems, you can resume the build with the command
[ERROR]   mvn <goals> -rf :tamaya-core
[JENKINS] Archiving <https://builds.apache.org/job/Tamaya-Master-branch/ws/modules/injection/pom.xml> to org.apache.tamaya.ext/tamaya-injection/0.1-incubating-SNAPSHOT/tamaya-injection-0.1-incubating-SNAPSHOT.pom
Sending artifact delta relative to Tamaya-Master-branch » Apache Tamaya Injection Support #177
Archived 1 artifacts
Archive block size is 32768
Received 0 blocks and 2317 bytes
Compression is 0.0%
Took 0.1 sec
[JENKINS] Archiving <https://builds.apache.org/job/Tamaya-Master-branch/ws/java7/core/pom.xml> to org.apache.tamaya/tamaya-java7-core/0.1-incubating-SNAPSHOT/tamaya-java7-core-0.1-incubating-SNAPSHOT.pom
[JENKINS] Archiving <https://builds.apache.org/job/Tamaya-Master-branch/ws/java7/core/target/tamaya-java7-core-0.1-incubating-SNAPSHOT.jar> to org.apache.tamaya/tamaya-java7-core/0.1-incubating-20150125.121342-5/tamaya-java7-core-0.1-incubating-20150125.121342-5.jar
Sending artifact delta relative to Tamaya-Master-branch » Apache Tamaya Java 7 Core #179
Archived 2 artifacts
Archive block size is 32768
Received 0 blocks and 50859 bytes
Compression is 0.0%
Took 63 ms
[JENKINS] Archiving <https://builds.apache.org/job/Tamaya-Master-branch/ws/modules/json/pom.xml> to org.apache.tamaya.ext/json/0.1-incubating-SNAPSHOT/json-0.1-incubating-SNAPSHOT.pom
Sending artifact delta relative to Tamaya-Master-branch » Apache Tamaya JSON Support #177
Archived 1 artifacts
Archive block size is 32768
Received 0 blocks and 2661 bytes
Compression is 0.0%
Took 46 ms
[JENKINS] Archiving <https://builds.apache.org/job/Tamaya-Master-branch/ws/modules/resolver/pom.xml> to org.apache.tamaya.ext/tamaya-resolver/0.1-incubating-SNAPSHOT/tamaya-resolver-0.1-incubating-SNAPSHOT.pom
Sending artifact delta relative to Tamaya-Master-branch » Apache Tamaya Resolver Services #177
Archived 1 artifacts
Archive block size is 32768
Received 0 blocks and 2311 bytes
Compression is 0.0%
Took 31 ms
[JENKINS] Archiving <https://builds.apache.org/job/Tamaya-Master-branch/ws/java8/pom.xml> to org.apache.tamaya/tamaya-java8/0.1-incubating-SNAPSHOT/tamaya-java8-0.1-incubating-SNAPSHOT.pom
Sending artifact delta relative to Tamaya-Master-branch » Apache Tamaya Java 8 Parent #179
Archived 1 artifacts
Archive block size is 32768
Received 0 blocks and 3741 bytes
Compression is 0.0%
Took 28 ms
[JENKINS] Archiving <https://builds.apache.org/job/Tamaya-Master-branch/ws/modules/formats/pom.xml> to org.apache.tamaya.ext/tamaya-formats/0.1-incubating-SNAPSHOT/tamaya-formats-0.1-incubating-SNAPSHOT.pom
Sending artifact delta relative to Tamaya-Master-branch » Apache Tamaya Format Services #177
Archived 1 artifacts
Archive block size is 32768
Received 0 blocks and 2113 bytes
Compression is 0.0%
Took 41 ms
[JENKINS] Archiving <https://builds.apache.org/job/Tamaya-Master-branch/ws/java8/core/pom.xml> to org.apache.tamaya/tamaya-core/0.1-incubating-SNAPSHOT/tamaya-core-0.1-incubating-SNAPSHOT.pom
Sending artifact delta relative to Tamaya-Master-branch » Apache Tamaya Java 8 Core #177
Archived 1 artifacts
Archive block size is 32768
Received 0 blocks and 2222 bytes
Compression is 0.0%
Took 28 ms
[JENKINS] Archiving <https://builds.apache.org/job/Tamaya-Master-branch/ws/java7/pom.xml> to org.apache.tamaya/tamaya-java7/0.1-incubating-SNAPSHOT/tamaya-java7-0.1-incubating-SNAPSHOT.pom
Sending artifact delta relative to Tamaya-Master-branch » Apache Tamaya Java 7 Parent #179
Archived 1 artifacts
Archive block size is 32768
Received 0 blocks and 4284 bytes
Compression is 0.0%
Took 28 ms
[JENKINS] Archiving <https://builds.apache.org/job/Tamaya-Master-branch/ws/pom.xml> to org.apache.tamaya/tamaya-all/0.1-incubating-SNAPSHOT/tamaya-all-0.1-incubating-SNAPSHOT.pom
Sending artifact delta relative to Tamaya-Master-branch » Apache Tamaya #179
Archived 1 artifacts
Archive block size is 32768
Received 0 blocks and 26128 bytes
Compression is 0.0%
Took 30 ms
[JENKINS] Archiving <https://builds.apache.org/job/Tamaya-Master-branch/ws/modules/builder/pom.xml> to org.apache.tamaya.ext/tamaya-builder/0.1-incubating-SNAPSHOT/tamaya-builder-0.1-incubating-SNAPSHOT.pom
Sending artifact delta relative to Tamaya-Master-branch » Apache Tamaya Builder #177
Archived 1 artifacts
Archive block size is 32768
Received 0 blocks and 2280 bytes
Compression is 0.0%
Took 41 ms
[JENKINS] Archiving <https://builds.apache.org/job/Tamaya-Master-branch/ws/modules/pom.xml> to org.apache.tamaya.ext/tamaya-extensions/0.1-incubating-SNAPSHOT/tamaya-extensions-0.1-incubating-SNAPSHOT.pom
Sending artifact delta relative to Tamaya-Master-branch » Apache Tamaya Extension Modules #177
Archived 1 artifacts
Archive block size is 32768
Received 0 blocks and 4144 bytes
Compression is 0.0%
Took 28 ms
[JENKINS] Archiving <https://builds.apache.org/job/Tamaya-Master-branch/ws/java8/api/pom.xml> to org.apache.tamaya/tamaya-api/0.1-incubating-SNAPSHOT/tamaya-api-0.1-incubating-SNAPSHOT.pom
[JENKINS] Archiving <https://builds.apache.org/job/Tamaya-Master-branch/ws/java8/api/target/tamaya-api-0.1-incubating-SNAPSHOT.jar> to org.apache.tamaya/tamaya-api/0.1-incubating-20150125.121415-48/tamaya-api-0.1-incubating-20150125.121415-48.jar
Sending artifact delta relative to Tamaya-Master-branch » Apache Tamaya Java 8 API #179
Archived 2 artifacts
Archive block size is 32768
Received 0 blocks and 18599 bytes
Compression is 0.0%
Took 38 ms
[JENKINS] Archiving <https://builds.apache.org/job/Tamaya-Master-branch/ws/modules/resources/pom.xml> to org.apache.tamaya.ext/tamaya-resources/0.1-incubating-SNAPSHOT/tamaya-resources-0.1-incubating-SNAPSHOT.pom
Sending artifact delta relative to Tamaya-Master-branch » Apache Tamaya Resource Services #177
Archived 1 artifacts
Archive block size is 32768
Received 0 blocks and 1853 bytes
Compression is 0.0%
Took 28 ms
[JENKINS] Archiving <https://builds.apache.org/job/Tamaya-Master-branch/ws/java7/api/pom.xml> to org.apache.tamaya/tamaya-java7-api/0.1-incubating-SNAPSHOT/tamaya-java7-api-0.1-incubating-SNAPSHOT.pom
[JENKINS] Archiving <https://builds.apache.org/job/Tamaya-Master-branch/ws/java7/api/target/tamaya-java7-api-0.1-incubating-SNAPSHOT.jar> to org.apache.tamaya/tamaya-java7-api/0.1-incubating-20150125.121324-52/tamaya-java7-api-0.1-incubating-20150125.121324-52.jar
Sending artifact delta relative to Tamaya-Master-branch » Apache Tamaya Java 7 API #179
Archived 2 artifacts
Archive block size is 32768
Received 0 blocks and 17475 bytes
Compression is 0.0%
Took 40 ms
[JENKINS] Archiving <https://builds.apache.org/job/Tamaya-Master-branch/ws/buildconfigurations/pom.xml> to org.apache.tamaya/buildconfigurations/0.1-incubating-SNAPSHOT/buildconfigurations-0.1-incubating-SNAPSHOT.pom
[JENKINS] Archiving <https://builds.apache.org/job/Tamaya-Master-branch/ws/buildconfigurations/target/buildconfigurations-0.1-incubating-SNAPSHOT.jar> to org.apache.tamaya/buildconfigurations/0.1-incubating-20150125.121258-32/buildconfigurations-0.1-incubating-20150125.121258-32.jar
Sending artifact delta relative to Tamaya-Master-branch » Apache Tamaya Build Configuration #179
Archived 2 artifacts
Archive block size is 32768
Received 0 blocks and 10692 bytes
Compression is 0.0%
Took 37 ms
channel stopped