You are viewing a plain text version of this content. The canonical link for it is here.
Posted to torque-dev@db.apache.org by Apache Jenkins Server <je...@builds.apache.org> on 2012/09/05 06:29:58 UTC
Build failed in Jenkins: torque4-test-project-derby #239
See <https://builds.apache.org/job/torque4-test-project-derby/239/>
------------------------------------------
Started by upstream project "Torque4-trunk" build number 293
Building remotely on ubuntu4 in workspace <https://builds.apache.org/job/torque4-test-project-derby/ws/>
Cleaning up <https://builds.apache.org/job/torque4-test-project-derby/ws/.>
Deleting <https://builds.apache.org/job/torque4-test-project-derby/ws/./derby.log>
Deleting <https://builds.apache.org/job/torque4-test-project-derby/ws/./target>
Deleting <https://builds.apache.org/job/torque4-test-project-derby/ws/./src/main/generated-java>
Updating http://svn.apache.org/repos/asf/db/torque/torque4/trunk/torque-test
At revision 1380979
no change for http://svn.apache.org/repos/asf/db/torque/torque4/trunk/torque-test since the previous build
Parsing POMs
[torque4-test-project-derby] $ /home/hudson/tools/java/latest1.5/bin/java -cp /home/jenkins/jenkins-slave/maven-agent.jar:/home/jenkins/jenkins-slave/classworlds.jar hudson.maven.agent.Main /home/hudson/tools/maven/apache-maven-2.2.1 /home/jenkins/jenkins-slave/slave.jar /home/jenkins/jenkins-slave/maven-interceptor.jar 56083 /home/jenkins/jenkins-slave/maven2.1-interceptor.jar
<===[JENKINS REMOTING CAPACITY]===>channel started
log4j:WARN No appenders could be found for logger (org.apache.commons.beanutils.converters.BooleanConverter).
log4j:WARN Please initialize the log4j system properly.
Executing Maven: -B -f <https://builds.apache.org/job/torque4-test-project-derby/ws/pom.xml> -Dmaven.repo.local=/home/jenkins/jenkins-slave/maven-repositories/0 -PderbyEmbedded clean test
[INFO] Scanning for projects...
[INFO] ------------------------------------------------------------------------
[INFO] Building Torque Test Project
[INFO] task-segment: [clean, test]
[INFO] ------------------------------------------------------------------------
Sep 5, 2012 4:29:56 AM hudson.remoting.SynchronousCommandTransport$ReaderThread run
SEVERE: I/O error in channel channel
java.io.StreamCorruptedException
at java.io.ObjectInputStream.readObject0(ObjectInputStream.java:1332)
at java.io.ObjectInputStream.readObject(ObjectInputStream.java:348)
at hudson.remoting.Command.readFrom(Command.java:90)
at hudson.remoting.ClassicCommandTransport.read(ClassicCommandTransport.java:59)
at hudson.remoting.SynchronousCommandTransport$ReaderThread.run(SynchronousCommandTransport.java:48)
channel stopped
[INFO] ------------------------------------------------------------------------
[ERROR] FATAL ERROR
[INFO] ------------------------------------------------------------------------
[INFO] null
[INFO] ------------------------------------------------------------------------
[INFO] Trace
java.lang.reflect.UndeclaredThrowableException
at $Proxy1.fetch2(Unknown Source)
at hudson.remoting.RemoteClassLoader.findClass(RemoteClassLoader.java:122)
at java.lang.ClassLoader.loadClass(ClassLoader.java:307)
at java.lang.ClassLoader.loadClass(ClassLoader.java:252)
at java.lang.ClassLoader.loadClassInternal(ClassLoader.java:320)
at hudson.maven.reporters.MavenArtifactArchiver.postBuild(MavenArtifactArchiver.java:101)
at hudson.maven.Maven2Builder.postModule(Maven2Builder.java:127)
at hudson.maven.MavenBuilder$Adapter.fireLeaveModule(MavenBuilder.java:327)
at hudson.maven.MavenBuilder$Adapter.postBuild(MavenBuilder.java:285)
at org.apache.maven.lifecycle.LifecycleExecutorInterceptor.execute(LifecycleExecutorInterceptor.java:68)
at org.apache.maven.DefaultMaven.doExecute(DefaultMaven.java:328)
at org.apache.maven.DefaultMaven.execute(DefaultMaven.java:138)
at org.apache.maven.cli.MavenCli.main(MavenCli.java:362)
at sun.reflect.NativeMethodAccessorImpl.invoke0(Native Method)
at sun.reflect.NativeMethodAccessorImpl.invoke(NativeMethodAccessorImpl.java:39)
at sun.reflect.DelegatingMethodAccessorImpl.invoke(DelegatingMethodAccessorImpl.java:25)
at java.lang.reflect.Method.invoke(Method.java:592)
at org.codehaus.classworlds.Launcher.launchEnhanced(Launcher.java:315)
at org.codehaus.classworlds.Launcher.launch(Launcher.java:255)
at hudson.maven.agent.Main.launch(Main.java:185)
at hudson.maven.MavenBuilder.call(MavenBuilder.java:151)
at hudson.maven.Maven2Builder.call(Maven2Builder.java:77)
at hudson.maven.Maven2Builder.call(Maven2Builder.java:53)
at hudson.remoting.UserRequest.perform(UserRequest.java:118)
at hudson.remoting.UserRequest.perform(UserRequest.java:48)
at hudson.remoting.Request$2.run(Request.java:326)
at hudson.remoting.InterceptingExecutorService$1.call(InterceptingExecutorService.java:72)
at java.util.concurrent.FutureTask$Sync.innerRun(FutureTask.java:269)
at java.util.concurrent.FutureTask.run(FutureTask.java:123)
at java.util.concurrent.ThreadPoolExecutor$Worker.runTask(ThreadPoolExecutor.java:651)
at java.util.concurrent.ThreadPoolExecutor$Worker.run(ThreadPoolExecutor.java:676)
at java.lang.Thread.run(Thread.java:595)
Caused by: hudson.remoting.ChannelClosedException: channel is already closed
at hudson.remoting.Channel.send(Channel.java:492)
at hudson.remoting.Request.call(Request.java:129)
at hudson.remoting.RemoteInvocationHandler.invoke(RemoteInvocationHandler.java:160)
... 32 more
Caused by: java.io.StreamCorruptedException
at java.io.ObjectInputStream.readObject0(ObjectInputStream.java:1332)
at java.io.ObjectInputStream.readObject(ObjectInputStream.java:348)
at hudson.remoting.Command.readFrom(Command.java:90)
at hudson.remoting.ClassicCommandTransport.read(ClassicCommandTransport.java:59)
at hudson.remoting.SynchronousCommandTransport$ReaderThread.run(SynchronousCommandTransport.java:48)
[INFO] ------------------------------------------------------------------------
[INFO] Total time: 1 second
[INFO] Finished at: Wed Sep 05 04:29:56 UTC 2012
ERROR: Maven JVM terminated unexpectedly with exit code 0
---------------------------------------------------------------------
To unsubscribe, e-mail: torque-dev-unsubscribe@db.apache.org
For additional commands, e-mail: torque-dev-help@db.apache.org
Jenkins build is back to stable : torque4-test-project-derby #246
Posted by Apache Jenkins Server <je...@builds.apache.org>.
See <https://builds.apache.org/job/torque4-test-project-derby/246/changes>
---------------------------------------------------------------------
To unsubscribe, e-mail: torque-dev-unsubscribe@db.apache.org
For additional commands, e-mail: torque-dev-help@db.apache.org
Jenkins build is still unstable: torque4-test-project-derby #245
Posted by Apache Jenkins Server <je...@builds.apache.org>.
See <https://builds.apache.org/job/torque4-test-project-derby/changes>
---------------------------------------------------------------------
To unsubscribe, e-mail: torque-dev-unsubscribe@db.apache.org
For additional commands, e-mail: torque-dev-help@db.apache.org
Jenkins build is unstable: torque4-test-project-derby #244
Posted by Apache Jenkins Server <je...@builds.apache.org>.
See <https://builds.apache.org/job/torque4-test-project-derby/244/changes>
---------------------------------------------------------------------
To unsubscribe, e-mail: torque-dev-unsubscribe@db.apache.org
For additional commands, e-mail: torque-dev-help@db.apache.org
Build failed in Jenkins: torque4-test-project-derby #243
Posted by Apache Jenkins Server <je...@builds.apache.org>.
See <https://builds.apache.org/job/torque4-test-project-derby/243/>
------------------------------------------
[...truncated 2320 lines...]
at org.apache.commons.dbcp.cpdsadapter.ConnectionImpl.prepareStatement(ConnectionImpl.java:95)
at org.apache.torque.util.BasePeerImpl.doDelete(BasePeerImpl.java:433)
... 24 more
Caused by: ERROR 42X05: Table/View 'BOOK' does not exist.
at org.apache.derby.iapi.error.StandardException.newException(Unknown Source)
at org.apache.derby.impl.sql.compile.FromBaseTable.bindTableDescriptor(Unknown Source)
at org.apache.derby.impl.sql.compile.FromBaseTable.bindNonVTITables(Unknown Source)
at org.apache.derby.impl.sql.compile.FromList.bindTables(Unknown Source)
at org.apache.derby.impl.sql.compile.SelectNode.bindNonVTITables(Unknown Source)
at org.apache.derby.impl.sql.compile.DMLStatementNode.bindTables(Unknown Source)
at org.apache.derby.impl.sql.compile.DeleteNode.bindStatement(Unknown Source)
at org.apache.derby.impl.sql.GenericStatement.prepMinion(Unknown Source)
at org.apache.derby.impl.sql.GenericStatement.prepare(Unknown Source)
at org.apache.derby.impl.sql.conn.GenericLanguageConnectionContext.prepareInternalStatement(Unknown Source)
... 33 more
org.apache.torque.TorqueException: java.sql.SQLException: Table/View 'BOOK' does not exist.
at org.apache.torque.util.BasePeerImpl.doDelete(BasePeerImpl.java:454)
at org.apache.torque.util.BasePeerImpl.doDelete(BasePeerImpl.java:365)
at org.apache.torque.test.BaseBookPeer.doDelete(BaseBookPeer.java:795)
at org.apache.torque.DocsTest.setUp(DocsTest.java:76)
at junit.framework.TestCase.runBare(TestCase.java:125)
at junit.framework.TestResult$1.protect(TestResult.java:106)
at junit.framework.TestResult.runProtected(TestResult.java:124)
at junit.framework.TestResult.run(TestResult.java:109)
at junit.framework.TestCase.run(TestCase.java:118)
at junit.framework.TestSuite.runTest(TestSuite.java:208)
at junit.framework.TestSuite.run(TestSuite.java:203)
at sun.reflect.NativeMethodAccessorImpl.invoke0(Native Method)
at sun.reflect.NativeMethodAccessorImpl.invoke(NativeMethodAccessorImpl.java:39)
at sun.reflect.DelegatingMethodAccessorImpl.invoke(DelegatingMethodAccessorImpl.java:25)
at java.lang.reflect.Method.invoke(Method.java:592)
at org.apache.maven.surefire.junit.JUnitTestSet.execute(JUnitTestSet.java:213)
at org.apache.maven.surefire.suite.AbstractDirectoryTestSuite.executeTestSet(AbstractDirectoryTestSuite.java:115)
at org.apache.maven.surefire.suite.AbstractDirectoryTestSuite.execute(AbstractDirectoryTestSuite.java:140)
at org.apache.maven.surefire.Surefire.run(Surefire.java:109)
at sun.reflect.NativeMethodAccessorImpl.invoke0(Native Method)
at sun.reflect.NativeMethodAccessorImpl.invoke(NativeMethodAccessorImpl.java:39)
at sun.reflect.DelegatingMethodAccessorImpl.invoke(DelegatingMethodAccessorImpl.java:25)
at java.lang.reflect.Method.invoke(Method.java:592)
at org.apache.maven.surefire.booter.SurefireBooter.runSuitesInProcess(SurefireBooter.java:290)
at org.apache.maven.surefire.booter.SurefireBooter.main(SurefireBooter.java:1017)
Caused by: java.sql.SQLException: Table/View 'BOOK' does not exist.
at org.apache.derby.impl.jdbc.SQLExceptionFactory.getSQLException(Unknown Source)
at org.apache.derby.impl.jdbc.Util.generateCsSQLException(Unknown Source)
at org.apache.derby.impl.jdbc.TransactionResourceImpl.wrapInSQLException(Unknown Source)
at org.apache.derby.impl.jdbc.TransactionResourceImpl.handleException(Unknown Source)
at org.apache.derby.impl.jdbc.EmbedConnection.handleException(Unknown Source)
at org.apache.derby.impl.jdbc.ConnectionChild.handleException(Unknown Source)
at org.apache.derby.impl.jdbc.EmbedPreparedStatement.<init>(Unknown Source)
at org.apache.derby.impl.jdbc.EmbedPreparedStatement20.<init>(Unknown Source)
at org.apache.derby.impl.jdbc.EmbedPreparedStatement30.<init>(Unknown Source)
at org.apache.derby.jdbc.Driver30.newEmbedPreparedStatement(Unknown Source)
at org.apache.derby.impl.jdbc.EmbedConnection.prepareStatement(Unknown Source)
at org.apache.derby.impl.jdbc.EmbedConnection.prepareStatement(Unknown Source)
at org.apache.commons.dbcp.cpdsadapter.PooledConnectionImpl.prepareStatement(PooledConnectionImpl.java:243)
at org.apache.commons.dbcp.cpdsadapter.ConnectionImpl.prepareStatement(ConnectionImpl.java:95)
at org.apache.torque.util.BasePeerImpl.doDelete(BasePeerImpl.java:433)
... 24 more
Caused by: ERROR 42X05: Table/View 'BOOK' does not exist.
at org.apache.derby.iapi.error.StandardException.newException(Unknown Source)
at org.apache.derby.impl.sql.compile.FromBaseTable.bindTableDescriptor(Unknown Source)
at org.apache.derby.impl.sql.compile.FromBaseTable.bindNonVTITables(Unknown Source)
at org.apache.derby.impl.sql.compile.FromList.bindTables(Unknown Source)
at org.apache.derby.impl.sql.compile.SelectNode.bindNonVTITables(Unknown Source)
at org.apache.derby.impl.sql.compile.DMLStatementNode.bindTables(Unknown Source)
at org.apache.derby.impl.sql.compile.DeleteNode.bindStatement(Unknown Source)
at org.apache.derby.impl.sql.GenericStatement.prepMinion(Unknown Source)
at org.apache.derby.impl.sql.GenericStatement.prepare(Unknown Source)
at org.apache.derby.impl.sql.conn.GenericLanguageConnectionContext.prepareInternalStatement(Unknown Source)
... 33 more
Tests run: 5, Failures: 5, Errors: 0, Skipped: 0, Time elapsed: 1.607 sec <<< FAILURE!
Running org.apache.torque.util.LargeSelectTest
Tests run: 9, Failures: 0, Errors: 9, Skipped: 0, Time elapsed: 1.635 sec <<< FAILURE!
Running org.apache.torque.generated.dataobject.SaveTest
Tests run: 8, Failures: 0, Errors: 8, Skipped: 0, Time elapsed: 1.591 sec <<< FAILURE!
Running org.apache.torque.generated.peer.WhereClauseSubselectTest
Tests run: 5, Failures: 0, Errors: 5, Skipped: 0, Time elapsed: 1.558 sec <<< FAILURE!
Running org.apache.torque.generated.peer.ImplInitialisationTest
Tests run: 1, Failures: 0, Errors: 0, Skipped: 0, Time elapsed: 1.5 sec
Running org.apache.torque.DataTest
Tests run: 26, Failures: 0, Errors: 23, Skipped: 0, Time elapsed: 1.679 sec <<< FAILURE!
Running org.apache.torque.map.DatabaseMapTest
Tests run: 10, Failures: 0, Errors: 0, Skipped: 0, Time elapsed: 1.523 sec
Running org.apache.torque.datatypes.BitTest
Tests run: 6, Failures: 0, Errors: 0, Skipped: 0, Time elapsed: 0.489 sec
Running org.apache.torque.generated.peer.DefaultValuesFromDatabaseTest
Tests run: 8, Failures: 0, Errors: 6, Skipped: 0, Time elapsed: 1.546 sec <<< FAILURE!
Running org.apache.torque.generated.dataobject.ForeignKeyGetterTest
Tests run: 12, Failures: 0, Errors: 0, Skipped: 0, Time elapsed: 0.627 sec
Running org.apache.torque.JndiConfigurationTest
Tests run: 3, Failures: 0, Errors: 2, Skipped: 0, Time elapsed: 1.488 sec <<< FAILURE!
Running org.apache.torque.generated.peer.DateTest
Tests run: 14, Failures: 0, Errors: 14, Skipped: 0, Time elapsed: 1.613 sec <<< FAILURE!
Running org.apache.torque.generated.peer.DefaultValuesFromJavaTest
Tests run: 9, Failures: 0, Errors: 0, Skipped: 0, Time elapsed: 1.52 sec
Running org.apache.torque.adapter.AdapterTest
Tests run: 1, Failures: 0, Errors: 1, Skipped: 0, Time elapsed: 1.56 sec <<< FAILURE!
Running org.apache.torque.generated.peer.SelectFunctionTest
Tests run: 8, Failures: 0, Errors: 8, Skipped: 0, Time elapsed: 1.579 sec <<< FAILURE!
Running org.apache.torque.datatypes.BooleanIntCharTest
Tests run: 30, Failures: 0, Errors: 28, Skipped: 0, Time elapsed: 1.713 sec <<< FAILURE!
Running org.apache.torque.generated.peer.FillerTest
Tests run: 17, Failures: 0, Errors: 17, Skipped: 0, Time elapsed: 1.671 sec <<< FAILURE!
Running org.apache.torque.generated.peer.SelectInTest
Tests run: 6, Failures: 0, Errors: 6, Skipped: 0, Time elapsed: 1.597 sec <<< FAILURE!
Running org.apache.torque.generated.dataobject.ForeignKeyAdderTest
Tests run: 10, Failures: 0, Errors: 0, Skipped: 0, Time elapsed: 0.641 sec
Running org.apache.torque.om.OMByNameMethodsTest
Tests run: 7, Failures: 0, Errors: 0, Skipped: 0, Time elapsed: 0.973 sec
Running org.apache.torque.InitShutdownTest
Tests run: 2, Failures: 0, Errors: 2, Skipped: 0, Time elapsed: 1.529 sec <<< FAILURE!
Running org.apache.torque.generated.peer.SaveMethodsInPeerTest
Tests run: 2, Failures: 0, Errors: 2, Skipped: 0, Time elapsed: 1.573 sec <<< FAILURE!
Running org.apache.torque.util.SummaryHelperTest
Tests run: 2, Failures: 0, Errors: 2, Skipped: 0, Time elapsed: 1.572 sec <<< FAILURE!
Running org.apache.torque.generated.peer.SelectTest
Tests run: 7, Failures: 0, Errors: 7, Skipped: 0, Time elapsed: 1.604 sec <<< FAILURE!
Running org.apache.torque.generated.dataobject.ViewTest
Tests run: 1, Failures: 0, Errors: 1, Skipped: 0, Time elapsed: 1.547 sec <<< FAILURE!
Running org.apache.torque.generated.peer.GetRelatedObjectsTest
Tests run: 5, Failures: 0, Errors: 5, Skipped: 0, Time elapsed: 1.587 sec <<< FAILURE!
Running org.apache.torque.util.BasePeerTest
Tests run: 1, Failures: 0, Errors: 1, Skipped: 0, Time elapsed: 1.567 sec <<< FAILURE!
Running org.apache.torque.sql.SkipSqlTest
Tests run: 1, Failures: 0, Errors: 0, Skipped: 0, Time elapsed: 1.201 sec
Running org.apache.torque.avalon.AvalonMapBuildersTest
[DEBUG] Starting container...
[DEBUG] Loading the service container class org.apache.fulcrum.yaafi.framework.container.ServiceContainerImpl
[DEBUG] Instantiating the service container class org.apache.fulcrum.yaafi.framework.container.ServiceContainerImpl
[DEBUG] Setting applicationRootDir to <https://builds.apache.org/job/torque4-test-project-derby/ws/>
[DEBUG] Service Framework is starting up
[DEBUG] Using the following applicationRootDir : <https://builds.apache.org/job/torque4-test-project-derby/ws/>
[DEBUG] Using the following tempRootDir : /tmp
[DEBUG] Looking for src/test/resources/TestComponentConfig.xml in the application directory
[DEBUG] Successfully located src/test/resources/TestComponentConfig.xml
[DEBUG] Looking for src/test/resources/TestRoleConfig.xml in the application directory
[DEBUG] Successfully located src/test/resources/TestRoleConfig.xml
[DEBUG] Looking for /parameters.properties as absolute file location
[DEBUG] Looking for /parameters.properties using the class loader
[WARNING] Unable to locate /parameters.properties
[DEBUG] Loading the implementation class for TorqueComponent
[DEBUG] Instantiating the implementation class for TorqueComponent
[DEBUG] Incarnating the service TorqueComponent
[DEBUG] LogEnabled.enableLogging() for TorqueComponent
[DEBUG] Contextualizable.contextualize() for TorqueComponent
[DEBUG] Configurable.configure() for TorqueComponent
[DEBUG] configure(TorqueComponent::<no value>:@null:20:22)
[DEBUG] Config File changes to src/test/resources/TurbineResources.properties
[DEBUG] Config File is <https://builds.apache.org/job/torque4-test-project-derby/ws/src/test/resources/TurbineResources.properties>
[DEBUG] Initializable.initialize() for TorqueComponent
[DEBUG] initialize()
[DEBUG] Service Framework is up and running
[INFO] YaffiContainer ready.
[DEBUG] Disposing of container...
[INFO] Disposing all services
[DEBUG] Decommisioning the service TorqueComponent
[DEBUG] Disposable.dispose() for TorqueComponent
[DEBUG] dispose()
[DEBUG] All services are disposed
[INFO] YaffiContainer has been disposed.
Tests run: 1, Failures: 0, Errors: 0, Skipped: 0, Time elapsed: 1.16 sec
Running org.apache.torque.generated.peer.DeleteTest
Tests run: 14, Failures: 0, Errors: 13, Skipped: 0, Time elapsed: 1.645 sec <<< FAILURE!
Running org.apache.torque.generated.peer.JoinTest
Tests run: 12, Failures: 0, Errors: 12, Skipped: 0, Time elapsed: 1.592 sec <<< FAILURE!
Results :
Failed tests:
Tests in error:
testLeftJoins(org.apache.torque.generated.peer.JoinTest)
testInnerJoins(org.apache.torque.generated.peer.JoinTest)
testImplicitInnerJoins(org.apache.torque.generated.peer.JoinTest)
testRightJoins(org.apache.torque.generated.peer.JoinTest)
testInnerJoinsOtherComparator(org.apache.torque.generated.peer.JoinTest)
testDoubleJoinWithAliases(org.apache.torque.generated.peer.JoinTest)
testReverseJoin(org.apache.torque.generated.peer.JoinTest)
testImplicitInnerJoinWithSubselect(org.apache.torque.generated.peer.JoinTest)
testImplicitInnerJoinTwoConditions(org.apache.torque.generated.peer.JoinTest)
testExplicitInnerJoinTwoConditions(org.apache.torque.generated.peer.JoinTest)
testDoSelectJoinY(org.apache.torque.generated.peer.JoinTest)
testDoSelectJoinAllExceptY(org.apache.torque.generated.peer.JoinTest)
Tests run: 247, Failures: 5, Errors: 176, Skipped: 0
[ERROR] There are test failures.
Please refer to <https://builds.apache.org/job/torque4-test-project-derby/ws/target/surefire-reports> for the individual test results.
[JENKINS] Archiving <https://builds.apache.org/job/torque4-test-project-derby/ws/pom.xml> to /home/hudson/hudson/jobs/torque4-test-project-derby/modules/org.apache.torque$torque-test/builds/2012-09-09_12-13-29/archive/org.apache.torque/torque-test/4.0-beta1-SNAPSHOT/torque-test-4.0-beta1-SNAPSHOT.pom
[INFO] ------------------------------------------------------------------------
[ERROR] FATAL ERROR
[INFO] ------------------------------------------------------------------------
[INFO] Failed to load hudson.maven.reporters.Messages
Illegal exception table handler in class file hudson/maven/reporters/Messages
[INFO] ------------------------------------------------------------------------
[INFO] Trace
java.lang.ClassFormatError: Failed to load hudson.maven.reporters.Messages
at hudson.remoting.RemoteClassLoader.loadClassFile(RemoteClassLoader.java:154)
at hudson.remoting.RemoteClassLoader.findClass(RemoteClassLoader.java:131)
at java.lang.ClassLoader.loadClass(ClassLoader.java:307)
at java.lang.ClassLoader.loadClass(ClassLoader.java:252)
at java.lang.ClassLoader.loadClassInternal(ClassLoader.java:320)
at hudson.maven.reporters.SurefireArchiver.postExecute(SurefireArchiver.java:108)
at hudson.maven.Maven2Builder.postExecute(Maven2Builder.java:155)
at hudson.maven.MavenBuilder$Adapter.postExecute(MavenBuilder.java:310)
at hudson.maven.agent.PluginManagerInterceptor$1MojoIntercepterImpl.callPost(PluginManagerInterceptor.java:170)
at hudson.maven.agent.PluginManagerInterceptor.executeMojo(PluginManagerInterceptor.java:183)
at org.apache.maven.lifecycle.DefaultLifecycleExecutor.executeGoals(DefaultLifecycleExecutor.java:694)
at org.apache.maven.lifecycle.DefaultLifecycleExecutor.executeGoalWithLifecycle(DefaultLifecycleExecutor.java:556)
at org.apache.maven.lifecycle.DefaultLifecycleExecutor.executeGoal(DefaultLifecycleExecutor.java:535)
at org.apache.maven.lifecycle.DefaultLifecycleExecutor.executeGoalAndHandleFailures(DefaultLifecycleExecutor.java:387)
at org.apache.maven.lifecycle.DefaultLifecycleExecutor.executeTaskSegments(DefaultLifecycleExecutor.java:348)
at org.apache.maven.lifecycle.DefaultLifecycleExecutor.execute(DefaultLifecycleExecutor.java:180)
at org.apache.maven.lifecycle.LifecycleExecutorInterceptor.execute(LifecycleExecutorInterceptor.java:65)
at org.apache.maven.DefaultMaven.doExecute(DefaultMaven.java:328)
at org.apache.maven.DefaultMaven.execute(DefaultMaven.java:138)
at org.apache.maven.cli.MavenCli.main(MavenCli.java:362)
at sun.reflect.NativeMethodAccessorImpl.invoke0(Native Method)
at sun.reflect.NativeMethodAccessorImpl.invoke(NativeMethodAccessorImpl.java:39)
at sun.reflect.DelegatingMethodAccessorImpl.invoke(DelegatingMethodAccessorImpl.java:25)
at java.lang.reflect.Method.invoke(Method.java:592)
at org.codehaus.classworlds.Launcher.launchEnhanced(Launcher.java:315)
at org.codehaus.classworlds.Launcher.launch(Launcher.java:255)
at hudson.maven.agent.Main.launch(Main.java:185)
at hudson.maven.MavenBuilder.call(MavenBuilder.java:151)
at hudson.maven.Maven2Builder.call(Maven2Builder.java:77)
at hudson.maven.Maven2Builder.call(Maven2Builder.java:53)
at hudson.remoting.UserRequest.perform(UserRequest.java:118)
at hudson.remoting.UserRequest.perform(UserRequest.java:48)
at hudson.remoting.Request$2.run(Request.java:326)
at hudson.remoting.InterceptingExecutorService$1.call(InterceptingExecutorService.java:72)
at java.util.concurrent.FutureTask$Sync.innerRun(FutureTask.java:269)
at java.util.concurrent.FutureTask.run(FutureTask.java:123)
at java.util.concurrent.ThreadPoolExecutor$Worker.runTask(ThreadPoolExecutor.java:651)
at java.util.concurrent.ThreadPoolExecutor$Worker.run(ThreadPoolExecutor.java:676)
at java.lang.Thread.run(Thread.java:595)
Caused by: java.lang.ClassFormatError: Illegal exception table handler in class file hudson/maven/reporters/Messages
at java.lang.ClassLoader.defineClass1(Native Method)
at java.lang.ClassLoader.defineClass(ClassLoader.java:621)
at java.lang.ClassLoader.defineClass(ClassLoader.java:466)
at hudson.remoting.RemoteClassLoader.loadClassFile(RemoteClassLoader.java:152)
... 38 more
[INFO] ------------------------------------------------------------------------
[INFO] Total time: 1 minute 36 seconds
[INFO] Finished at: Sun Sep 09 12:15:28 UTC 2012
[INFO] Final Memory: 49M/320M
[INFO] ------------------------------------------------------------------------
channel stopped
---------------------------------------------------------------------
To unsubscribe, e-mail: torque-dev-unsubscribe@db.apache.org
For additional commands, e-mail: torque-dev-help@db.apache.org
Build failed in Jenkins: torque4-test-project-derby #242
Posted by Apache Jenkins Server <je...@builds.apache.org>.
See <https://builds.apache.org/job/torque4-test-project-derby/242/changes>
Changes:
[tfischer] adjust hsqldb profile to change to hierarchical project structure (should be run from parent project)
[tfischer] LICENSE and NOTICE files per project
------------------------------------------
[...truncated 2329 lines...]
at org.apache.derby.impl.sql.compile.FromBaseTable.bindNonVTITables(Unknown Source)
at org.apache.derby.impl.sql.compile.FromList.bindTables(Unknown Source)
at org.apache.derby.impl.sql.compile.SelectNode.bindNonVTITables(Unknown Source)
at org.apache.derby.impl.sql.compile.DMLStatementNode.bindTables(Unknown Source)
at org.apache.derby.impl.sql.compile.DeleteNode.bindStatement(Unknown Source)
at org.apache.derby.impl.sql.GenericStatement.prepMinion(Unknown Source)
at org.apache.derby.impl.sql.GenericStatement.prepare(Unknown Source)
at org.apache.derby.impl.sql.conn.GenericLanguageConnectionContext.prepareInternalStatement(Unknown Source)
... 33 more
org.apache.torque.TorqueException: java.sql.SQLException: Table/View 'BOOK' does not exist.
at org.apache.torque.util.BasePeerImpl.doDelete(BasePeerImpl.java:454)
at org.apache.torque.util.BasePeerImpl.doDelete(BasePeerImpl.java:365)
at org.apache.torque.test.BaseBookPeer.doDelete(BaseBookPeer.java:795)
at org.apache.torque.DocsTest.setUp(DocsTest.java:76)
at junit.framework.TestCase.runBare(TestCase.java:125)
at junit.framework.TestResult$1.protect(TestResult.java:106)
at junit.framework.TestResult.runProtected(TestResult.java:124)
at junit.framework.TestResult.run(TestResult.java:109)
at junit.framework.TestCase.run(TestCase.java:118)
at junit.framework.TestSuite.runTest(TestSuite.java:208)
at junit.framework.TestSuite.run(TestSuite.java:203)
at sun.reflect.NativeMethodAccessorImpl.invoke0(Native Method)
at sun.reflect.NativeMethodAccessorImpl.invoke(NativeMethodAccessorImpl.java:39)
at sun.reflect.DelegatingMethodAccessorImpl.invoke(DelegatingMethodAccessorImpl.java:25)
at java.lang.reflect.Method.invoke(Method.java:592)
at org.apache.maven.surefire.junit.JUnitTestSet.execute(JUnitTestSet.java:213)
at org.apache.maven.surefire.suite.AbstractDirectoryTestSuite.executeTestSet(AbstractDirectoryTestSuite.java:115)
at org.apache.maven.surefire.suite.AbstractDirectoryTestSuite.execute(AbstractDirectoryTestSuite.java:140)
at org.apache.maven.surefire.Surefire.run(Surefire.java:109)
at sun.reflect.NativeMethodAccessorImpl.invoke0(Native Method)
at sun.reflect.NativeMethodAccessorImpl.invoke(NativeMethodAccessorImpl.java:39)
at sun.reflect.DelegatingMethodAccessorImpl.invoke(DelegatingMethodAccessorImpl.java:25)
at java.lang.reflect.Method.invoke(Method.java:592)
at org.apache.maven.surefire.booter.SurefireBooter.runSuitesInProcess(SurefireBooter.java:290)
at org.apache.maven.surefire.booter.SurefireBooter.main(SurefireBooter.java:1017)
Caused by: java.sql.SQLException: Table/View 'BOOK' does not exist.
at org.apache.derby.impl.jdbc.SQLExceptionFactory.getSQLException(Unknown Source)
at org.apache.derby.impl.jdbc.Util.generateCsSQLException(Unknown Source)
at org.apache.derby.impl.jdbc.TransactionResourceImpl.wrapInSQLException(Unknown Source)
at org.apache.derby.impl.jdbc.TransactionResourceImpl.handleException(Unknown Source)
at org.apache.derby.impl.jdbc.EmbedConnection.handleException(Unknown Source)
at org.apache.derby.impl.jdbc.ConnectionChild.handleException(Unknown Source)
at org.apache.derby.impl.jdbc.EmbedPreparedStatement.<init>(Unknown Source)
at org.apache.derby.impl.jdbc.EmbedPreparedStatement20.<init>(Unknown Source)
at org.apache.derby.impl.jdbc.EmbedPreparedStatement30.<init>(Unknown Source)
at org.apache.derby.jdbc.Driver30.newEmbedPreparedStatement(Unknown Source)
at org.apache.derby.impl.jdbc.EmbedConnection.prepareStatement(Unknown Source)
at org.apache.derby.impl.jdbc.EmbedConnection.prepareStatement(Unknown Source)
at org.apache.commons.dbcp.cpdsadapter.PooledConnectionImpl.prepareStatement(PooledConnectionImpl.java:243)
at org.apache.commons.dbcp.cpdsadapter.ConnectionImpl.prepareStatement(ConnectionImpl.java:95)
at org.apache.torque.util.BasePeerImpl.doDelete(BasePeerImpl.java:433)
... 24 more
Caused by: ERROR 42X05: Table/View 'BOOK' does not exist.
at org.apache.derby.iapi.error.StandardException.newException(Unknown Source)
at org.apache.derby.impl.sql.compile.FromBaseTable.bindTableDescriptor(Unknown Source)
at org.apache.derby.impl.sql.compile.FromBaseTable.bindNonVTITables(Unknown Source)
at org.apache.derby.impl.sql.compile.FromList.bindTables(Unknown Source)
at org.apache.derby.impl.sql.compile.SelectNode.bindNonVTITables(Unknown Source)
at org.apache.derby.impl.sql.compile.DMLStatementNode.bindTables(Unknown Source)
at org.apache.derby.impl.sql.compile.DeleteNode.bindStatement(Unknown Source)
at org.apache.derby.impl.sql.GenericStatement.prepMinion(Unknown Source)
at org.apache.derby.impl.sql.GenericStatement.prepare(Unknown Source)
at org.apache.derby.impl.sql.conn.GenericLanguageConnectionContext.prepareInternalStatement(Unknown Source)
... 33 more
Tests run: 5, Failures: 5, Errors: 0, Skipped: 0, Time elapsed: 1.615 sec <<< FAILURE!
Running org.apache.torque.util.LargeSelectTest
Tests run: 9, Failures: 0, Errors: 9, Skipped: 0, Time elapsed: 1.625 sec <<< FAILURE!
Running org.apache.torque.generated.dataobject.SaveTest
Tests run: 8, Failures: 0, Errors: 8, Skipped: 0, Time elapsed: 1.588 sec <<< FAILURE!
Running org.apache.torque.generated.peer.WhereClauseSubselectTest
Tests run: 5, Failures: 0, Errors: 5, Skipped: 0, Time elapsed: 1.599 sec <<< FAILURE!
Running org.apache.torque.generated.peer.ImplInitialisationTest
Tests run: 1, Failures: 0, Errors: 0, Skipped: 0, Time elapsed: 1.489 sec
Running org.apache.torque.DataTest
Tests run: 26, Failures: 0, Errors: 23, Skipped: 0, Time elapsed: 1.697 sec <<< FAILURE!
Running org.apache.torque.map.DatabaseMapTest
Tests run: 10, Failures: 0, Errors: 0, Skipped: 0, Time elapsed: 1.527 sec
Running org.apache.torque.datatypes.BitTest
Tests run: 6, Failures: 0, Errors: 0, Skipped: 0, Time elapsed: 0.481 sec
Running org.apache.torque.generated.peer.DefaultValuesFromDatabaseTest
Tests run: 8, Failures: 0, Errors: 6, Skipped: 0, Time elapsed: 1.59 sec <<< FAILURE!
Running org.apache.torque.generated.dataobject.ForeignKeyGetterTest
Tests run: 12, Failures: 0, Errors: 0, Skipped: 0, Time elapsed: 0.635 sec
Running org.apache.torque.JndiConfigurationTest
Tests run: 3, Failures: 0, Errors: 2, Skipped: 0, Time elapsed: 1.521 sec <<< FAILURE!
Running org.apache.torque.generated.peer.DateTest
Tests run: 14, Failures: 0, Errors: 14, Skipped: 0, Time elapsed: 1.608 sec <<< FAILURE!
Running org.apache.torque.generated.peer.DefaultValuesFromJavaTest
Tests run: 9, Failures: 0, Errors: 0, Skipped: 0, Time elapsed: 1.512 sec
Running org.apache.torque.adapter.AdapterTest
Tests run: 1, Failures: 0, Errors: 1, Skipped: 0, Time elapsed: 1.561 sec <<< FAILURE!
Running org.apache.torque.generated.peer.SelectFunctionTest
Tests run: 8, Failures: 0, Errors: 8, Skipped: 0, Time elapsed: 1.613 sec <<< FAILURE!
Running org.apache.torque.datatypes.BooleanIntCharTest
Tests run: 30, Failures: 0, Errors: 28, Skipped: 0, Time elapsed: 1.719 sec <<< FAILURE!
Running org.apache.torque.generated.peer.FillerTest
Tests run: 17, Failures: 0, Errors: 17, Skipped: 0, Time elapsed: 1.687 sec <<< FAILURE!
Running org.apache.torque.generated.peer.SelectInTest
Tests run: 6, Failures: 0, Errors: 6, Skipped: 0, Time elapsed: 1.593 sec <<< FAILURE!
Running org.apache.torque.generated.dataobject.ForeignKeyAdderTest
Tests run: 10, Failures: 0, Errors: 0, Skipped: 0, Time elapsed: 0.658 sec
Running org.apache.torque.om.OMByNameMethodsTest
Tests run: 7, Failures: 0, Errors: 0, Skipped: 0, Time elapsed: 0.993 sec
Running org.apache.torque.InitShutdownTest
Tests run: 2, Failures: 0, Errors: 2, Skipped: 0, Time elapsed: 1.564 sec <<< FAILURE!
Running org.apache.torque.generated.peer.SaveMethodsInPeerTest
Tests run: 2, Failures: 0, Errors: 2, Skipped: 0, Time elapsed: 1.556 sec <<< FAILURE!
Running org.apache.torque.util.SummaryHelperTest
Tests run: 2, Failures: 0, Errors: 2, Skipped: 0, Time elapsed: 1.576 sec <<< FAILURE!
Running org.apache.torque.generated.peer.SelectTest
Tests run: 7, Failures: 0, Errors: 7, Skipped: 0, Time elapsed: 1.619 sec <<< FAILURE!
Running org.apache.torque.generated.dataobject.ViewTest
Tests run: 1, Failures: 0, Errors: 1, Skipped: 0, Time elapsed: 1.527 sec <<< FAILURE!
Running org.apache.torque.generated.peer.GetRelatedObjectsTest
Tests run: 5, Failures: 0, Errors: 5, Skipped: 0, Time elapsed: 2.36 sec <<< FAILURE!
Running org.apache.torque.util.BasePeerTest
Tests run: 1, Failures: 0, Errors: 1, Skipped: 0, Time elapsed: 1.577 sec <<< FAILURE!
Running org.apache.torque.sql.SkipSqlTest
Tests run: 1, Failures: 0, Errors: 0, Skipped: 0, Time elapsed: 1.211 sec
Running org.apache.torque.avalon.AvalonMapBuildersTest
[DEBUG] Starting container...
[DEBUG] Loading the service container class org.apache.fulcrum.yaafi.framework.container.ServiceContainerImpl
[DEBUG] Instantiating the service container class org.apache.fulcrum.yaafi.framework.container.ServiceContainerImpl
[DEBUG] Setting applicationRootDir to <https://builds.apache.org/job/torque4-test-project-derby/ws/>
[DEBUG] Service Framework is starting up
[DEBUG] Using the following applicationRootDir : <https://builds.apache.org/job/torque4-test-project-derby/ws/>
[DEBUG] Using the following tempRootDir : /tmp
[DEBUG] Looking for src/test/resources/TestComponentConfig.xml in the application directory
[DEBUG] Successfully located src/test/resources/TestComponentConfig.xml
[DEBUG] Looking for src/test/resources/TestRoleConfig.xml in the application directory
[DEBUG] Successfully located src/test/resources/TestRoleConfig.xml
[DEBUG] Looking for /parameters.properties as absolute file location
[DEBUG] Looking for /parameters.properties using the class loader
[WARNING] Unable to locate /parameters.properties
[DEBUG] Loading the implementation class for TorqueComponent
[DEBUG] Instantiating the implementation class for TorqueComponent
[DEBUG] Incarnating the service TorqueComponent
[DEBUG] LogEnabled.enableLogging() for TorqueComponent
[DEBUG] Contextualizable.contextualize() for TorqueComponent
[DEBUG] Configurable.configure() for TorqueComponent
[DEBUG] configure(TorqueComponent::<no value>:@null:20:22)
[DEBUG] Config File changes to src/test/resources/TurbineResources.properties
[DEBUG] Config File is <https://builds.apache.org/job/torque4-test-project-derby/ws/src/test/resources/TurbineResources.properties>
[DEBUG] Initializable.initialize() for TorqueComponent
[DEBUG] initialize()
[DEBUG] Service Framework is up and running
[INFO] YaffiContainer ready.
[DEBUG] Disposing of container...
[INFO] Disposing all services
[DEBUG] Decommisioning the service TorqueComponent
[DEBUG] Disposable.dispose() for TorqueComponent
[DEBUG] dispose()
[DEBUG] All services are disposed
[INFO] YaffiContainer has been disposed.
Tests run: 1, Failures: 0, Errors: 0, Skipped: 0, Time elapsed: 1.134 sec
Running org.apache.torque.generated.peer.DeleteTest
Tests run: 14, Failures: 0, Errors: 13, Skipped: 0, Time elapsed: 1.655 sec <<< FAILURE!
Running org.apache.torque.generated.peer.JoinTest
Tests run: 12, Failures: 0, Errors: 12, Skipped: 0, Time elapsed: 1.611 sec <<< FAILURE!
Results :
Failed tests:
Tests in error:
testLeftJoins(org.apache.torque.generated.peer.JoinTest)
testInnerJoins(org.apache.torque.generated.peer.JoinTest)
testImplicitInnerJoins(org.apache.torque.generated.peer.JoinTest)
testRightJoins(org.apache.torque.generated.peer.JoinTest)
testInnerJoinsOtherComparator(org.apache.torque.generated.peer.JoinTest)
testDoubleJoinWithAliases(org.apache.torque.generated.peer.JoinTest)
testReverseJoin(org.apache.torque.generated.peer.JoinTest)
testImplicitInnerJoinWithSubselect(org.apache.torque.generated.peer.JoinTest)
testImplicitInnerJoinTwoConditions(org.apache.torque.generated.peer.JoinTest)
testExplicitInnerJoinTwoConditions(org.apache.torque.generated.peer.JoinTest)
testDoSelectJoinY(org.apache.torque.generated.peer.JoinTest)
testDoSelectJoinAllExceptY(org.apache.torque.generated.peer.JoinTest)
Tests run: 247, Failures: 5, Errors: 176, Skipped: 0
[ERROR] There are test failures.
Please refer to <https://builds.apache.org/job/torque4-test-project-derby/ws/target/surefire-reports> for the individual test results.
Sep 9, 2012 12:09:17 PM hudson.remoting.SynchronousCommandTransport$ReaderThread run
SEVERE: I/O error in channel channel
java.io.StreamCorruptedException
at java.io.ObjectInputStream.readObject0(ObjectInputStream.java:1332)
at java.io.ObjectInputStream.readObject(ObjectInputStream.java:348)
at hudson.remoting.Command.readFrom(Command.java:90)
at hudson.remoting.ClassicCommandTransport.read(ClassicCommandTransport.java:59)
at hudson.remoting.SynchronousCommandTransport$ReaderThread.run(SynchronousCommandTransport.java:48)
channel stopped
[INFO] ------------------------------------------------------------------------
[ERROR] FATAL ERROR
[INFO] ------------------------------------------------------------------------
[INFO] null
[INFO] ------------------------------------------------------------------------
[INFO] Trace
java.lang.reflect.UndeclaredThrowableException
at $Proxy1.fetch2(Unknown Source)
at hudson.remoting.RemoteClassLoader.findClass(RemoteClassLoader.java:122)
at java.lang.ClassLoader.loadClass(ClassLoader.java:307)
at java.lang.ClassLoader.loadClass(ClassLoader.java:252)
at java.lang.ClassLoader.loadClassInternal(ClassLoader.java:320)
at hudson.maven.reporters.MavenArtifactArchiver.postBuild(MavenArtifactArchiver.java:101)
at hudson.maven.Maven2Builder.postModule(Maven2Builder.java:127)
at hudson.maven.MavenBuilder$Adapter.fireLeaveModule(MavenBuilder.java:327)
at hudson.maven.MavenBuilder$Adapter.postBuild(MavenBuilder.java:285)
at org.apache.maven.lifecycle.LifecycleExecutorInterceptor.execute(LifecycleExecutorInterceptor.java:68)
at org.apache.maven.DefaultMaven.doExecute(DefaultMaven.java:328)
at org.apache.maven.DefaultMaven.execute(DefaultMaven.java:138)
at org.apache.maven.cli.MavenCli.main(MavenCli.java:362)
at sun.reflect.NativeMethodAccessorImpl.invoke0(Native Method)
at sun.reflect.NativeMethodAccessorImpl.invoke(NativeMethodAccessorImpl.java:39)
at sun.reflect.DelegatingMethodAccessorImpl.invoke(DelegatingMethodAccessorImpl.java:25)
at java.lang.reflect.Method.invoke(Method.java:592)
at org.codehaus.classworlds.Launcher.launchEnhanced(Launcher.java:315)
at org.codehaus.classworlds.Launcher.launch(Launcher.java:255)
at hudson.maven.agent.Main.launch(Main.java:185)
at hudson.maven.MavenBuilder.call(MavenBuilder.java:151)
at hudson.maven.Maven2Builder.call(Maven2Builder.java:77)
at hudson.maven.Maven2Builder.call(Maven2Builder.java:53)
at hudson.remoting.UserRequest.perform(UserRequest.java:118)
at hudson.remoting.UserRequest.perform(UserRequest.java:48)
at hudson.remoting.Request$2.run(Request.java:326)
at hudson.remoting.InterceptingExecutorService$1.call(InterceptingExecutorService.java:72)
at java.util.concurrent.FutureTask$Sync.innerRun(FutureTask.java:269)
at java.util.concurrent.FutureTask.run(FutureTask.java:123)
at java.util.concurrent.ThreadPoolExecutor$Worker.runTask(ThreadPoolExecutor.java:651)
at java.util.concurrent.ThreadPoolExecutor$Worker.run(ThreadPoolExecutor.java:676)
at java.lang.Thread.run(Thread.java:595)
Caused by: hudson.remoting.ChannelClosedException: channel is already closed
at hudson.remoting.Channel.send(Channel.java:493)
at hudson.remoting.Request.call(Request.java:129)
at hudson.remoting.RemoteInvocationHandler.invoke(RemoteInvocationHandler.java:160)
... 32 more
Caused by: java.io.StreamCorruptedException
at java.io.ObjectInputStream.readObject0(ObjectInputStream.java:1332)
at java.io.ObjectInputStream.readObject(ObjectInputStream.java:348)
at hudson.remoting.Command.readFrom(Command.java:90)
at hudson.remoting.ClassicCommandTransport.read(ClassicCommandTransport.java:59)
at hudson.remoting.SynchronousCommandTransport$ReaderThread.run(SynchronousCommandTransport.java:48)
[INFO] ------------------------------------------------------------------------
[INFO] Total time: 1 minute 36 seconds
[INFO] Finished at: Sun Sep 09 12:09:17 UTC 2012
[INFO] Final Memory: 48M/320M
[INFO] ------------------------------------------------------------------------
ERROR: Maven JVM terminated unexpectedly with exit code 0
---------------------------------------------------------------------
To unsubscribe, e-mail: torque-dev-unsubscribe@db.apache.org
For additional commands, e-mail: torque-dev-help@db.apache.org
Build failed in Jenkins: torque4-test-project-derby #241
Posted by Apache Jenkins Server <je...@builds.apache.org>.
See <https://builds.apache.org/job/torque4-test-project-derby/241/changes>
Changes:
[tfischer] - use "torque" as parent artifact id
[tfischer] Added missing license headers
[tfischer] change to hierarchical project structure - step 2
[tfischer] reverted accidental commit
[tfischer] - use apache-release as release profile
- remove src descriptors from subprojects (going for one single source distribution)
------------------------------------------
Started by upstream project "Torque4-trunk" build number 298
Building remotely on ubuntu4 in workspace <https://builds.apache.org/job/torque4-test-project-derby/ws/>
Cleaning up <https://builds.apache.org/job/torque4-test-project-derby/ws/.>
Deleting <https://builds.apache.org/job/torque4-test-project-derby/ws/./derby.log>
Deleting <https://builds.apache.org/job/torque4-test-project-derby/ws/./target>
Deleting <https://builds.apache.org/job/torque4-test-project-derby/ws/./src/main/generated-java>
Updating http://svn.apache.org/repos/asf/db/torque/torque4/trunk/torque-test
U src/test/profile/derbyEmbedded/notes.txt
U src/test/profile/postgresql/Torque.properties
U src/test/profile/derby/notes.txt
U src/test/java/org/apache/torque/test/InheritanceClassnameTestChild1.java
U src/test/java/org/apache/torque/test/InheritanceClassnameTestChild2.java
U src/test/java/org/apache/torque/generated/peer/JoinTest.java
U src/test/java/org/apache/torque/generated/peer/WhereClauseSubselectTest.java
U src/test/java/org/apache/torque/sql/DatabaseTools.java
U src/test/java/org/apache/torque/util/BasePeerTest.java
U pom.xml
At revision 1382269
Parsing POMs
Modules changed, recalculating dependency graph
[torque4-test-project-derby] $ /home/hudson/tools/java/latest1.5/bin/java -cp /home/jenkins/jenkins-slave/maven-agent.jar:/home/jenkins/jenkins-slave/classworlds.jar hudson.maven.agent.Main /home/hudson/tools/maven/apache-maven-2.2.1 /home/jenkins/jenkins-slave/slave.jar /home/jenkins/jenkins-slave/maven-interceptor.jar 56156 /home/jenkins/jenkins-slave/maven2.1-interceptor.jar
<===[JENKINS REMOTING CAPACITY]===>channel started
log4j:WARN No appenders could be found for logger (org.apache.commons.beanutils.converters.BooleanConverter).
log4j:WARN Please initialize the log4j system properly.
Executing Maven: -B -f <https://builds.apache.org/job/torque4-test-project-derby/ws/pom.xml> -Dmaven.repo.local=/home/jenkins/jenkins-slave/maven-repositories/1 -PderbyEmbedded clean test
[INFO] Scanning for projects...
[INFO] ------------------------------------------------------------------------
[INFO] Building Torque Test Project
[INFO] task-segment: [clean, test]
[INFO] ------------------------------------------------------------------------
[INFO] snapshot org.apache.torque:torque-maven-plugin:4.0-beta1-SNAPSHOT: checking for updates from apache.snapshots
Sep 8, 2012 9:28:05 AM hudson.remoting.SynchronousCommandTransport$ReaderThread run
SEVERE: I/O error in channel channel
java.io.StreamCorruptedException
at java.io.ObjectInputStream.readObject0(ObjectInputStream.java:1332)
at java.io.ObjectInputStream.readObject(ObjectInputStream.java:348)
at hudson.remoting.Command.readFrom(Command.java:90)
at hudson.remoting.ClassicCommandTransport.read(ClassicCommandTransport.java:59)
at hudson.remoting.SynchronousCommandTransport$ReaderThread.run(SynchronousCommandTransport.java:48)
channel stopped
[INFO] ------------------------------------------------------------------------
[ERROR] FATAL ERROR
[INFO] ------------------------------------------------------------------------
[INFO] null
[INFO] ------------------------------------------------------------------------
[INFO] Trace
java.lang.reflect.UndeclaredThrowableException
at $Proxy1.fetch2(Unknown Source)
at hudson.remoting.RemoteClassLoader.findClass(RemoteClassLoader.java:122)
at java.lang.ClassLoader.loadClass(ClassLoader.java:307)
at java.lang.ClassLoader.loadClass(ClassLoader.java:252)
at java.lang.ClassLoader.loadClassInternal(ClassLoader.java:320)
at hudson.maven.reporters.MavenArtifactArchiver.postBuild(MavenArtifactArchiver.java:101)
at hudson.maven.Maven2Builder.postModule(Maven2Builder.java:127)
at hudson.maven.MavenBuilder$Adapter.fireLeaveModule(MavenBuilder.java:327)
at hudson.maven.MavenBuilder$Adapter.postBuild(MavenBuilder.java:285)
at org.apache.maven.lifecycle.LifecycleExecutorInterceptor.execute(LifecycleExecutorInterceptor.java:68)
at org.apache.maven.DefaultMaven.doExecute(DefaultMaven.java:328)
at org.apache.maven.DefaultMaven.execute(DefaultMaven.java:138)
at org.apache.maven.cli.MavenCli.main(MavenCli.java:362)
at sun.reflect.NativeMethodAccessorImpl.invoke0(Native Method)
at sun.reflect.NativeMethodAccessorImpl.invoke(NativeMethodAccessorImpl.java:39)
at sun.reflect.DelegatingMethodAccessorImpl.invoke(DelegatingMethodAccessorImpl.java:25)
at java.lang.reflect.Method.invoke(Method.java:592)
at org.codehaus.classworlds.Launcher.launchEnhanced(Launcher.java:315)
at org.codehaus.classworlds.Launcher.launch(Launcher.java:255)
at hudson.maven.agent.Main.launch(Main.java:185)
at hudson.maven.MavenBuilder.call(MavenBuilder.java:151)
at hudson.maven.Maven2Builder.call(Maven2Builder.java:77)
at hudson.maven.Maven2Builder.call(Maven2Builder.java:53)
at hudson.remoting.UserRequest.perform(UserRequest.java:118)
at hudson.remoting.UserRequest.perform(UserRequest.java:48)
at hudson.remoting.Request$2.run(Request.java:326)
at hudson.remoting.InterceptingExecutorService$1.call(InterceptingExecutorService.java:72)
at java.util.concurrent.FutureTask$Sync.innerRun(FutureTask.java:269)
at java.util.concurrent.FutureTask.run(FutureTask.java:123)
at java.util.concurrent.ThreadPoolExecutor$Worker.runTask(ThreadPoolExecutor.java:651)
at java.util.concurrent.ThreadPoolExecutor$Worker.run(ThreadPoolExecutor.java:676)
at java.lang.Thread.run(Thread.java:595)
Caused by: hudson.remoting.ChannelClosedException: channel is already closed
at hudson.remoting.Channel.send(Channel.java:493)
at hudson.remoting.Request.call(Request.java:129)
at hudson.remoting.RemoteInvocationHandler.invoke(RemoteInvocationHandler.java:160)
... 32 more
Caused by: java.io.StreamCorruptedException
at java.io.ObjectInputStream.readObject0(ObjectInputStream.java:1332)
at java.io.ObjectInputStream.readObject(ObjectInputStream.java:348)
at hudson.remoting.Command.readFrom(Command.java:90)
at hudson.remoting.ClassicCommandTransport.read(ClassicCommandTransport.java:59)
at hudson.remoting.SynchronousCommandTransport$ReaderThread.run(SynchronousCommandTransport.java:48)
[INFO] ------------------------------------------------------------------------
[INFO] Total time: 2 seconds
[INFO] Finished at: Sat Sep 08 09:28:05 UTC 2012
[INFO] Final Memory: 15M/314M
[INFO] ------------------------------------------------------------------------
ERROR: Maven JVM terminated unexpectedly with exit code 0
---------------------------------------------------------------------
To unsubscribe, e-mail: torque-dev-unsubscribe@db.apache.org
For additional commands, e-mail: torque-dev-help@db.apache.org
Build failed in Jenkins: torque4-test-project-derby #240
Posted by Apache Jenkins Server <je...@builds.apache.org>.
See <https://builds.apache.org/job/torque4-test-project-derby/240/>
------------------------------------------
[...truncated 2326 lines...]
at org.apache.derby.iapi.error.StandardException.newException(Unknown Source)
at org.apache.derby.impl.sql.compile.FromBaseTable.bindTableDescriptor(Unknown Source)
at org.apache.derby.impl.sql.compile.FromBaseTable.bindNonVTITables(Unknown Source)
at org.apache.derby.impl.sql.compile.FromList.bindTables(Unknown Source)
at org.apache.derby.impl.sql.compile.SelectNode.bindNonVTITables(Unknown Source)
at org.apache.derby.impl.sql.compile.DMLStatementNode.bindTables(Unknown Source)
at org.apache.derby.impl.sql.compile.DeleteNode.bindStatement(Unknown Source)
at org.apache.derby.impl.sql.GenericStatement.prepMinion(Unknown Source)
at org.apache.derby.impl.sql.GenericStatement.prepare(Unknown Source)
at org.apache.derby.impl.sql.conn.GenericLanguageConnectionContext.prepareInternalStatement(Unknown Source)
... 33 more
org.apache.torque.TorqueException: java.sql.SQLException: Table/View 'BOOK' does not exist.
at org.apache.torque.util.BasePeerImpl.doDelete(BasePeerImpl.java:454)
at org.apache.torque.util.BasePeerImpl.doDelete(BasePeerImpl.java:365)
at org.apache.torque.test.BaseBookPeer.doDelete(BaseBookPeer.java:795)
at org.apache.torque.DocsTest.setUp(DocsTest.java:76)
at junit.framework.TestCase.runBare(TestCase.java:125)
at junit.framework.TestResult$1.protect(TestResult.java:106)
at junit.framework.TestResult.runProtected(TestResult.java:124)
at junit.framework.TestResult.run(TestResult.java:109)
at junit.framework.TestCase.run(TestCase.java:118)
at junit.framework.TestSuite.runTest(TestSuite.java:208)
at junit.framework.TestSuite.run(TestSuite.java:203)
at sun.reflect.NativeMethodAccessorImpl.invoke0(Native Method)
at sun.reflect.NativeMethodAccessorImpl.invoke(NativeMethodAccessorImpl.java:39)
at sun.reflect.DelegatingMethodAccessorImpl.invoke(DelegatingMethodAccessorImpl.java:25)
at java.lang.reflect.Method.invoke(Method.java:592)
at org.apache.maven.surefire.junit.JUnitTestSet.execute(JUnitTestSet.java:213)
at org.apache.maven.surefire.suite.AbstractDirectoryTestSuite.executeTestSet(AbstractDirectoryTestSuite.java:115)
at org.apache.maven.surefire.suite.AbstractDirectoryTestSuite.execute(AbstractDirectoryTestSuite.java:140)
at org.apache.maven.surefire.Surefire.run(Surefire.java:109)
at sun.reflect.NativeMethodAccessorImpl.invoke0(Native Method)
at sun.reflect.NativeMethodAccessorImpl.invoke(NativeMethodAccessorImpl.java:39)
at sun.reflect.DelegatingMethodAccessorImpl.invoke(DelegatingMethodAccessorImpl.java:25)
at java.lang.reflect.Method.invoke(Method.java:592)
at org.apache.maven.surefire.booter.SurefireBooter.runSuitesInProcess(SurefireBooter.java:290)
at org.apache.maven.surefire.booter.SurefireBooter.main(SurefireBooter.java:1017)
Caused by: java.sql.SQLException: Table/View 'BOOK' does not exist.
at org.apache.derby.impl.jdbc.SQLExceptionFactory.getSQLException(Unknown Source)
at org.apache.derby.impl.jdbc.Util.generateCsSQLException(Unknown Source)
at org.apache.derby.impl.jdbc.TransactionResourceImpl.wrapInSQLException(Unknown Source)
at org.apache.derby.impl.jdbc.TransactionResourceImpl.handleException(Unknown Source)
at org.apache.derby.impl.jdbc.EmbedConnection.handleException(Unknown Source)
at org.apache.derby.impl.jdbc.ConnectionChild.handleException(Unknown Source)
at org.apache.derby.impl.jdbc.EmbedPreparedStatement.<init>(Unknown Source)
at org.apache.derby.impl.jdbc.EmbedPreparedStatement20.<init>(Unknown Source)
at org.apache.derby.impl.jdbc.EmbedPreparedStatement30.<init>(Unknown Source)
at org.apache.derby.jdbc.Driver30.newEmbedPreparedStatement(Unknown Source)
at org.apache.derby.impl.jdbc.EmbedConnection.prepareStatement(Unknown Source)
at org.apache.derby.impl.jdbc.EmbedConnection.prepareStatement(Unknown Source)
at org.apache.commons.dbcp.cpdsadapter.PooledConnectionImpl.prepareStatement(PooledConnectionImpl.java:243)
at org.apache.commons.dbcp.cpdsadapter.ConnectionImpl.prepareStatement(ConnectionImpl.java:95)
at org.apache.torque.util.BasePeerImpl.doDelete(BasePeerImpl.java:433)
... 24 more
Caused by: ERROR 42X05: Table/View 'BOOK' does not exist.
at org.apache.derby.iapi.error.StandardException.newException(Unknown Source)
at org.apache.derby.impl.sql.compile.FromBaseTable.bindTableDescriptor(Unknown Source)
at org.apache.derby.impl.sql.compile.FromBaseTable.bindNonVTITables(Unknown Source)
at org.apache.derby.impl.sql.compile.FromList.bindTables(Unknown Source)
at org.apache.derby.impl.sql.compile.SelectNode.bindNonVTITables(Unknown Source)
at org.apache.derby.impl.sql.compile.DMLStatementNode.bindTables(Unknown Source)
at org.apache.derby.impl.sql.compile.DeleteNode.bindStatement(Unknown Source)
at org.apache.derby.impl.sql.GenericStatement.prepMinion(Unknown Source)
at org.apache.derby.impl.sql.GenericStatement.prepare(Unknown Source)
at org.apache.derby.impl.sql.conn.GenericLanguageConnectionContext.prepareInternalStatement(Unknown Source)
... 33 more
Tests run: 5, Failures: 5, Errors: 0, Skipped: 0, Time elapsed: 1.738 sec <<< FAILURE!
Running org.apache.torque.util.LargeSelectTest
Tests run: 9, Failures: 0, Errors: 9, Skipped: 0, Time elapsed: 1.712 sec <<< FAILURE!
Running org.apache.torque.generated.dataobject.SaveTest
Tests run: 8, Failures: 0, Errors: 8, Skipped: 0, Time elapsed: 1.607 sec <<< FAILURE!
Running org.apache.torque.generated.peer.WhereClauseSubselectTest
Tests run: 5, Failures: 0, Errors: 5, Skipped: 0, Time elapsed: 1.623 sec <<< FAILURE!
Running org.apache.torque.generated.peer.ImplInitialisationTest
Tests run: 1, Failures: 0, Errors: 0, Skipped: 0, Time elapsed: 1.455 sec
Running org.apache.torque.DataTest
Tests run: 26, Failures: 0, Errors: 23, Skipped: 0, Time elapsed: 1.718 sec <<< FAILURE!
Running org.apache.torque.map.DatabaseMapTest
Tests run: 10, Failures: 0, Errors: 0, Skipped: 0, Time elapsed: 1.536 sec
Running org.apache.torque.datatypes.BitTest
Tests run: 6, Failures: 0, Errors: 0, Skipped: 0, Time elapsed: 0.488 sec
Running org.apache.torque.generated.peer.DefaultValuesFromDatabaseTest
Tests run: 8, Failures: 0, Errors: 6, Skipped: 0, Time elapsed: 1.593 sec <<< FAILURE!
Running org.apache.torque.generated.dataobject.ForeignKeyGetterTest
Tests run: 12, Failures: 0, Errors: 0, Skipped: 0, Time elapsed: 0.63 sec
Running org.apache.torque.JndiConfigurationTest
Tests run: 3, Failures: 0, Errors: 2, Skipped: 0, Time elapsed: 1.485 sec <<< FAILURE!
Running org.apache.torque.generated.peer.DateTest
Tests run: 14, Failures: 0, Errors: 14, Skipped: 0, Time elapsed: 1.685 sec <<< FAILURE!
Running org.apache.torque.generated.peer.DefaultValuesFromJavaTest
Tests run: 9, Failures: 0, Errors: 0, Skipped: 0, Time elapsed: 1.578 sec
Running org.apache.torque.adapter.AdapterTest
Tests run: 1, Failures: 0, Errors: 1, Skipped: 0, Time elapsed: 1.6 sec <<< FAILURE!
Running org.apache.torque.generated.peer.SelectFunctionTest
Tests run: 8, Failures: 0, Errors: 8, Skipped: 0, Time elapsed: 1.676 sec <<< FAILURE!
Running org.apache.torque.datatypes.BooleanIntCharTest
Tests run: 30, Failures: 0, Errors: 28, Skipped: 0, Time elapsed: 1.783 sec <<< FAILURE!
Running org.apache.torque.generated.peer.FillerTest
Tests run: 17, Failures: 0, Errors: 17, Skipped: 0, Time elapsed: 1.712 sec <<< FAILURE!
Running org.apache.torque.generated.peer.SelectInTest
Tests run: 6, Failures: 0, Errors: 6, Skipped: 0, Time elapsed: 1.631 sec <<< FAILURE!
Running org.apache.torque.generated.dataobject.ForeignKeyAdderTest
Tests run: 10, Failures: 0, Errors: 0, Skipped: 0, Time elapsed: 0.643 sec
Running org.apache.torque.om.OMByNameMethodsTest
Tests run: 7, Failures: 0, Errors: 0, Skipped: 0, Time elapsed: 0.998 sec
Running org.apache.torque.InitShutdownTest
Tests run: 2, Failures: 0, Errors: 2, Skipped: 0, Time elapsed: 1.512 sec <<< FAILURE!
Running org.apache.torque.generated.peer.SaveMethodsInPeerTest
Tests run: 2, Failures: 0, Errors: 2, Skipped: 0, Time elapsed: 1.637 sec <<< FAILURE!
Running org.apache.torque.util.SummaryHelperTest
Tests run: 2, Failures: 0, Errors: 2, Skipped: 0, Time elapsed: 1.6 sec <<< FAILURE!
Running org.apache.torque.generated.peer.SelectTest
Tests run: 7, Failures: 0, Errors: 7, Skipped: 0, Time elapsed: 1.611 sec <<< FAILURE!
Running org.apache.torque.generated.dataobject.ViewTest
Tests run: 1, Failures: 0, Errors: 1, Skipped: 0, Time elapsed: 1.614 sec <<< FAILURE!
Running org.apache.torque.generated.peer.GetRelatedObjectsTest
Tests run: 5, Failures: 0, Errors: 5, Skipped: 0, Time elapsed: 1.651 sec <<< FAILURE!
Running org.apache.torque.util.BasePeerTest
Tests run: 1, Failures: 0, Errors: 1, Skipped: 0, Time elapsed: 1.638 sec <<< FAILURE!
Running org.apache.torque.sql.SkipSqlTest
Tests run: 1, Failures: 0, Errors: 0, Skipped: 0, Time elapsed: 1.261 sec
Running org.apache.torque.avalon.AvalonMapBuildersTest
[DEBUG] Starting container...
[DEBUG] Loading the service container class org.apache.fulcrum.yaafi.framework.container.ServiceContainerImpl
[DEBUG] Instantiating the service container class org.apache.fulcrum.yaafi.framework.container.ServiceContainerImpl
[DEBUG] Setting applicationRootDir to <https://builds.apache.org/job/torque4-test-project-derby/ws/>
[DEBUG] Service Framework is starting up
[DEBUG] Using the following applicationRootDir : <https://builds.apache.org/job/torque4-test-project-derby/ws/>
[DEBUG] Using the following tempRootDir : /tmp
[DEBUG] Looking for src/test/resources/TestComponentConfig.xml in the application directory
[DEBUG] Successfully located src/test/resources/TestComponentConfig.xml
[DEBUG] Looking for src/test/resources/TestRoleConfig.xml in the application directory
[DEBUG] Successfully located src/test/resources/TestRoleConfig.xml
[DEBUG] Looking for /parameters.properties as absolute file location
[DEBUG] Looking for /parameters.properties using the class loader
[WARNING] Unable to locate /parameters.properties
[DEBUG] Loading the implementation class for TorqueComponent
[DEBUG] Instantiating the implementation class for TorqueComponent
[DEBUG] Incarnating the service TorqueComponent
[DEBUG] LogEnabled.enableLogging() for TorqueComponent
[DEBUG] Contextualizable.contextualize() for TorqueComponent
[DEBUG] Configurable.configure() for TorqueComponent
[DEBUG] configure(TorqueComponent::<no value>:@null:20:22)
[DEBUG] Config File changes to src/test/resources/TurbineResources.properties
[DEBUG] Config File is <https://builds.apache.org/job/torque4-test-project-derby/ws/src/test/resources/TurbineResources.properties>
[DEBUG] Initializable.initialize() for TorqueComponent
[DEBUG] initialize()
[DEBUG] Service Framework is up and running
[INFO] YaffiContainer ready.
[DEBUG] Disposing of container...
[INFO] Disposing all services
[DEBUG] Decommisioning the service TorqueComponent
[DEBUG] Disposable.dispose() for TorqueComponent
[DEBUG] dispose()
[DEBUG] All services are disposed
[INFO] YaffiContainer has been disposed.
Tests run: 1, Failures: 0, Errors: 0, Skipped: 0, Time elapsed: 1.189 sec
Running org.apache.torque.generated.peer.DeleteTest
Tests run: 14, Failures: 0, Errors: 13, Skipped: 0, Time elapsed: 1.659 sec <<< FAILURE!
Running org.apache.torque.generated.peer.JoinTest
Tests run: 12, Failures: 0, Errors: 12, Skipped: 0, Time elapsed: 4.107 sec <<< FAILURE!
Results :
Failed tests:
Tests in error:
testLeftJoins(org.apache.torque.generated.peer.JoinTest)
testInnerJoins(org.apache.torque.generated.peer.JoinTest)
testImplicitInnerJoins(org.apache.torque.generated.peer.JoinTest)
testRightJoins(org.apache.torque.generated.peer.JoinTest)
testInnerJoinsOtherComparator(org.apache.torque.generated.peer.JoinTest)
testDoubleJoinWithAliases(org.apache.torque.generated.peer.JoinTest)
testReverseJoin(org.apache.torque.generated.peer.JoinTest)
testImplicitInnerJoinWithSubselect(org.apache.torque.generated.peer.JoinTest)
testImplicitInnerJoinTwoConditions(org.apache.torque.generated.peer.JoinTest)
testExplicitInnerJoinTwoConditions(org.apache.torque.generated.peer.JoinTest)
testDoSelectJoinY(org.apache.torque.generated.peer.JoinTest)
testDoSelectJoinAllExceptY(org.apache.torque.generated.peer.JoinTest)
Tests run: 247, Failures: 5, Errors: 176, Skipped: 0
[ERROR] There are test failures.
Please refer to <https://builds.apache.org/job/torque4-test-project-derby/ws/target/surefire-reports> for the individual test results.
Sep 5, 2012 9:19:51 AM hudson.remoting.SynchronousCommandTransport$ReaderThread run
SEVERE: I/O error in channel channel
java.io.StreamCorruptedException
at java.io.ObjectInputStream.readObject0(ObjectInputStream.java:1332)
at java.io.ObjectInputStream.readObject(ObjectInputStream.java:348)
at hudson.remoting.Command.readFrom(Command.java:90)
at hudson.remoting.ClassicCommandTransport.read(ClassicCommandTransport.java:59)
at hudson.remoting.SynchronousCommandTransport$ReaderThread.run(SynchronousCommandTransport.java:48)
channel stopped
[INFO] ------------------------------------------------------------------------
[ERROR] FATAL ERROR
[INFO] ------------------------------------------------------------------------
[INFO] null
[INFO] ------------------------------------------------------------------------
[INFO] Trace
java.lang.reflect.UndeclaredThrowableException
at $Proxy1.fetch2(Unknown Source)
at hudson.remoting.RemoteClassLoader.findClass(RemoteClassLoader.java:122)
at java.lang.ClassLoader.loadClass(ClassLoader.java:307)
at java.lang.ClassLoader.loadClass(ClassLoader.java:252)
at java.lang.ClassLoader.loadClassInternal(ClassLoader.java:320)
at hudson.maven.reporters.MavenArtifactArchiver.postBuild(MavenArtifactArchiver.java:101)
at hudson.maven.Maven2Builder.postModule(Maven2Builder.java:127)
at hudson.maven.MavenBuilder$Adapter.fireLeaveModule(MavenBuilder.java:327)
at hudson.maven.MavenBuilder$Adapter.postBuild(MavenBuilder.java:285)
at org.apache.maven.lifecycle.LifecycleExecutorInterceptor.execute(LifecycleExecutorInterceptor.java:68)
at org.apache.maven.DefaultMaven.doExecute(DefaultMaven.java:328)
at org.apache.maven.DefaultMaven.execute(DefaultMaven.java:138)
at org.apache.maven.cli.MavenCli.main(MavenCli.java:362)
at sun.reflect.NativeMethodAccessorImpl.invoke0(Native Method)
at sun.reflect.NativeMethodAccessorImpl.invoke(NativeMethodAccessorImpl.java:39)
at sun.reflect.DelegatingMethodAccessorImpl.invoke(DelegatingMethodAccessorImpl.java:25)
at java.lang.reflect.Method.invoke(Method.java:592)
at org.codehaus.classworlds.Launcher.launchEnhanced(Launcher.java:315)
at org.codehaus.classworlds.Launcher.launch(Launcher.java:255)
at hudson.maven.agent.Main.launch(Main.java:185)
at hudson.maven.MavenBuilder.call(MavenBuilder.java:151)
at hudson.maven.Maven2Builder.call(Maven2Builder.java:77)
at hudson.maven.Maven2Builder.call(Maven2Builder.java:53)
at hudson.remoting.UserRequest.perform(UserRequest.java:118)
at hudson.remoting.UserRequest.perform(UserRequest.java:48)
at hudson.remoting.Request$2.run(Request.java:326)
at hudson.remoting.InterceptingExecutorService$1.call(InterceptingExecutorService.java:72)
at java.util.concurrent.FutureTask$Sync.innerRun(FutureTask.java:269)
at java.util.concurrent.FutureTask.run(FutureTask.java:123)
at java.util.concurrent.ThreadPoolExecutor$Worker.runTask(ThreadPoolExecutor.java:651)
at java.util.concurrent.ThreadPoolExecutor$Worker.run(ThreadPoolExecutor.java:676)
at java.lang.Thread.run(Thread.java:595)
Caused by: hudson.remoting.ChannelClosedException: channel is already closed
at hudson.remoting.Channel.send(Channel.java:492)
at hudson.remoting.Request.call(Request.java:129)
at hudson.remoting.RemoteInvocationHandler.invoke(RemoteInvocationHandler.java:160)
... 32 more
Caused by: java.io.StreamCorruptedException
at java.io.ObjectInputStream.readObject0(ObjectInputStream.java:1332)
at java.io.ObjectInputStream.readObject(ObjectInputStream.java:348)
at hudson.remoting.Command.readFrom(Command.java:90)
at hudson.remoting.ClassicCommandTransport.read(ClassicCommandTransport.java:59)
at hudson.remoting.SynchronousCommandTransport$ReaderThread.run(SynchronousCommandTransport.java:48)
[INFO] ------------------------------------------------------------------------
[INFO] Total time: 1 minute 42 seconds
[INFO] Finished at: Wed Sep 05 09:19:51 UTC 2012
ERROR: Maven JVM terminated unexpectedly with exit code 0
---------------------------------------------------------------------
To unsubscribe, e-mail: torque-dev-unsubscribe@db.apache.org
For additional commands, e-mail: torque-dev-help@db.apache.org