You are viewing a plain text version of this content. The canonical link for it is here.
Posted to dev@maven.apache.org by Brett Porter <br...@apache.org> on 2007/11/03 03:56:54 UTC

Re: integration tests (was: [continuum] BUILD FAILURE: Integration Test Executor)

Hey John,

On 03/11/2007, at 11:56 AM, Continuum@maven.zones.apache.org wrote:

> Tests in error:  testit0046 
> (org.apache.maven.integrationtests.MavenIT0046Test)

Looks like your changes fixed the two IT problems, but this seems to  
be a new one? I get the same result locally - it's not able to find  
one of the core-it plugins.

Also, the following is appearing at the end of the build result now -  
is this a known problem?

[INFO]  
------------------------------------------------------------------------
[[ERROR]

Mojo:

     org.apache.maven.plugins:maven-surefire-plugin:2.3:test
FAILED for project:

     org.apache.maven.its:core-integration-tests:jar:2.1-SNAPSHOT

Reason:

There are test failures.

For more information, run with the -e flag

Thanks!
Brett

--
Brett Porter - brett@apache.org
Blog: http://www.devzuz.org/blogs/bporter/


---------------------------------------------------------------------
To unsubscribe, e-mail: dev-unsubscribe@maven.apache.org
For additional commands, e-mail: dev-help@maven.apache.org


Re: integration tests (was: [continuum] BUILD FAILURE: Integration Test Executor)

Posted by Brett Porter <br...@apache.org>.
On 03/11/2007, at 5:25 PM, Jason van Zyl wrote:

> The core IT plugins all get installed as 2.1-SNAPSHOT (when or who  
> changed that), but that test is looking for 1.0-SNAPSHOT. I always  
> install all the plugins as part of running the ITs, and I've not  
> had that problem. That plugin is looking for 1.0-SNAPSHOT so it's  
> not going to find it.

I changed it to 2.1-SNAPSHOT a while back - mentioned on the list at  
the time, and documented in the ITProblems.txt file. I must have  
missed this one - and perhaps had not cleared the local repo out  
until after that time. Fixed - sorry about that.

> Unless we're testing snapshot and/or download functionality we  
> should probably release the test plugins.

That's still going to require downloading - either way it should be  
improved. I've already documented these in ITProblems.txt.

> Isolate the ITs for plugins that must be locally installed to test  
> local only use cases. I'll take a look tomorrow but I don't see  
> John changing any POMs. I'll take a look tomorrow as I see it0119  
> and it0089 have their artifacts going to the wrong groupId (should  
> be org.apache.maven.its).

Yeah, that's annoying - I've updated ITProblems.txt (89 should be  
moved to checkstyle anyway, and 119 is testing plugin prefix order  
but should just an alternate settings.xml file).

Anyway, should be working again now.

Thanks,
- Brett


---------------------------------------------------------------------
To unsubscribe, e-mail: dev-unsubscribe@maven.apache.org
For additional commands, e-mail: dev-help@maven.apache.org


Re: integration tests (was: [continuum] BUILD FAILURE: Integration Test Executor)

Posted by Jason van Zyl <ja...@maven.org>.
On 2 Nov 07, at 7:56 PM 2 Nov 07, Brett Porter wrote:

> Hey John,
>
> On 03/11/2007, at 11:56 AM, Continuum@maven.zones.apache.org wrote:
>
>> Tests in error:   
>> testit0046(org.apache.maven.integrationtests.MavenIT0046Test)
>
> Looks like your changes fixed the two IT problems, but this seems to  
> be a new one? I get the same result locally - it's not able to find  
> one of the core-it plugins.
>
> Also, the following is appearing at the end of the build result now  
> - is this a known problem?
>

The core IT plugins all get installed as 2.1-SNAPSHOT (when or who  
changed that), but that test is looking for 1.0-SNAPSHOT. I always  
install all the plugins as part of running the ITs, and I've not had  
that problem. That plugin is looking for 1.0-SNAPSHOT so it's not  
going to find it. Unless we're testing snapshot and/or download  
functionality we should probably release the test plugins. Isolate the  
ITs for plugins that must be locally installed to test local only use  
cases. I'll take a look tomorrow but I don't see John changing any  
POMs. I'll take a look tomorrow as I see it0119 and it0089 have their  
artifacts going to the wrong groupId (should be org.apache.maven.its).

> [INFO]  
> ------------------------------------------------------------------------
> [[ERROR]
>
> Mojo:
>
>    org.apache.maven.plugins:maven-surefire-plugin:2.3:test
> FAILED for project:.
>
>    org.apache.maven.its:core-integration-tests:jar:2.1-SNAPSHOT
>
> Reason:
>
> There are test failures.
>
> For more information, run with the -e flag
>
> Thanks!
> Brett
>
> --
> Brett Porter - brett@apache.org
> Blog: http://www.devzuz.org/blogs/bporter/
>
>
> ---------------------------------------------------------------------
> To unsubscribe, e-mail: dev-unsubscribe@maven.apache.org
> For additional commands, e-mail: dev-help@maven.apache.org
>

Thanks,

Jason

----------------------------------------------------------
Jason van Zyl
Founder,  Apache Maven
jason at sonatype dot com
----------------------------------------------------------




---------------------------------------------------------------------
To unsubscribe, e-mail: dev-unsubscribe@maven.apache.org
For additional commands, e-mail: dev-help@maven.apache.org