You are viewing a plain text version of this content. The canonical link for it is here.
Posted to dev@qpid.apache.org by Steve Huston <sh...@riverace.com> on 2012/01/19 20:25:22 UTC
Federation tests failed for C++ broker last night on Red Hat 5
FYI, the C++ broker's federation test failed last night - this is the
first failure noted recently. The output is below. If anyone needs further
info on this run or the build or the system, please let me know.
-Steve
Running federation tests using brokers on ports 49758 37159 50252 48994
federation.FederationTests.test_bridge_create_and_close .................
pass
federation.FederationTests.test_dynamic_direct ..........................
pass
federation.FederationTests.test_dynamic_direct_bounce ...................
pass
federation.FederationTests.test_dynamic_direct_reorigin .................
pass
federation.FederationTests.test_dynamic_direct_route_prop ...............
pass
federation.FederationTests.test_dynamic_fanout ..........................
pass
federation.FederationTests.test_dynamic_fanout_bounce ...................
pass
federation.FederationTests.test_dynamic_fanout_route_prop ...............
pass
federation.FederationTests.test_dynamic_headers_all .....................
pass
federation.FederationTests.test_dynamic_headers_any .....................
pass
federation.FederationTests.test_dynamic_headers_bounce ..................
pass
federation.FederationTests.test_dynamic_headers_reorigin ................
pass
federation.FederationTests.test_dynamic_headers_unbind ..................
pass
federation.FederationTests.test_dynamic_topic ...........................
pass
federation.FederationTests.test_dynamic_topic_bounce ....................
pass
federation.FederationTests.test_dynamic_topic_nodup .....................
pass
federation.FederationTests.test_dynamic_topic_reorigin ..................
pass
federation.FederationTests.test_dynamic_topic_route_prop ................
pass
federation.FederationTests.test_pull_from_exchange ......................
pass
federation.FederationTests.test_pull_from_queue .........................
pass
federation.FederationTests.test_pull_from_queue_recovery ................
fail
Error during test: Traceback (most recent call last):
File
"/qpidbuilds/trunk/qpid/cpp/rhel5/src/tests/python/commands/qpid-python-te
st", line 340, in run
phase()
File "/qpidbuilds/trunk/qpid/cpp/src/tests/federation.py", line 315,
in test_pull_from_queue_recovery
self.fail("Failed to find expected message containing 'Message %d'"
% i)
File "/usr/lib64/python2.6/unittest.py", line 316, in fail
raise self.failureException, msg
AssertionError: Failed to find expected message containing 'Message 6'
federation.FederationTests.test_push_to_exchange ........................
pass
federation.FederationTests.test_tracing .................................
pass
federation.FederationTests.test_tracing_automatic .......................
pass
Totals: 27 tests, 23 passed, 0 skipped, 3 ignored, 1 failed
FAIL federation tests
---------------------------------------------------------------------
Apache Qpid - AMQP Messaging Implementation
Project: http://qpid.apache.org
Use/Interact: mailto:dev-subscribe@qpid.apache.org
RE: Federation tests failed for C++ broker last night on Red Hat 5
Posted by Steve Huston <sh...@riverace.com>.
Everything ran clean last night - thanks!
> -----Original Message-----
> From: Alan Conway [mailto:aconway@redhat.com]
> Sent: Monday, January 23, 2012 9:27 AM
> To: dev@qpid.apache.org
> Cc: Steve Huston
> Subject: Re: Federation tests failed for C++ broker last night on Red
Hat 5
>
> On 01/19/2012 02:25 PM, Steve Huston wrote:
> > FYI, the C++ broker's federation test failed last night - this is the
> > first failure noted recently. The output is below. If anyone needs
> > further info on this run or the build or the system, please let me
know.
> >
>
> This should have been fixed by r1233949. Are you still seeing the error
after
> that revision?
>
> >
> > Running federation tests using brokers on ports 49758 37159 50252
> > 48994 federation.FederationTests.test_bridge_create_and_close
> .................
> > pass
> > federation.FederationTests.test_dynamic_direct
..........................
> > pass
> > federation.FederationTests.test_dynamic_direct_bounce
...................
> > pass
> > federation.FederationTests.test_dynamic_direct_reorigin
.................
> > pass
> > federation.FederationTests.test_dynamic_direct_route_prop
...............
> > pass
> > federation.FederationTests.test_dynamic_fanout
..........................
> > pass
> > federation.FederationTests.test_dynamic_fanout_bounce
...................
> > pass
> > federation.FederationTests.test_dynamic_fanout_route_prop
...............
> > pass
> > federation.FederationTests.test_dynamic_headers_all
.....................
> > pass
> > federation.FederationTests.test_dynamic_headers_any
.....................
> > pass
> > federation.FederationTests.test_dynamic_headers_bounce
..................
> > pass
> > federation.FederationTests.test_dynamic_headers_reorigin
................
> > pass
> > federation.FederationTests.test_dynamic_headers_unbind
..................
> > pass
> > federation.FederationTests.test_dynamic_topic
...........................
> > pass
> > federation.FederationTests.test_dynamic_topic_bounce
....................
> > pass
> > federation.FederationTests.test_dynamic_topic_nodup
.....................
> > pass
> > federation.FederationTests.test_dynamic_topic_reorigin
..................
> > pass
> > federation.FederationTests.test_dynamic_topic_route_prop
................
> > pass
> > federation.FederationTests.test_pull_from_exchange
......................
> > pass
> > federation.FederationTests.test_pull_from_queue
.........................
> > pass
> > federation.FederationTests.test_pull_from_queue_recovery
................
> > fail
> > Error during test: Traceback (most recent call last):
> > File
> > "/qpidbuilds/trunk/qpid/cpp/rhel5/src/tests/python/commands/qpid-
> pytho
> > n-te
> > st", line 340, in run
> > phase()
> > File "/qpidbuilds/trunk/qpid/cpp/src/tests/federation.py", line
> > 315, in test_pull_from_queue_recovery
> > self.fail("Failed to find expected message containing 'Message
%d'"
> > % i)
> > File "/usr/lib64/python2.6/unittest.py", line 316, in fail
> > raise self.failureException, msg
> > AssertionError: Failed to find expected message containing 'Message
6'
> > federation.FederationTests.test_push_to_exchange
........................
> > pass
> > federation.FederationTests.test_tracing
.................................
> > pass
> > federation.FederationTests.test_tracing_automatic
.......................
> > pass
> > Totals: 27 tests, 23 passed, 0 skipped, 3 ignored, 1 failed FAIL
> > federation tests
> >
> >
> >
> > ---------------------------------------------------------------------
> > Apache Qpid - AMQP Messaging Implementation
> > Project: http://qpid.apache.org
> > Use/Interact: mailto:dev-subscribe@qpid.apache.org
> >
---------------------------------------------------------------------
Apache Qpid - AMQP Messaging Implementation
Project: http://qpid.apache.org
Use/Interact: mailto:dev-subscribe@qpid.apache.org
Re: Federation tests failed for C++ broker last night on Red Hat
5
Posted by Alan Conway <ac...@redhat.com>.
On 01/19/2012 02:25 PM, Steve Huston wrote:
> FYI, the C++ broker's federation test failed last night - this is the
> first failure noted recently. The output is below. If anyone needs further
> info on this run or the build or the system, please let me know.
>
This should have been fixed by r1233949. Are you still seeing the error after
that revision?
>
> Running federation tests using brokers on ports 49758 37159 50252 48994
> federation.FederationTests.test_bridge_create_and_close .................
> pass
> federation.FederationTests.test_dynamic_direct ..........................
> pass
> federation.FederationTests.test_dynamic_direct_bounce ...................
> pass
> federation.FederationTests.test_dynamic_direct_reorigin .................
> pass
> federation.FederationTests.test_dynamic_direct_route_prop ...............
> pass
> federation.FederationTests.test_dynamic_fanout ..........................
> pass
> federation.FederationTests.test_dynamic_fanout_bounce ...................
> pass
> federation.FederationTests.test_dynamic_fanout_route_prop ...............
> pass
> federation.FederationTests.test_dynamic_headers_all .....................
> pass
> federation.FederationTests.test_dynamic_headers_any .....................
> pass
> federation.FederationTests.test_dynamic_headers_bounce ..................
> pass
> federation.FederationTests.test_dynamic_headers_reorigin ................
> pass
> federation.FederationTests.test_dynamic_headers_unbind ..................
> pass
> federation.FederationTests.test_dynamic_topic ...........................
> pass
> federation.FederationTests.test_dynamic_topic_bounce ....................
> pass
> federation.FederationTests.test_dynamic_topic_nodup .....................
> pass
> federation.FederationTests.test_dynamic_topic_reorigin ..................
> pass
> federation.FederationTests.test_dynamic_topic_route_prop ................
> pass
> federation.FederationTests.test_pull_from_exchange ......................
> pass
> federation.FederationTests.test_pull_from_queue .........................
> pass
> federation.FederationTests.test_pull_from_queue_recovery ................
> fail
> Error during test: Traceback (most recent call last):
> File
> "/qpidbuilds/trunk/qpid/cpp/rhel5/src/tests/python/commands/qpid-python-te
> st", line 340, in run
> phase()
> File "/qpidbuilds/trunk/qpid/cpp/src/tests/federation.py", line 315,
> in test_pull_from_queue_recovery
> self.fail("Failed to find expected message containing 'Message %d'"
> % i)
> File "/usr/lib64/python2.6/unittest.py", line 316, in fail
> raise self.failureException, msg
> AssertionError: Failed to find expected message containing 'Message 6'
> federation.FederationTests.test_push_to_exchange ........................
> pass
> federation.FederationTests.test_tracing .................................
> pass
> federation.FederationTests.test_tracing_automatic .......................
> pass
> Totals: 27 tests, 23 passed, 0 skipped, 3 ignored, 1 failed
> FAIL federation tests
>
>
>
> ---------------------------------------------------------------------
> Apache Qpid - AMQP Messaging Implementation
> Project: http://qpid.apache.org
> Use/Interact: mailto:dev-subscribe@qpid.apache.org
>
---------------------------------------------------------------------
Apache Qpid - AMQP Messaging Implementation
Project: http://qpid.apache.org
Use/Interact: mailto:dev-subscribe@qpid.apache.org