You are viewing a plain text version of this content. The canonical link for it is here.
Posted to builds@cassandra.apache.org by Apache Jenkins Server <je...@builds.apache.org> on 2025/04/16 00:50:20 UTC

Build complete: Cassandra-trunk #2114 [UNSTABLE] 6b2cdba56b85b948a8716a02b2cd3015e8d1ff9a

-------------------------------------------------------------------------------
  Build Cassandra-trunk #2114 Still Unstable
  URL: https://ci-cassandra.apache.org/job/Cassandra-trunk/2114/
  -------------------------------------------------------------------------------
  Changes:
  [David Capwell] AST fuzz tests can be flakey in multi node clusters due to ephemeral


  -------------------------------------------------------------------------------
  Failed Tests:
  12 tests failed.
FAILED:  dtest-novnode.topology_test.TestTopology.Tests / dtest-novnode jdk17 21/64 / test_movement
FAILED:  dtest.disk_balance_test.TestDiskBalance.Tests / dtest jdk17 51/64 / test_disk_balance_after_joining_ring_lcs
FAILED:  dtest.repair_tests.incremental_repair_test.TestIncRepair.Tests / dtest jdk17 37/64 / test_multiple_full_repairs_lcs
FAILED:  org.apache.cassandra.db.commitlog.BatchCommitLogTest.Tests / test-compression jdk11 6/16 / testBatchCLShutDownImmediately[1]-compression_jdk11_x86_64
FAILED:  org.apache.cassandra.db.compaction.CompactionsBytemanTest.Tests / test-oa jdk11 1/16 / testSSTableNotEnoughDiskSpaceForCompactionGetsDropped-oa_jdk11_x86_64
FAILED:  org.apache.cassandra.db.marshal.AbstractTypeTest.Tests / test-oa jdk11 9/16 / testBackwardCompatibility-cassandra.testtag_IS_UNDEFINED
FAILED:  org.apache.cassandra.simulator.test.HarrySimulatorTest.Tests / simulator-dtest jdk11 / test-cassandra.testtag_IS_UNDEFINED
FAILED:  org.apache.cassandra.db.compaction.unified.ShardedCompactionWriterTest.Tests / test-oa jdk11 9/16 / testOneSSTablePerShard-cassandra.testtag_IS_UNDEFINED
FAILED:  dtest-latest.largecolumn_test.TestLargeColumn.Tests / dtest-latest jdk17 34/64 / test_cleanup
FAILED:  dtest-latest.largecolumn_test.TestLargeColumn.Tests / dtest-latest jdk11 34/64 / test_cleanup
FAILED:  org.apache.cassandra.fuzz.sai.MultiNodeSAITest.Tests / jvm-dtest jdk17 4/12 / indexOnlySaiTest-cassandra.testtag_IS_UNDEFINED
FAILED:  org.apache.cassandra.fuzz.sai.MultiNodeSAITest.Tests / jvm-dtest jdk11 4/12 / indexOnlySaiTest-cassandra.testtag_IS_UNDEFINED

  -------------------------------------------------------------------------------
  For complete test report and logs see https://nightlies.apache.org/cassandra/Cassandra-trunk/2114/