You are viewing a plain text version of this content. The canonical link for it is here.
Posted to commits@cassandra.apache.org by "Bret McGuire (Jira)" <ji...@apache.org> on 2025/01/02 21:10:00 UTC

[jira] [Commented] (CASSJAVA-67) Issues with Maven build after ASF donation

    [ https://issues.apache.org/jira/browse/CASSJAVA-67?page=com.atlassian.jira.plugin.system.issuetabpanels:comment-tabpanel&focusedCommentId=17909422#comment-17909422 ] 

Bret McGuire commented on CASSJAVA-67:
--------------------------------------

Fortunately [~adutra]  has already done some pretty extensive analysis of this issue and appears to have fixed things up.  I'm working on putting all of his suggestions into a PR for 3.x now.

> Issues with Maven build after ASF donation
> ------------------------------------------
>
>                 Key: CASSJAVA-67
>                 URL: https://issues.apache.org/jira/browse/CASSJAVA-67
>             Project: Apache Cassandra Java driver
>          Issue Type: Bug
>            Reporter: Bret McGuire
>            Priority: Normal
>             Fix For: 3.12.0
>
>
> While preparing 3.12.0 for release came across this issue when executing "mvn release:prepare":
>  
> {code:java}
> [INFO] [INFO] ---------< org.apache.cassandra:cassandra-driver-tests-parent >---------                                                                                                                  [INFO] [INFO] Building Java Driver for Apache Cassandra Tests 3.11.6-SNAPSHOT   [6/16]                                                                                                                    [INFO] [INFO]   from driver-tests/pom.xml                                                                                                                                                                  [INFO] [INFO] --------------------------------[ pom ]---------------------------------                                                                                                                     [INFO] [INFO]                                                                                                                                                                                              [INFO] [INFO] --- clean:3.0.0:clean (default-clean) @ cassandra-driver-tests-parent ---                                                                                                                    [INFO] [INFO]                                                                                                                                                                                              [INFO] [INFO] --- enforcer:1.4.1:enforce (enforce-maven-version) @ cassandra-driver-tests-parent ---                                                                                                       [INFO] [INFO]                                                                                                                                                                                              [INFO] [INFO] --- license:3.0:check (check-license) @ cassandra-driver-tests-parent ---                                                                                                                    [INFO] [INFO] Checking licenses...                                                                                                                                                                         [INFO] [INFO]                                                                                                                                                                                              [INFO] [INFO] --- fmt:2.9:check (check-format) @ cassandra-driver-tests-parent ---                                                                                                                         [INFO] [INFO] Skipping format check: project uses 'pom' packaging                                                                                                                                          [INFO] [INFO]                                                                                                                                                                                              [INFO] [INFO] --- remote-resources:1.7.0:process (process-resource-bundles) @ cassandra-driver-tests-parent ---                                                                                            	 
> [INFO] [INFO] Skipping remote resources execution.                                                                                                                                                         [INFO] [INFO]                                                                                                                                                                                              [INFO] [INFO] >>> clirr:2.7:check (default) > compile @ cassandra-driver-tests-parent >>>                                                                                                                  [INFO] [INFO]                                                                                                                                                                                              [INFO] [INFO] --- enforcer:1.4.1:enforce (enforce-maven-version) @ cassandra-driver-tests-parent ---                                                                                                       [INFO] [INFO]                                                                                                                                                                                              [INFO] [INFO] --- license:3.0:check (check-license) @ cassandra-driver-tests-parent ---                                                                                                                    [INFO] [INFO] Checking licenses...                                                                                                                                                                         [INFO] [INFO]                                                                                                                                                                                              [INFO] [INFO] --- fmt:2.9:check (check-format) @ cassandra-driver-tests-parent ---                                                                                                                         [INFO] [INFO] Skipping format check: project uses 'pom' packaging                                                                                                                                          [INFO] [INFO]                                                                                                                                                                                              [INFO] [INFO] --- remote-resources:1.7.0:process (process-resource-bundles) @ cassandra-driver-tests-parent ---                                                                                            	 
> [INFO] [INFO] Skipping remote resources execution.                                                                                                                                                         [INFO] [INFO]                                                                                                                                                                                              [INFO] [INFO] <<< clirr:2.7:check (default) < compile @ cassandra-driver-tests-parent <<<                                                                                                                  [INFO] [INFO]                                                                                                                                                                                              [INFO] [INFO]                                                                                                                                                                                              [INFO] [INFO] --- clirr:2.7:check (default) @ cassandra-driver-tests-parent ---                                                                                                                            [INFO] [INFO] Skipping execution                                                                                                                                                                           [INFO] [INFO]                                                                                                                                                                                              	 
> [INFO] [INFO] --- animal-sniffer:1.16:check (check-jdk6) @ cassandra-driver-tests-parent ---                                                                                                            [INFO] [INFO] --- animal-sniffer:1.16:check (check-jdk8) @ cassandra-driver-tests-parent ---
> [INFO] [INFO] Checking unresolved references to org.codehaus.mojo.signature:java18:1.0
> [INFO] [INFO]
> [INFO] [INFO] --- site:3.6:attach-descriptor (attach-descriptor) @ cassandra-driver-tests-parent ---
> [INFO] [INFO] No site descriptor found: nothing to attach.
> [INFO] [INFO]
> [INFO] [INFO] --- assembly:3.0.0:single (source-release-assembly) @ cassandra-driver-tests-parent ---
> [INFO] [INFO] Skipping the assembly in this project because it's not the Execution Root
> [INFO] [INFO]
> [INFO] [INFO] --- source:3.0.1:jar-no-fork (attach-sources) @ cassandra-driver-tests-parent ---
> [INFO] [INFO] Skipping source per configuration.
> [INFO] [INFO]
> [INFO] [INFO] --- javadoc:3.0.1:jar (attach-javadocs) @ cassandra-driver-tests-parent ---
> [INFO] [INFO] Not executing Javadoc as the project is not a Java classpath-capable package
> [INFO] [INFO]
> [INFO] [INFO] --- gpg:1.5:sign (sign-release-artifacts) @ cassandra-driver-tests-parent ---
> [INFO] [INFO]
> [INFO] [INFO] --- checksum:1.7:files (source-release-checksum) @ cassandra-driver-tests-parent ---
> [INFO] [INFO] ------------------------------------------------------------------------
> [INFO] [INFO] Reactor Summary for Java Driver for Apache Cassandra 3.11.6-SNAPSHOT:
> [INFO] [INFO]
> [INFO] [INFO] Java Driver for Apache Cassandra ................... SUCCESS [  2.620 s]
> [INFO] [INFO] Java Driver for Apache Cassandra - Core ............ SUCCESS [ 33.031 s]
> [INFO] [INFO] Java Driver for Apache Cassandra - Object Mapping .. SUCCESS [  7.740 s]
> [INFO] [INFO] Java Driver for Apache Cassandra - Extras .......... SUCCESS [  6.444 s]
> [INFO] [INFO] Java Driver for Apache Cassandra - Examples ........ SUCCESS [  1.943 s]
> [INFO] [INFO] Java Driver for Apache Cassandra Tests ............. FAILURE [  0.302 s]
> [INFO] [INFO] Java Driver for Apache Cassandra Tests - Stress .... SKIPPED
> [INFO] [INFO] Java Driver for Apache Cassandra Tests - OSGi ...... SKIPPED
> [INFO] [INFO] Java Driver for Apache Cassandra Tests - OSGi - Shaded SKIPPED
> [INFO] [INFO] Java Driver for Apache Cassandra Tests - OSGi - Shaded SKIPPED
> [INFO] [INFO] Java Driver for Apache Cassandra Tests - OSGi - Unshaded SKIPPED
> [INFO] [INFO] Java Driver for Apache Cassandra Tests - Shading ... SKIPPED
> [INFO] [INFO] Java Driver for Apache Cassandra Tests - Shading - Shaded SKIPPED
> [INFO] [INFO] Java Driver for Apache Cassandra Tests - Shading - Unshaded SKIPPED
> [INFO] [INFO] Apache Cassandra Java Driver - source distribution . SKIPPED
> [INFO] [INFO] Java Driver for Apache Cassandra - Binary distribution SKIPPED
> [INFO] [INFO] ------------------------------------------------------------------------
> [INFO] [INFO] BUILD FAILURE
> [INFO] [INFO] ------------------------------------------------------------------------
> [INFO] [INFO] Total time:  52.778 s
> [INFO] [INFO] Finished at: 2024-12-23T16:52:18-06:00
> [INFO] [INFO] ------------------------------------------------------------------------
> [INFO] [ERROR] Failed to execute goal net.nicoulaj.maven.plugins:checksum-maven-plugin:1.7:files (source-release-checksum) on project cassandra-driver-tests-parent: Execution source-release-checksum of goal n
> et.nicoulaj.maven.plugins:checksum-maven-plugin:1.7:files failed: basedir /work/git/cassandra-java-driver-absurdfarce/driver-tests/target does not exist -> [Help 1] {code}
>  



--
This message was sent by Atlassian Jira
(v8.20.10#820010)

---------------------------------------------------------------------
To unsubscribe, e-mail: commits-unsubscribe@cassandra.apache.org
For additional commands, e-mail: commits-help@cassandra.apache.org