You are viewing a plain text version of this content. The canonical link for it is here.
Posted to dev@zookeeper.apache.org by Apache Jenkins Server <je...@builds.apache.org> on 2016/03/23 11:00:55 UTC

ZooKeeper_branch35_openjdk7 - Build # 23 - Still Failing

See https://builds.apache.org/job/ZooKeeper_branch35_openjdk7/23/

###################################################################################
########################## LAST 60 LINES OF THE CONSOLE ###########################
[...truncated 1519 lines...]
[ivy:retrieve] downloading http://repo1.maven.org/maven2/log4j/log4j/1.2.17/log4j-1.2.17.jar ...
[ivy:retrieve] ......... (478kB)
[ivy:retrieve] .. (0kB)
[ivy:retrieve] 	[SUCCESSFUL ] log4j#log4j;1.2.17!log4j.jar(bundle) (36ms)
[ivy:retrieve] downloading http://repo1.maven.org/maven2/io/netty/netty/3.7.1.Final/netty-3.7.1.Final.jar ...
[ivy:retrieve] ....................... (1181kB)
[ivy:retrieve] .. (0kB)
[ivy:retrieve] 	[SUCCESSFUL ] io.netty#netty;3.7.1.Final!netty.jar (50ms)
[ivy:retrieve] downloading http://repo1.maven.org/maven2/net/java/dev/javacc/javacc/5.0/javacc-5.0.jar ...
[ivy:retrieve] ...... (291kB)
[ivy:retrieve] .. (0kB)
[ivy:retrieve] 	[SUCCESSFUL ] net.java.dev.javacc#javacc;5.0!javacc.jar (34ms)
[ivy:retrieve] :: resolution report :: resolve 13605ms :: artifacts dl 481ms
	---------------------------------------------------------------------
	|                  |            modules            ||   artifacts   |
	|       conf       | number| search|dwnlded|evicted|| number|dwnlded|
	---------------------------------------------------------------------
	|      default     |   12  |   12  |   12  |   0   ||   12  |   12  |
	---------------------------------------------------------------------
[ivy:retrieve] :: retrieving :: org.apache.zookeeper#zookeeper
[ivy:retrieve] 	confs: [default]
[ivy:retrieve] 	12 artifacts copied, 0 already retrieved (4049kB/33ms)

clover.setup:

clover.info:

clover:

generate_jute_parser:
    [mkdir] Created dir: /home/jenkins/jenkins-slave/workspace/ZooKeeper_branch35_openjdk7/branch-3.5/build/jute_compiler/org/apache/jute/compiler/generated
[ivy:artifactproperty] DEPRECATED: 'ivy.conf.file' is deprecated, use 'ivy.settings.file' instead
[ivy:artifactproperty] :: loading settings :: file = /home/jenkins/jenkins-slave/workspace/ZooKeeper_branch35_openjdk7/branch-3.5/ivysettings.xml
     [move] Moving 1 file to /home/jenkins/jenkins-slave/workspace/ZooKeeper_branch35_openjdk7/branch-3.5/build/lib
   [javacc] Java Compiler Compiler Version 5.0 (Parser Generator)
   [javacc] (type "javacc" with no arguments for help)
   [javacc] Reading from file /home/jenkins/jenkins-slave/workspace/ZooKeeper_branch35_openjdk7/branch-3.5/src/java/main/org/apache/jute/compiler/generated/rcc.jj . . .
   [javacc] File "TokenMgrError.java" does not exist.  Will create one.
   [javacc] File "ParseException.java" does not exist.  Will create one.
   [javacc] File "Token.java" does not exist.  Will create one.
   [javacc] File "SimpleCharStream.java" does not exist.  Will create one.
   [javacc] Parser generated successfully.

jute:

BUILD FAILED
/home/jenkins/jenkins-slave/workspace/ZooKeeper_branch35_openjdk7/branch-3.5/build.xml:1322: The following error occurred while executing this line:
/home/jenkins/jenkins-slave/workspace/ZooKeeper_branch35_openjdk7/branch-3.5/build.xml:272: Unable to find a javac compiler;
com.sun.tools.javac.Main is not on the classpath.
Perhaps JAVA_HOME does not point to the JDK.
It is currently set to "/usr/lib/jvm/java-7-openjdk-amd64/jre"

Total time: 16 seconds
Build step 'Invoke Ant' marked build as failure
Archiving artifacts
Recording test results
ERROR: Step ‘Publish JUnit test result report’ failed: No test report files were found. Configuration error?
Email was triggered for: Failure - Any
Sending email for trigger: Failure - Any



###################################################################################
############################## FAILED TESTS (if any) ##############################
No tests ran.

ZooKeeper_branch35_openjdk7 - Build # 26 - Still Failing

Posted by Apache Jenkins Server <je...@builds.apache.org>.
See https://builds.apache.org/job/ZooKeeper_branch35_openjdk7/26/

###################################################################################
########################## LAST 60 LINES OF THE CONSOLE ###########################
[...truncated 357028 lines...]
     [exec] Log Message Received: [2016-03-26 10:07:06,044:6859(0x2af61c51e540):ZOO_INFO@testLogCallbackInit@993: testLogCallbackInit #8]
     [exec] Log Message Received: [2016-03-26 10:07:06,044:6859(0x2af61c51e540):ZOO_INFO@testLogCallbackInit@993: testLogCallbackInit #9]
     [exec] Log Message Received: [2016-03-26 10:07:06,044:6859(0x2af61c51e540):ZOO_INFO@zookeeper_close@3257: Closing zookeeper sessionId=0x106e1083906000e to [127.0.0.1:22181]
     [exec] ]
     [exec]  : elapsed 1001 : OK
     [exec] Zookeeper_simpleSystem::testLogCallbackClearLog Message Received: [2016-03-26 10:07:06,044:6859(0x2af61c51e540):ZOO_INFO@log_env@1027: Client environment:zookeeper.version=zookeeper C client 3.5.1]
     [exec] Log Message Received: [2016-03-26 10:07:06,044:6859(0x2af61c51e540):ZOO_INFO@log_env@1031: Client environment:host.name=pomona.apache.org]
     [exec] Log Message Received: [2016-03-26 10:07:06,044:6859(0x2af61c51e540):ZOO_INFO@log_env@1038: Client environment:os.name=Linux]
     [exec] Log Message Received: [2016-03-26 10:07:06,044:6859(0x2af61c51e540):ZOO_INFO@log_env@1039: Client environment:os.arch=3.13.0-36-lowlatency]
     [exec] Log Message Received: [2016-03-26 10:07:06,044:6859(0x2af61c51e540):ZOO_INFO@log_env@1040: Client environment:os.version=#63-Ubuntu SMP PREEMPT Wed Sep 3 21:56:12 UTC 2014]
     [exec] Log Message Received: [2016-03-26 10:07:06,044:6859(0x2af61c51e540):ZOO_INFO@log_env@1048: Client environment:user.name=jenkins]
     [exec] Log Message Received: [2016-03-26 10:07:06,044:6859(0x2af61c51e540):ZOO_INFO@log_env@1056: Client environment:user.home=/home/jenkins]
     [exec] Log Message Received: [2016-03-26 10:07:06,044:6859(0x2af61c51e540):ZOO_INFO@log_env@1068: Client environment:user.dir=/home/jenkins/jenkins-slave/workspace/ZooKeeper_branch35_openjdk7/branch-3.5/build/test/test-cppunit]
     [exec] Log Message Received: [2016-03-26 10:07:06,044:6859(0x2af61c51e540):ZOO_INFO@zookeeper_init_internal@1111: Initiating client connection, host=127.0.0.1:22181 sessionTimeout=10000 watcher=0x45d2a0 sessionId=0 sessionPasswd=<null> context=0x7fff020ee640 flags=0]
     [exec] Log Message Received: [2016-03-26 10:07:06,045:6859(0x2af61ebad700):ZOO_INFO@check_events@2357: initiated connection to server [127.0.0.1:22181]]
     [exec] Log Message Received: [2016-03-26 10:07:06,047:6859(0x2af61ebad700):ZOO_INFO@check_events@2409: session establishment complete on server [127.0.0.1:22181], sessionId=0x106e1083906000f, negotiated timeout=10000 ]
     [exec]  : elapsed 1001 : OK
     [exec] Zookeeper_simpleSystem::testAsyncWatcherAutoReset ZooKeeper server started : elapsed 10468 : OK
     [exec] Zookeeper_simpleSystem::testDeserializeString : elapsed 0 : OK
     [exec] Zookeeper_simpleSystem::testFirstServerDown : elapsed 1001 : OK
     [exec] Zookeeper_simpleSystem::testNullData : elapsed 1028 : OK
     [exec] Zookeeper_simpleSystem::testIPV6 : elapsed 1005 : OK
     [exec] Zookeeper_simpleSystem::testCreate : elapsed 1007 : OK
     [exec] Zookeeper_simpleSystem::testPath : elapsed 1014 : OK
     [exec] Zookeeper_simpleSystem::testPathValidation : elapsed 1034 : OK
     [exec] Zookeeper_simpleSystem::testPing : elapsed 17163 : OK
     [exec] Zookeeper_simpleSystem::testAcl : elapsed 1014 : OK
     [exec] Zookeeper_simpleSystem::testChroot : elapsed 3028 : OK
     [exec] Zookeeper_simpleSystem::testAuth ZooKeeper server started ZooKeeper server started : elapsed 30932 : OK
     [exec] Zookeeper_simpleSystem::testHangingClient : elapsed 1026 : OK
     [exec] Zookeeper_simpleSystem::testWatcherAutoResetWithGlobal ZooKeeper server started ZooKeeper server started ZooKeeper server started : elapsed 15494 : OK
     [exec] Zookeeper_simpleSystem::testWatcherAutoResetWithLocal ZooKeeper server started ZooKeeper server started ZooKeeper server started : elapsed 15435 : OK
     [exec] Zookeeper_simpleSystem::testGetChildren2 : elapsed 1048 : OK
     [exec] Zookeeper_simpleSystem::testLastZxid : elapsed 4532 : OK
     [exec] Zookeeper_simpleSystem::testRemoveWatchers ZooKeeper server started : elapsed 4550 : OK
     [exec] Zookeeper_readOnly::testReadOnly : elapsed 4180 : OK
     [exec] /home/jenkins/jenkins-slave/workspace/ZooKeeper_branch35_openjdk7/branch-3.5/src/c/tests/TestReconfig.cc:490: Assertion: assertion failed [Expression: found != string::npos]
     [exec] Failures !!!
     [exec] Run: 72   Failure total: 1   Failures: 1   Errors: 0
     [exec] FAIL: zktest-mt
     [exec] ==========================================
     [exec] 1 of 2 tests failed
     [exec] Please report to user@zookeeper.apache.org
     [exec] ==========================================
     [exec] make[1]: Leaving directory `/home/jenkins/jenkins-slave/workspace/ZooKeeper_branch35_openjdk7/branch-3.5/build/test/test-cppunit'
     [exec] make[1]: *** [check-TESTS] Error 1
     [exec] make: *** [check-am] Error 2

BUILD FAILED
/home/jenkins/jenkins-slave/workspace/ZooKeeper_branch35_openjdk7/branch-3.5/build.xml:1322: The following error occurred while executing this line:
/home/jenkins/jenkins-slave/workspace/ZooKeeper_branch35_openjdk7/branch-3.5/build.xml:1282: The following error occurred while executing this line:
/home/jenkins/jenkins-slave/workspace/ZooKeeper_branch35_openjdk7/branch-3.5/build.xml:1292: exec returned: 2

Total time: 12 minutes 8 seconds
Build step 'Invoke Ant' marked build as failure
Archiving artifacts
Recording test results
Email was triggered for: Failure - Any
Sending email for trigger: Failure - Any



###################################################################################
############################## FAILED TESTS (if any) ##############################
All tests passed

ZooKeeper_branch35_openjdk7 - Build # 25 - Still Failing

Posted by Apache Jenkins Server <je...@builds.apache.org>.
See https://builds.apache.org/job/ZooKeeper_branch35_openjdk7/25/

###################################################################################
########################## LAST 60 LINES OF THE CONSOLE ###########################
[...truncated 1471 lines...]
[ivy:retrieve] 	found jline#jline;2.11 in maven2
[ivy:retrieve] 	found org.mortbay.jetty#jetty;6.1.26 in maven2
[ivy:retrieve] 	found org.mortbay.jetty#jetty-util;6.1.26 in maven2
[ivy:retrieve] 	found org.mortbay.jetty#servlet-api;2.5-20081211 in maven2
[ivy:retrieve] 	found org.codehaus.jackson#jackson-mapper-asl;1.9.11 in maven2
[ivy:retrieve] 	found org.codehaus.jackson#jackson-core-asl;1.9.11 in maven2
[ivy:retrieve] 	found org.slf4j#slf4j-api;1.7.5 in maven2
[ivy:retrieve] 	found org.slf4j#slf4j-log4j12;1.7.5 in maven2
[ivy:retrieve] 	found commons-cli#commons-cli;1.2 in maven2
[ivy:retrieve] 	found log4j#log4j;1.2.17 in maven2
[ivy:retrieve] 	found io.netty#netty;3.7.1.Final in maven2
[ivy:retrieve] 	found net.java.dev.javacc#javacc;5.0 in maven2
[ivy:retrieve] :: resolution report :: resolve 402ms :: artifacts dl 16ms
	---------------------------------------------------------------------
	|                  |            modules            ||   artifacts   |
	|       conf       | number| search|dwnlded|evicted|| number|dwnlded|
	---------------------------------------------------------------------
	|      default     |   12  |   0   |   0   |   0   ||   12  |   0   |
	---------------------------------------------------------------------
[ivy:retrieve] :: retrieving :: org.apache.zookeeper#zookeeper
[ivy:retrieve] 	confs: [default]
[ivy:retrieve] 	12 artifacts copied, 0 already retrieved (4049kB/29ms)

clover.setup:

clover.info:

clover:

generate_jute_parser:
    [mkdir] Created dir: /home/jenkins/jenkins-slave/workspace/ZooKeeper_branch35_openjdk7/branch-3.5/build/jute_compiler/org/apache/jute/compiler/generated
[ivy:artifactproperty] DEPRECATED: 'ivy.conf.file' is deprecated, use 'ivy.settings.file' instead
[ivy:artifactproperty] :: loading settings :: file = /home/jenkins/jenkins-slave/workspace/ZooKeeper_branch35_openjdk7/branch-3.5/ivysettings.xml
     [move] Moving 1 file to /home/jenkins/jenkins-slave/workspace/ZooKeeper_branch35_openjdk7/branch-3.5/build/lib
   [javacc] Java Compiler Compiler Version 5.0 (Parser Generator)
   [javacc] (type "javacc" with no arguments for help)
   [javacc] Reading from file /home/jenkins/jenkins-slave/workspace/ZooKeeper_branch35_openjdk7/branch-3.5/src/java/main/org/apache/jute/compiler/generated/rcc.jj . . .
   [javacc] File "TokenMgrError.java" does not exist.  Will create one.
   [javacc] File "ParseException.java" does not exist.  Will create one.
   [javacc] File "Token.java" does not exist.  Will create one.
   [javacc] File "SimpleCharStream.java" does not exist.  Will create one.
   [javacc] Parser generated successfully.

jute:

BUILD FAILED
/home/jenkins/jenkins-slave/workspace/ZooKeeper_branch35_openjdk7/branch-3.5/build.xml:1322: The following error occurred while executing this line:
/home/jenkins/jenkins-slave/workspace/ZooKeeper_branch35_openjdk7/branch-3.5/build.xml:272: Unable to find a javac compiler;
com.sun.tools.javac.Main is not on the classpath.
Perhaps JAVA_HOME does not point to the JDK.
It is currently set to "/usr/lib/jvm/java-7-openjdk-amd64/jre"

Total time: 2 seconds
Build step 'Invoke Ant' marked build as failure
Archiving artifacts
Recording test results
ERROR: Step ‘Publish JUnit test result report’ failed: No test report files were found. Configuration error?
Email was triggered for: Failure - Any
Sending email for trigger: Failure - Any



###################################################################################
############################## FAILED TESTS (if any) ##############################
No tests ran.

ZooKeeper_branch35_openjdk7 - Build # 24 - Still Failing

Posted by Apache Jenkins Server <je...@builds.apache.org>.
See https://builds.apache.org/job/ZooKeeper_branch35_openjdk7/24/

###################################################################################
########################## LAST 60 LINES OF THE CONSOLE ###########################
[...truncated 385412 lines...]
    [junit] 2016-03-24 10:57:05,634 [myid:] - INFO  [ProcessThread(sid:0 cport:11222)::PrepRequestProcessor@154] - PrepRequestProcessor exited loop!
    [junit] 2016-03-24 10:57:05,635 [myid:] - INFO  [SyncThread:0:SyncRequestProcessor@169] - SyncRequestProcessor exited!
    [junit] 2016-03-24 10:57:05,635 [myid:] - INFO  [main:FinalRequestProcessor@479] - shutdown of request processor complete
    [junit] 2016-03-24 10:57:05,635 [myid:] - INFO  [main:MBeanRegistry@128] - Unregister MBean [org.apache.ZooKeeperService:name0=StandaloneServer_port11222,name1=InMemoryDataTree]
    [junit] 2016-03-24 10:57:05,636 [myid:] - INFO  [main:MBeanRegistry@128] - Unregister MBean [org.apache.ZooKeeperService:name0=StandaloneServer_port11222]
    [junit] 2016-03-24 10:57:05,636 [myid:] - INFO  [main:FourLetterWordMain@85] - connecting to 127.0.0.1 11222
    [junit] 2016-03-24 10:57:05,637 [myid:] - INFO  [main:JMXEnv@146] - ensureOnly:[]
    [junit] 2016-03-24 10:57:05,642 [myid:] - INFO  [main:ClientBase@562] - fdcount after test is: 54 at start it was 43
    [junit] 2016-03-24 10:57:05,642 [myid:] - INFO  [main:ClientBase@564] - sleeping for 20 secs
    [junit] 2016-03-24 10:57:05,643 [myid:] - INFO  [main:ZKTestCase$1@65] - SUCCEEDED testQuota
    [junit] 2016-03-24 10:57:05,644 [myid:] - INFO  [main:ZKTestCase$1@60] - FINISHED testQuota
    [junit] Tests run: 1, Failures: 0, Errors: 0, Time elapsed: 0.826 sec

junit.run-concurrent:

junit.run:

test-core-java:

call-test-cppunit:

init:

check-cppunit-makefile:

create-cppunit-makefile:

init:

check-cppunit-configure:

create-cppunit-configure:
    [mkdir] Created dir: /x1/jenkins/jenkins-slave/workspace/ZooKeeper_branch35_openjdk7/branch-3.5/build/test/test-cppunit
     [exec] checking for doxygen... no
     [exec] checking for perl... /usr/bin/perl
     [exec] checking for dot... no
     [exec] checking for a BSD-compatible install... /usr/bin/install -c
     [exec] checking whether build environment is sane... 
     [exec] /bin/bash: /x1/jenkins/jenkins-slave/workspace/ZooKeeper_branch35_openjdk7/branch-3.5/src/c/missing: No such file or directory
     [exec] configure: WARNING: `missing' script is too old or missing
     [exec] /x1/jenkins/jenkins-slave/workspace/ZooKeeper_branch35_openjdk7/branch-3.5/src/c/configure: line 4907: syntax error near unexpected token `1.10.2'
     [exec] /x1/jenkins/jenkins-slave/workspace/ZooKeeper_branch35_openjdk7/branch-3.5/src/c/configure: line 4907: `   AM_PATH_CPPUNIT(1.10.2)'
     [exec] yes
     [exec] checking for a thread-safe mkdir -p... /bin/mkdir -p
     [exec] checking for gawk... no
     [exec] checking for mawk... mawk
     [exec] checking whether make sets $(MAKE)... yes

BUILD FAILED
/x1/jenkins/jenkins-slave/workspace/ZooKeeper_branch35_openjdk7/branch-3.5/build.xml:1322: The following error occurred while executing this line:
/x1/jenkins/jenkins-slave/workspace/ZooKeeper_branch35_openjdk7/branch-3.5/build.xml:1281: The following error occurred while executing this line:
/x1/jenkins/jenkins-slave/workspace/ZooKeeper_branch35_openjdk7/branch-3.5/build.xml:1273: exec returned: 2

Total time: 60 minutes 8 seconds
Build step 'Invoke Ant' marked build as failure
Archiving artifacts
Recording test results
Email was triggered for: Failure - Any
Sending email for trigger: Failure - Any



###################################################################################
############################## FAILED TESTS (if any) ##############################
All tests passed