You are viewing a plain text version of this content. The canonical link for it is here.
Posted to dev@oozie.apache.org by Apache Jenkins Server <je...@builds.apache.org> on 2014/12/29 14:49:32 UTC
Build failed in Jenkins: oozie-trunk-precommit-build #2159
See <https://builds.apache.org/job/oozie-trunk-precommit-build/2159/changes>
Changes:
[shwethags] OOZIE-2027 Disable re-runs using the workflow directly if it has a parent (jaydeepvishwakarma via shwethags)
------------------------------------------
[...truncated 11839 lines...]
[INFO] ------------------------------------------------------------------------
[INFO]
[INFO] --- maven-remote-resources-plugin:1.5:process (default) @ oozie-mini ---
[INFO]
[INFO] --- maven-resources-plugin:2.5:resources (default-resources) @ oozie-mini ---
[debug] execute contextualize
[INFO] Using 'UTF-8' encoding to copy filtered resources.
[INFO] skip non existing resourceDirectory <https://builds.apache.org/job/oozie-trunk-precommit-build/ws/minitest/src/main/resources>
[INFO] Copying 3 resources
[INFO]
[INFO] --- maven-compiler-plugin:2.3.2:compile (default-compile) @ oozie-mini ---
[INFO] No sources to compile
[INFO]
[INFO] --- maven-resources-plugin:2.5:testResources (default-testResources) @ oozie-mini ---
[debug] execute contextualize
[INFO] Using 'UTF-8' encoding to copy filtered resources.
[INFO] Copying 3 resources
[INFO] Copying 3 resources
[INFO]
[INFO] --- maven-compiler-plugin:2.3.2:testCompile (default-testCompile) @ oozie-mini ---
[INFO] Nothing to compile - all classes are up to date
[INFO]
[INFO] --- maven-surefire-plugin:2.12.2:test (default-test) @ oozie-mini ---
[INFO] Tests are skipped.
[INFO]
[INFO] --- maven-jar-plugin:2.3.1:jar (default-jar) @ oozie-mini ---
[INFO] Building jar: <https://builds.apache.org/job/oozie-trunk-precommit-build/ws/minitest/target/oozie-mini-4.2.0-SNAPSHOT.jar>
[INFO]
[INFO] --- maven-site-plugin:2.0-beta-6:attach-descriptor (attach-descriptor) @ oozie-mini ---
[INFO]
[INFO] --- maven-assembly-plugin:2.2.1:single (default-cli) @ oozie-mini ---
[INFO] Reading assembly descriptor: src/main/assemblies/empty.xml
[INFO]
[INFO] ------------------------------------------------------------------------
[INFO] Building Apache Oozie Distro 4.2.0-SNAPSHOT
[INFO] ------------------------------------------------------------------------
[INFO]
[INFO] --- maven-remote-resources-plugin:1.5:process (default) @ oozie-distro ---
[INFO]
[INFO] --- maven-resources-plugin:2.5:resources (default-resources) @ oozie-distro ---
[debug] execute contextualize
[INFO] Using 'UTF-8' encoding to copy filtered resources.
[INFO] skip non existing resourceDirectory <https://builds.apache.org/job/oozie-trunk-precommit-build/ws/distro/src/main/resources>
[INFO] Copying 3 resources
[INFO]
[INFO] --- maven-compiler-plugin:2.3.2:compile (default-compile) @ oozie-distro ---
[INFO] No sources to compile
[INFO]
[INFO] --- maven-resources-plugin:2.5:testResources (default-testResources) @ oozie-distro ---
[debug] execute contextualize
[INFO] Using 'UTF-8' encoding to copy filtered resources.
[INFO] skip non existing resourceDirectory <https://builds.apache.org/job/oozie-trunk-precommit-build/ws/distro/src/test/resources>
[INFO] Copying 3 resources
[INFO]
[INFO] --- maven-compiler-plugin:2.3.2:testCompile (default-testCompile) @ oozie-distro ---
[INFO] No sources to compile
[INFO]
[INFO] --- maven-surefire-plugin:2.12.2:test (default-test) @ oozie-distro ---
[INFO] Tests are skipped.
[INFO]
[INFO] --- maven-jar-plugin:2.3.1:jar (default-jar) @ oozie-distro ---
[INFO] Building jar: <https://builds.apache.org/job/oozie-trunk-precommit-build/ws/distro/target/oozie-distro-4.2.0-SNAPSHOT.jar>
[INFO]
[INFO] --- maven-site-plugin:2.0-beta-6:attach-descriptor (attach-descriptor) @ oozie-distro ---
[INFO]
[INFO] --- maven-antrun-plugin:1.6:run (default) @ oozie-distro ---
[INFO] Executing tasks
main:
[get] Getting: http://archive.apache.org/dist/tomcat/tomcat-6/v6.0.41/bin/apache-tomcat-6.0.41.tar.gz
[get] To: <https://builds.apache.org/job/oozie-trunk-precommit-build/ws/distro/downloads/tomcat-6.0.41.tar.gz>
...........................................................................................................................................................................................................................................................................................................................................................................................................................................................................................................................................................................................................................................................................................................................................................................................................................................................................................
[mkdir] Created dir: <https://builds.apache.org/job/oozie-trunk-precommit-build/ws/distro/target/tomcat>
[gunzip] Expanding <https://builds.apache.org/job/oozie-trunk-precommit-build/ws/distro/downloads/tomcat-6.0.41.tar.gz> to <https://builds.apache.org/job/oozie-trunk-precommit-build/ws/distro/target/tomcat/tomcat-6.0.41.tar>
[untar] Expanding: <https://builds.apache.org/job/oozie-trunk-precommit-build/ws/distro/target/tomcat/tomcat-6.0.41.tar> into <https://builds.apache.org/job/oozie-trunk-precommit-build/ws/distro/target/tomcat>
[delete] Deleting directory <https://builds.apache.org/job/oozie-trunk-precommit-build/ws/distro/target/tomcat/oozie-server/webapps>
[mkdir] Created dir: <https://builds.apache.org/job/oozie-trunk-precommit-build/ws/distro/target/tomcat/oozie-server/webapps>
[delete] Deleting: <https://builds.apache.org/job/oozie-trunk-precommit-build/ws/distro/target/tomcat/oozie-server/conf/server.xml>
[copy] Copying 1 file to <https://builds.apache.org/job/oozie-trunk-precommit-build/ws/distro/target/tomcat/oozie-server/conf>
[copy] Copying 1 file to <https://builds.apache.org/job/oozie-trunk-precommit-build/ws/distro/target/tomcat/oozie-server/conf>
[mkdir] Created dir: <https://builds.apache.org/job/oozie-trunk-precommit-build/ws/distro/target/tomcat/oozie-server/conf/ssl>
[copy] Copying 1 file to <https://builds.apache.org/job/oozie-trunk-precommit-build/ws/distro/target/tomcat/oozie-server/conf/ssl>
[copy] Copying 1 file to <https://builds.apache.org/job/oozie-trunk-precommit-build/ws/distro/target/tomcat/oozie-server/conf/ssl>
[copy] Copying 1 file to <https://builds.apache.org/job/oozie-trunk-precommit-build/ws/distro/target/tomcat/oozie-server/conf/ssl>
[copy] Copying 3 files to <https://builds.apache.org/job/oozie-trunk-precommit-build/ws/distro/target/tomcat/oozie-server/webapps/ROOT>
[INFO] Executed tasks
[INFO]
[INFO] --- maven-assembly-plugin:2.2.1:single (default-cli) @ oozie-distro ---
[INFO] Reading assembly descriptor: ../src/main/assemblies/distro.xml
[INFO] Copying files to <https://builds.apache.org/job/oozie-trunk-precommit-build/ws/distro/target/oozie-4.2.0-SNAPSHOT-distro>
[WARNING] Assembly file: <https://builds.apache.org/job/oozie-trunk-precommit-build/ws/distro/target/oozie-4.2.0-SNAPSHOT-distro> is not a regular file (it may be a directory). It cannot be attached to the project build for installation or deployment.
[INFO] Building tar : <https://builds.apache.org/job/oozie-trunk-precommit-build/ws/distro/target/oozie-4.2.0-SNAPSHOT-distro.tar.gz>
[INFO]
[INFO] ------------------------------------------------------------------------
[INFO] Building Apache Oozie ZooKeeper Security Tests 4.2.0-SNAPSHOT
[INFO] ------------------------------------------------------------------------
[INFO]
[INFO] --- maven-remote-resources-plugin:1.5:process (default) @ oozie-zookeeper-security-tests ---
[INFO]
[INFO] --- maven-resources-plugin:2.5:resources (default-resources) @ oozie-zookeeper-security-tests ---
[debug] execute contextualize
[INFO] Using 'UTF-8' encoding to copy filtered resources.
[INFO] skip non existing resourceDirectory <https://builds.apache.org/job/oozie-trunk-precommit-build/ws/zookeeper-security-tests/src/main/resources>
[INFO] Copying 3 resources
[INFO]
[INFO] --- maven-compiler-plugin:2.3.2:compile (default-compile) @ oozie-zookeeper-security-tests ---
[INFO] No sources to compile
[INFO]
[INFO] --- maven-resources-plugin:2.5:testResources (default-testResources) @ oozie-zookeeper-security-tests ---
[debug] execute contextualize
[INFO] Using 'UTF-8' encoding to copy filtered resources.
[INFO] skip non existing resourceDirectory <https://builds.apache.org/job/oozie-trunk-precommit-build/ws/zookeeper-security-tests/src/test/resources>
[INFO] Copying 3 resources
[INFO]
[INFO] --- maven-compiler-plugin:2.3.2:testCompile (default-testCompile) @ oozie-zookeeper-security-tests ---
[INFO] Nothing to compile - all classes are up to date
[INFO]
[INFO] --- maven-surefire-plugin:2.12.2:test (default-test) @ oozie-zookeeper-security-tests ---
[INFO] Tests are skipped.
[INFO]
[INFO] --- maven-jar-plugin:2.3.1:jar (default-jar) @ oozie-zookeeper-security-tests ---
[INFO] Building jar: <https://builds.apache.org/job/oozie-trunk-precommit-build/ws/zookeeper-security-tests/target/oozie-zookeeper-security-tests-4.2.0-SNAPSHOT.jar>
[INFO]
[INFO] --- maven-site-plugin:2.0-beta-6:attach-descriptor (attach-descriptor) @ oozie-zookeeper-security-tests ---
[INFO]
[INFO] --- maven-assembly-plugin:2.2.1:single (default-cli) @ oozie-zookeeper-security-tests ---
[INFO] Reading assembly descriptor: src/main/assemblies/empty.xml
[INFO] ------------------------------------------------------------------------
[INFO] Reactor Summary:
[INFO]
[INFO] Apache Oozie Main ................................. SUCCESS [ 1.686 s]
[INFO] Apache Oozie Hadoop 1.2.1.oozie-4.2.0-SNAPSHOT Test SUCCESS [ 0.623 s]
[INFO] Apache Oozie Client ............................... SUCCESS [03:18 min]
[INFO] Apache Oozie Hadoop 1.2.1.oozie-4.2.0-SNAPSHOT .... SUCCESS [ 0.904 s]
[INFO] Apache Oozie Hadoop Distcp 1.2.1.oozie-4.2.0-SNAPSHOT SUCCESS [ 0.096 s]
[INFO] Apache Oozie Hadoop 1.2.1.oozie-4.2.0-SNAPSHOT Test SUCCESS [ 0.366 s]
[INFO] Apache Oozie Hadoop Utils 1.2.1.oozie-4.2.0-SNAPSHOT SUCCESS [ 0.161 s]
[INFO] Apache Oozie Hadoop 2.3.0.oozie-4.2.0-SNAPSHOT .... SUCCESS [ 2.055 s]
[INFO] Apache Oozie Hadoop 2.3.0.oozie-4.2.0-SNAPSHOT Test SUCCESS [ 0.746 s]
[INFO] Apache Oozie Hadoop Distcp 2.3.0.oozie-4.2.0-SNAPSHOT SUCCESS [ 0.082 s]
[INFO] Apache Oozie Hadoop Utils 2.3.0.oozie-4.2.0-SNAPSHOT SUCCESS [ 0.468 s]
[INFO] Apache Oozie Hadoop 2.3.0.oozie-4.2.0-SNAPSHOT Test SUCCESS [ 0.106 s]
[INFO] Apache Oozie Hadoop 0.23.5.oozie-4.2.0-SNAPSHOT ... SUCCESS [ 1.508 s]
[INFO] Apache Oozie Hadoop 0.23.5.oozie-4.2.0-SNAPSHOT Test SUCCESS [ 0.625 s]
[INFO] Apache Oozie Hadoop Distcp 0.23.5.oozie-4.2.0-SNAPSHOT SUCCESS [ 0.077 s]
[INFO] Apache Oozie Hadoop Utils 0.23.5.oozie-4.2.0-SNAPSHOT SUCCESS [ 0.383 s]
[INFO] Apache Oozie Hadoop 0.23.5.oozie-4.2.0-SNAPSHOT Test SUCCESS [ 0.095 s]
[INFO] Apache Oozie Hadoop Libs .......................... SUCCESS [ 3.692 s]
[INFO] Apache Oozie Hbase 0.94.2.oozie-4.2.0-SNAPSHOT .... SUCCESS [ 0.270 s]
[INFO] Apache Oozie Hbase Libs ........................... SUCCESS [ 0.769 s]
[INFO] Apache Oozie HCatalog 0.13.1.oozie-4.2.0-SNAPSHOT . SUCCESS [ 1.191 s]
[INFO] Apache Oozie HCatalog Libs ........................ SUCCESS [ 1.997 s]
[INFO] Apache Oozie Share Lib Oozie ...................... SUCCESS [ 0.814 s]
[INFO] Apache Oozie Share Lib HCatalog ................... SUCCESS [ 1.367 s]
[INFO] Apache Oozie Share Lib Distcp ..................... SUCCESS [ 0.944 s]
[INFO] Apache Oozie Core ................................. SUCCESS [ 51.170 s]
[INFO] Apache Oozie Docs ................................. SUCCESS [ 12.135 s]
[INFO] Apache Oozie Share Lib Pig ........................ SUCCESS [ 1.587 s]
[INFO] Apache Oozie Share Lib Hive ....................... SUCCESS [ 2.488 s]
[INFO] Apache Oozie Share Lib Sqoop ...................... SUCCESS [ 0.491 s]
[INFO] Apache Oozie Share Lib Streaming .................. SUCCESS [ 0.295 s]
[INFO] Apache Oozie Share Lib Spark ...................... SUCCESS [ 5.041 s]
[INFO] Apache Oozie Share Lib Hive 2 ..................... SUCCESS [ 1.760 s]
[INFO] Apache Oozie WebApp ............................... SUCCESS [ 45.463 s]
[INFO] Apache Oozie Examples ............................. SUCCESS [ 2.196 s]
[INFO] Apache Oozie Share Lib ............................ SUCCESS [ 21.321 s]
[INFO] Apache Oozie Tools ................................ SUCCESS [ 2.125 s]
[INFO] Apache Oozie MiniOozie ............................ SUCCESS [ 0.400 s]
[INFO] Apache Oozie Distro ............................... SUCCESS [ 46.806 s]
[INFO] Apache Oozie ZooKeeper Security Tests ............. SUCCESS [ 1.696 s]
[INFO] ------------------------------------------------------------------------
[INFO] BUILD SUCCESS
[INFO] ------------------------------------------------------------------------
[INFO] Total time: 06:56 min
[INFO] Finished at: 2014-12-29T13:49:13+00:00
[INFO] Final Memory: 89M/771M
[INFO] ------------------------------------------------------------------------
Reports
Running test-patch task CLEAN
Running test-patch task RAW_PATCH_ANALYSIS
Running test-patch task RAT
Running test-patch task JAVADOC
Running test-patch task COMPILE
Running test-patch task BACKWARDS_COMPATIBILITY
Running test-patch task TESTS
Running test-patch task DISTRO
Testing JIRA OOZIE-1889
Cleaning local git workspace
----------------------------
+1 PATCH_APPLIES
+1 CLEAN
-1 RAW_PATCH_ANALYSIS
+1 the patch does not introduce any @author tags
+1 the patch does not introduce any tabs
+1 the patch does not introduce any trailing spaces
-1 the patch contains 2 line(s) longer than 132 characters
-1 the patch does not add/modify any testcase
+1 RAT
+1 the patch does not seem to introduce new RAT warnings
+1 JAVADOC
+1 the patch does not seem to introduce new Javadoc warnings
+1 COMPILE
+1 HEAD compiles
+1 patch compiles
+1 the patch does not seem to introduce new javac warnings
-1 BACKWARDS_COMPATIBILITY
-1 the patch seems to change 2 line(s) with JPA Entity/Colum/Basic/Lob/Transient annotations
+1 the patch does not modify JPA files
-1 TESTS
Tests run: 1564
Tests failed: 2
Tests errors: 0
The patch failed the following testcases:
testCoordStatusTransitWithLock(org.apache.oozie.service.TestStatusTransitService)
testRequeueOnException(org.apache.oozie.command.coord.TestCoordPushDependencyCheckXCommand)
+1 DISTRO
+1 distro tarball builds with the patch
----------------------------
-1 Overall result, please check the reported -1(s)
The full output of the test-patch run is available at
https://builds.apache.org/job/oozie-trunk-precommit-build/2159/
Adding comment to JIRA
Comment added.
test-patch exit code: 1
Build step 'Execute shell' marked build as failure
Archiving artifacts
Sending artifact delta relative to oozie-trunk-precommit-build #2091
Archived 10 artifacts
Archive block size is 32768
Received 0 blocks and 1092916 bytes
Compression is 0.0%
Took 0.82 sec
Recording test results
Build failed in Jenkins: oozie-trunk-precommit-build #2162
Posted by Apache Jenkins Server <je...@builds.apache.org>.
See <https://builds.apache.org/job/oozie-trunk-precommit-build/2162/>
------------------------------------------
[...truncated 8667 lines...]
[INFO] Tests are skipped.
[INFO]
[INFO] --- maven-jar-plugin:2.3.1:jar (default-jar) @ oozie-tools ---
[INFO] Building jar: <https://builds.apache.org/job/oozie-trunk-precommit-build/ws/tools/target/oozie-tools-4.2.0-SNAPSHOT.jar>
[INFO]
[INFO] --- maven-site-plugin:2.0-beta-6:attach-descriptor (attach-descriptor) @ oozie-tools ---
[INFO]
[INFO] --- maven-assembly-plugin:2.2.1:single (default-cli) @ oozie-tools ---
[INFO] Reading assembly descriptor: ../src/main/assemblies/tools.xml
[WARNING] The following patterns were never triggered in this artifact exclusion filter:
o '*:*:pom:*'
[INFO] Copying files to <https://builds.apache.org/job/oozie-trunk-precommit-build/ws/tools/target/oozie-tools-4.2.0-SNAPSHOT-tools>
[WARNING] Assembly file: <https://builds.apache.org/job/oozie-trunk-precommit-build/ws/tools/target/oozie-tools-4.2.0-SNAPSHOT-tools> is not a regular file (it may be a directory). It cannot be attached to the project build for installation or deployment.
[INFO]
[INFO] ------------------------------------------------------------------------
[INFO] Building Apache Oozie MiniOozie 4.2.0-SNAPSHOT
[INFO] ------------------------------------------------------------------------
[INFO]
[INFO] --- maven-remote-resources-plugin:1.5:process (default) @ oozie-mini ---
[INFO]
[INFO] --- maven-resources-plugin:2.5:resources (default-resources) @ oozie-mini ---
[debug] execute contextualize
[INFO] Using 'UTF-8' encoding to copy filtered resources.
[INFO] skip non existing resourceDirectory <https://builds.apache.org/job/oozie-trunk-precommit-build/ws/minitest/src/main/resources>
[INFO] Copying 3 resources
[INFO]
[INFO] --- maven-compiler-plugin:2.3.2:compile (default-compile) @ oozie-mini ---
[INFO] No sources to compile
[INFO]
[INFO] --- maven-resources-plugin:2.5:testResources (default-testResources) @ oozie-mini ---
[debug] execute contextualize
[INFO] Using 'UTF-8' encoding to copy filtered resources.
[INFO] Copying 3 resources
[INFO] Copying 3 resources
[INFO]
[INFO] --- maven-compiler-plugin:2.3.2:testCompile (default-testCompile) @ oozie-mini ---
[INFO] Nothing to compile - all classes are up to date
[INFO]
[INFO] --- maven-surefire-plugin:2.12.2:test (default-test) @ oozie-mini ---
[INFO] Tests are skipped.
[INFO]
[INFO] --- maven-jar-plugin:2.3.1:jar (default-jar) @ oozie-mini ---
[INFO] Building jar: <https://builds.apache.org/job/oozie-trunk-precommit-build/ws/minitest/target/oozie-mini-4.2.0-SNAPSHOT.jar>
[INFO]
[INFO] --- maven-site-plugin:2.0-beta-6:attach-descriptor (attach-descriptor) @ oozie-mini ---
[INFO]
[INFO] --- maven-assembly-plugin:2.2.1:single (default-cli) @ oozie-mini ---
[INFO] Reading assembly descriptor: src/main/assemblies/empty.xml
[INFO]
[INFO] ------------------------------------------------------------------------
[INFO] Building Apache Oozie Distro 4.2.0-SNAPSHOT
[INFO] ------------------------------------------------------------------------
[INFO]
[INFO] --- maven-remote-resources-plugin:1.5:process (default) @ oozie-distro ---
[INFO]
[INFO] --- maven-resources-plugin:2.5:resources (default-resources) @ oozie-distro ---
[debug] execute contextualize
[INFO] Using 'UTF-8' encoding to copy filtered resources.
[INFO] skip non existing resourceDirectory <https://builds.apache.org/job/oozie-trunk-precommit-build/ws/distro/src/main/resources>
[INFO] Copying 3 resources
[INFO]
[INFO] --- maven-compiler-plugin:2.3.2:compile (default-compile) @ oozie-distro ---
[INFO] No sources to compile
[INFO]
[INFO] --- maven-resources-plugin:2.5:testResources (default-testResources) @ oozie-distro ---
[debug] execute contextualize
[INFO] Using 'UTF-8' encoding to copy filtered resources.
[INFO] skip non existing resourceDirectory <https://builds.apache.org/job/oozie-trunk-precommit-build/ws/distro/src/test/resources>
[INFO] Copying 3 resources
[INFO]
[INFO] --- maven-compiler-plugin:2.3.2:testCompile (default-testCompile) @ oozie-distro ---
[INFO] No sources to compile
[INFO]
[INFO] --- maven-surefire-plugin:2.12.2:test (default-test) @ oozie-distro ---
[INFO] Tests are skipped.
[INFO]
[INFO] --- maven-jar-plugin:2.3.1:jar (default-jar) @ oozie-distro ---
[INFO] Building jar: <https://builds.apache.org/job/oozie-trunk-precommit-build/ws/distro/target/oozie-distro-4.2.0-SNAPSHOT.jar>
[INFO]
[INFO] --- maven-site-plugin:2.0-beta-6:attach-descriptor (attach-descriptor) @ oozie-distro ---
[INFO]
[INFO] --- maven-antrun-plugin:1.6:run (default) @ oozie-distro ---
[INFO] Executing tasks
main:
[get] Getting: http://archive.apache.org/dist/tomcat/tomcat-6/v6.0.41/bin/apache-tomcat-6.0.41.tar.gz
[get] To: <https://builds.apache.org/job/oozie-trunk-precommit-build/ws/distro/downloads/tomcat-6.0.41.tar.gz>
................................................................................................................................................................................................................................................................................................................................................................................................................................................................................................................................................................................................................................................................................................................................................................................................................................................................................................................................................................................................................................................................................................................
[mkdir] Created dir: <https://builds.apache.org/job/oozie-trunk-precommit-build/ws/distro/target/tomcat>
[gunzip] Expanding <https://builds.apache.org/job/oozie-trunk-precommit-build/ws/distro/downloads/tomcat-6.0.41.tar.gz> to <https://builds.apache.org/job/oozie-trunk-precommit-build/ws/distro/target/tomcat/tomcat-6.0.41.tar>
[untar] Expanding: <https://builds.apache.org/job/oozie-trunk-precommit-build/ws/distro/target/tomcat/tomcat-6.0.41.tar> into <https://builds.apache.org/job/oozie-trunk-precommit-build/ws/distro/target/tomcat>
[delete] Deleting directory <https://builds.apache.org/job/oozie-trunk-precommit-build/ws/distro/target/tomcat/oozie-server/webapps>
[mkdir] Created dir: <https://builds.apache.org/job/oozie-trunk-precommit-build/ws/distro/target/tomcat/oozie-server/webapps>
[delete] Deleting: <https://builds.apache.org/job/oozie-trunk-precommit-build/ws/distro/target/tomcat/oozie-server/conf/server.xml>
[copy] Copying 1 file to <https://builds.apache.org/job/oozie-trunk-precommit-build/ws/distro/target/tomcat/oozie-server/conf>
[copy] Copying 1 file to <https://builds.apache.org/job/oozie-trunk-precommit-build/ws/distro/target/tomcat/oozie-server/conf>
[mkdir] Created dir: <https://builds.apache.org/job/oozie-trunk-precommit-build/ws/distro/target/tomcat/oozie-server/conf/ssl>
[copy] Copying 1 file to <https://builds.apache.org/job/oozie-trunk-precommit-build/ws/distro/target/tomcat/oozie-server/conf/ssl>
[copy] Copying 1 file to <https://builds.apache.org/job/oozie-trunk-precommit-build/ws/distro/target/tomcat/oozie-server/conf/ssl>
[copy] Copying 1 file to <https://builds.apache.org/job/oozie-trunk-precommit-build/ws/distro/target/tomcat/oozie-server/conf/ssl>
[copy] Copying 3 files to <https://builds.apache.org/job/oozie-trunk-precommit-build/ws/distro/target/tomcat/oozie-server/webapps/ROOT>
[INFO] Executed tasks
[INFO]
[INFO] --- maven-assembly-plugin:2.2.1:single (default-cli) @ oozie-distro ---
[INFO] Reading assembly descriptor: ../src/main/assemblies/distro.xml
[INFO] Copying files to <https://builds.apache.org/job/oozie-trunk-precommit-build/ws/distro/target/oozie-4.2.0-SNAPSHOT-distro>
[WARNING] Assembly file: <https://builds.apache.org/job/oozie-trunk-precommit-build/ws/distro/target/oozie-4.2.0-SNAPSHOT-distro> is not a regular file (it may be a directory). It cannot be attached to the project build for installation or deployment.
[INFO] Building tar : <https://builds.apache.org/job/oozie-trunk-precommit-build/ws/distro/target/oozie-4.2.0-SNAPSHOT-distro.tar.gz>
[INFO]
[INFO] ------------------------------------------------------------------------
[INFO] Building Apache Oozie ZooKeeper Security Tests 4.2.0-SNAPSHOT
[INFO] ------------------------------------------------------------------------
[INFO]
[INFO] --- maven-remote-resources-plugin:1.5:process (default) @ oozie-zookeeper-security-tests ---
[INFO]
[INFO] --- maven-resources-plugin:2.5:resources (default-resources) @ oozie-zookeeper-security-tests ---
[debug] execute contextualize
[INFO] Using 'UTF-8' encoding to copy filtered resources.
[INFO] skip non existing resourceDirectory <https://builds.apache.org/job/oozie-trunk-precommit-build/ws/zookeeper-security-tests/src/main/resources>
[INFO] Copying 3 resources
[INFO]
[INFO] --- maven-compiler-plugin:2.3.2:compile (default-compile) @ oozie-zookeeper-security-tests ---
[INFO] No sources to compile
[INFO]
[INFO] --- maven-resources-plugin:2.5:testResources (default-testResources) @ oozie-zookeeper-security-tests ---
[debug] execute contextualize
[INFO] Using 'UTF-8' encoding to copy filtered resources.
[INFO] skip non existing resourceDirectory <https://builds.apache.org/job/oozie-trunk-precommit-build/ws/zookeeper-security-tests/src/test/resources>
[INFO] Copying 3 resources
[INFO]
[INFO] --- maven-compiler-plugin:2.3.2:testCompile (default-testCompile) @ oozie-zookeeper-security-tests ---
[INFO] Nothing to compile - all classes are up to date
[INFO]
[INFO] --- maven-surefire-plugin:2.12.2:test (default-test) @ oozie-zookeeper-security-tests ---
[INFO] Tests are skipped.
[INFO]
[INFO] --- maven-jar-plugin:2.3.1:jar (default-jar) @ oozie-zookeeper-security-tests ---
[INFO] Building jar: <https://builds.apache.org/job/oozie-trunk-precommit-build/ws/zookeeper-security-tests/target/oozie-zookeeper-security-tests-4.2.0-SNAPSHOT.jar>
[INFO]
[INFO] --- maven-site-plugin:2.0-beta-6:attach-descriptor (attach-descriptor) @ oozie-zookeeper-security-tests ---
[INFO]
[INFO] --- maven-assembly-plugin:2.2.1:single (default-cli) @ oozie-zookeeper-security-tests ---
[INFO] Reading assembly descriptor: src/main/assemblies/empty.xml
[INFO] ------------------------------------------------------------------------
[INFO] Reactor Summary:
[INFO]
[INFO] Apache Oozie Main ................................. SUCCESS [ 1.521 s]
[INFO] Apache Oozie Hadoop Utils ......................... SUCCESS [ 0.649 s]
[INFO] Apache Oozie Hadoop Distcp hadoop-1-4.2.0-SNAPSHOT SUCCESS [ 0.140 s]
[INFO] Apache Oozie Hadoop Auth hadoop-1-4.2.0-SNAPSHOT .. SUCCESS [ 0.221 s]
[INFO] Apache Oozie Hadoop Libs .......................... SUCCESS [ 0.030 s]
[INFO] Apache Oozie Client ............................... SUCCESS [01:15 min]
[INFO] Apache Oozie Share Lib Oozie ...................... SUCCESS [ 0.946 s]
[INFO] Apache Oozie Share Lib HCatalog ................... SUCCESS [ 1.443 s]
[INFO] Apache Oozie Share Lib Distcp ..................... SUCCESS [ 0.246 s]
[INFO] Apache Oozie Core ................................. SUCCESS [ 16.942 s]
[INFO] Apache Oozie Share Lib Streaming .................. SUCCESS [ 1.043 s]
[INFO] Apache Oozie Share Lib Pig ........................ SUCCESS [ 0.880 s]
[INFO] Apache Oozie Share Lib Hive ....................... SUCCESS [ 2.401 s]
[INFO] Apache Oozie Share Lib Hive 2 ..................... SUCCESS [ 2.028 s]
[INFO] Apache Oozie Share Lib Sqoop ...................... SUCCESS [ 0.523 s]
[INFO] Apache Oozie Share Lib Spark ...................... SUCCESS [ 4.484 s]
[INFO] Apache Oozie Share Lib ............................ SUCCESS [ 16.464 s]
[INFO] Apache Oozie Docs ................................. SUCCESS [ 10.473 s]
[INFO] Apache Oozie WebApp ............................... SUCCESS [ 15.249 s]
[INFO] Apache Oozie Examples ............................. SUCCESS [ 1.299 s]
[INFO] Apache Oozie Tools ................................ SUCCESS [ 0.275 s]
[INFO] Apache Oozie MiniOozie ............................ SUCCESS [ 0.144 s]
[INFO] Apache Oozie Distro ............................... SUCCESS [ 35.521 s]
[INFO] Apache Oozie ZooKeeper Security Tests ............. SUCCESS [ 2.197 s]
[INFO] ------------------------------------------------------------------------
[INFO] BUILD SUCCESS
[INFO] ------------------------------------------------------------------------
[INFO] Total time: 03:12 min
[INFO] Finished at: 2015-01-02T09:51:20+00:00
[INFO] Final Memory: 101M/1073M
[INFO] ------------------------------------------------------------------------
Reports
Running test-patch task CLEAN
Running test-patch task RAW_PATCH_ANALYSIS
Running test-patch task RAT
Running test-patch task JAVADOC
Running test-patch task COMPILE
Running test-patch task BACKWARDS_COMPATIBILITY
Running test-patch task TESTS
Running test-patch task DISTRO
Testing JIRA OOZIE-2092
Cleaning local git workspace
----------------------------
+1 PATCH_APPLIES
+1 CLEAN
-1 RAW_PATCH_ANALYSIS
+1 the patch does not introduce any @author tags
+1 the patch does not introduce any tabs
+1 the patch does not introduce any trailing spaces
-1 the patch contains 2 line(s) longer than 132 characters
+1 the patch does adds/modifies 4 testcase(s)
+1 RAT
+1 the patch does not seem to introduce new RAT warnings
+1 JAVADOC
+1 the patch does not seem to introduce new Javadoc warnings
+1 COMPILE
+1 HEAD compiles
+1 patch compiles
+1 the patch does not seem to introduce new javac warnings
+1 BACKWARDS_COMPATIBILITY
+1 the patch does not change any JPA Entity/Colum/Basic/Lob/Transient annotations
+1 the patch does not modify JPA files
-1 TESTS
Tests run: 1562
Tests failed: 1
Tests errors: 1
The patch failed the following testcases:
testCoordRerunWithConfOption(org.apache.oozie.command.coord.TestCoordRerunXCommand)
+1 DISTRO
+1 distro tarball builds with the patch
----------------------------
-1 Overall result, please check the reported -1(s)
The full output of the test-patch run is available at
https://builds.apache.org/job/oozie-trunk-precommit-build/2162/
Adding comment to JIRA
Comment added.
test-patch exit code: 1
Build step 'Execute shell' marked build as failure
Archiving artifacts
Sending artifact delta relative to oozie-trunk-precommit-build #2091
Archived 10 artifacts
Archive block size is 32768
Received 0 blocks and 960626 bytes
Compression is 0.0%
Took 0.83 sec
Recording test results
Build failed in Jenkins: oozie-trunk-precommit-build #2161
Posted by Apache Jenkins Server <je...@builds.apache.org>.
See <https://builds.apache.org/job/oozie-trunk-precommit-build/2161/changes>
Changes:
[harsh] OOZIE-2102. Streaming actions are broken cause of incorrect method signature. Contributed by Harsh J.
------------------------------------------
[...truncated 6455 lines...]
[INFO] Wrote classpath file '<https://builds.apache.org/job/oozie-trunk-precommit-build/ws/sharelib/distcp/target/test-classes/mrapp-generated-classpath'.>
[INFO]
[INFO] --- maven-antrun-plugin:1.6:run (default) @ oozie-sharelib-distcp ---
[INFO] Executing tasks
main:
[INFO] Executed tasks
[INFO]
[INFO] --- maven-resources-plugin:2.5:testResources (default-testResources) @ oozie-sharelib-distcp ---
[debug] execute contextualize
[INFO] Using 'UTF-8' encoding to copy filtered resources.
[INFO] skip non existing resourceDirectory <https://builds.apache.org/job/oozie-trunk-precommit-build/ws/sharelib/distcp/src/test/resources>
[INFO] Copying 3 resources
[INFO]
[INFO] --- maven-compiler-plugin:2.3.2:testCompile (default-testCompile) @ oozie-sharelib-distcp ---
[INFO] No sources to compile
[INFO]
[INFO] --- maven-surefire-plugin:2.12.2:test (default-test) @ oozie-sharelib-distcp ---
[INFO] Tests are skipped.
[INFO]
[INFO] --- maven-jar-plugin:2.3.1:jar (default-jar) @ oozie-sharelib-distcp ---
[INFO] Building jar: <https://builds.apache.org/job/oozie-trunk-precommit-build/ws/sharelib/distcp/target/oozie-sharelib-distcp-4.2.0-SNAPSHOT.jar>
[INFO]
[INFO] --- maven-site-plugin:2.0-beta-6:attach-descriptor (attach-descriptor) @ oozie-sharelib-distcp ---
[INFO]
[INFO] --- maven-assembly-plugin:2.2.1:single (default-cli) @ oozie-sharelib-distcp ---
[INFO] Reading assembly descriptor: ../../src/main/assemblies/partial-sharelib.xml
[INFO] Copying files to <https://builds.apache.org/job/oozie-trunk-precommit-build/ws/sharelib/distcp/target/partial-sharelib>
[WARNING] Assembly file: <https://builds.apache.org/job/oozie-trunk-precommit-build/ws/sharelib/distcp/target/partial-sharelib> is not a regular file (it may be a directory). It cannot be attached to the project build for installation or deployment.
[INFO]
[INFO] ------------------------------------------------------------------------
[INFO] Building Apache Oozie Core 4.2.0-SNAPSHOT
[INFO] ------------------------------------------------------------------------
[INFO]
[INFO] --- maven-remote-resources-plugin:1.5:process (default) @ oozie-core ---
[INFO]
[INFO] --- maven-resources-plugin:2.5:resources (default-resources) @ oozie-core ---
[debug] execute contextualize
[INFO] Using 'UTF-8' encoding to copy filtered resources.
[INFO] Copying 14 resources
[INFO] Copying 3 resources
[INFO]
[INFO] --- maven-compiler-plugin:2.3.2:compile (default-compile) @ oozie-core ---
[INFO] Nothing to compile - all classes are up to date
[INFO]
[INFO] --- openjpa-maven-plugin:2.2.2:enhance (enhancer) @ oozie-core ---
15/01/01 15:16:19 INFO openjpa.Tool: Enhancer running on type "class org.apache.oozie.util.db.ValidateConnectionBean".
15/01/01 15:16:19 INFO openjpa.Tool: Enhancer running on type "class org.apache.oozie.client.rest.JsonSLAEvent".
15/01/01 15:16:19 INFO openjpa.Tool: Enhancer running on type "class org.apache.oozie.sla.SLARegistrationBean".
15/01/01 15:16:19 INFO openjpa.Tool: Enhancer running on type "class org.apache.oozie.CoordinatorJobBean".
15/01/01 15:16:19 INFO openjpa.Tool: Enhancer running on type "class org.apache.oozie.BundleJobBean".
15/01/01 15:16:19 INFO openjpa.Tool: Enhancer running on type "class org.apache.oozie.CoordinatorActionBean".
15/01/01 15:16:19 INFO openjpa.Tool: Enhancer running on type "class org.apache.oozie.WorkflowJobBean".
15/01/01 15:16:19 INFO openjpa.Tool: Enhancer running on type "class org.apache.oozie.WorkflowActionBean".
15/01/01 15:16:19 INFO openjpa.Tool: Enhancer running on type "class org.apache.oozie.SLAEventBean".
15/01/01 15:16:19 INFO openjpa.Tool: Enhancer running on type "class org.apache.oozie.sla.SLASummaryBean".
15/01/01 15:16:19 INFO openjpa.Tool: Enhancer running on type "class org.apache.oozie.BundleActionBean".
15/01/01 15:16:19 INFO openjpa.Tool: Enhancer running on type "class org.apache.oozie.util.db.ValidateConnectionBean".
15/01/01 15:16:19 INFO openjpa.Tool: Enhancer running on type "class org.apache.oozie.client.rest.JsonSLAEvent".
15/01/01 15:16:19 INFO openjpa.Tool: Enhancer running on type "class org.apache.oozie.sla.SLARegistrationBean".
15/01/01 15:16:19 INFO openjpa.Tool: Enhancer running on type "class org.apache.oozie.CoordinatorJobBean".
15/01/01 15:16:19 INFO openjpa.Tool: Enhancer running on type "class org.apache.oozie.BundleJobBean".
15/01/01 15:16:19 INFO openjpa.Tool: Enhancer running on type "class org.apache.oozie.CoordinatorActionBean".
15/01/01 15:16:19 INFO openjpa.Tool: Enhancer running on type "class org.apache.oozie.WorkflowJobBean".
15/01/01 15:16:20 INFO openjpa.Tool: Enhancer running on type "class org.apache.oozie.WorkflowActionBean".
15/01/01 15:16:20 INFO openjpa.Tool: Enhancer running on type "class org.apache.oozie.SLAEventBean".
15/01/01 15:16:20 INFO openjpa.Tool: Enhancer running on type "class org.apache.oozie.sla.SLASummaryBean".
15/01/01 15:16:20 INFO openjpa.Tool: Enhancer running on type "class org.apache.oozie.BundleActionBean".
15/01/01 15:16:20 INFO openjpa.Tool: Enhancer running on type "class org.apache.oozie.util.db.ValidateConnectionBean".
15/01/01 15:16:20 INFO openjpa.Tool: Enhancer running on type "class org.apache.oozie.client.rest.JsonSLAEvent".
15/01/01 15:16:20 INFO openjpa.Tool: Enhancer running on type "class org.apache.oozie.sla.SLARegistrationBean".
15/01/01 15:16:20 INFO openjpa.Tool: Enhancer running on type "class org.apache.oozie.CoordinatorJobBean".
15/01/01 15:16:20 INFO openjpa.Tool: Enhancer running on type "class org.apache.oozie.BundleJobBean".
15/01/01 15:16:20 INFO openjpa.Tool: Enhancer running on type "class org.apache.oozie.CoordinatorActionBean".
15/01/01 15:16:20 INFO openjpa.Tool: Enhancer running on type "class org.apache.oozie.WorkflowJobBean".
15/01/01 15:16:20 INFO openjpa.Tool: Enhancer running on type "class org.apache.oozie.WorkflowActionBean".
15/01/01 15:16:20 INFO openjpa.Tool: Enhancer running on type "class org.apache.oozie.SLAEventBean".
15/01/01 15:16:20 INFO openjpa.Tool: Enhancer running on type "class org.apache.oozie.sla.SLASummaryBean".
15/01/01 15:16:20 INFO openjpa.Tool: Enhancer running on type "class org.apache.oozie.BundleActionBean".
15/01/01 15:16:20 INFO openjpa.Tool: Enhancer running on type "class org.apache.oozie.util.db.ValidateConnectionBean".
15/01/01 15:16:20 INFO openjpa.Tool: Enhancer running on type "class org.apache.oozie.client.rest.JsonSLAEvent".
15/01/01 15:16:20 INFO openjpa.Tool: Enhancer running on type "class org.apache.oozie.sla.SLARegistrationBean".
15/01/01 15:16:20 INFO openjpa.Tool: Enhancer running on type "class org.apache.oozie.CoordinatorJobBean".
15/01/01 15:16:20 INFO openjpa.Tool: Enhancer running on type "class org.apache.oozie.BundleJobBean".
15/01/01 15:16:20 INFO openjpa.Tool: Enhancer running on type "class org.apache.oozie.CoordinatorActionBean".
15/01/01 15:16:20 INFO openjpa.Tool: Enhancer running on type "class org.apache.oozie.WorkflowJobBean".
15/01/01 15:16:20 INFO openjpa.Tool: Enhancer running on type "class org.apache.oozie.WorkflowActionBean".
15/01/01 15:16:20 INFO openjpa.Tool: Enhancer running on type "class org.apache.oozie.SLAEventBean".
15/01/01 15:16:20 INFO openjpa.Tool: Enhancer running on type "class org.apache.oozie.sla.SLASummaryBean".
15/01/01 15:16:20 INFO openjpa.Tool: Enhancer running on type "class org.apache.oozie.BundleActionBean".
15/01/01 15:16:20 INFO openjpa.Tool: Enhancer running on type "class org.apache.oozie.util.db.ValidateConnectionBean".
15/01/01 15:16:20 INFO openjpa.Tool: Enhancer running on type "class org.apache.oozie.client.rest.JsonSLAEvent".
15/01/01 15:16:20 INFO openjpa.Tool: Enhancer running on type "class org.apache.oozie.sla.SLARegistrationBean".
15/01/01 15:16:20 INFO openjpa.Tool: Enhancer running on type "class org.apache.oozie.CoordinatorJobBean".
15/01/01 15:16:20 INFO openjpa.Tool: Enhancer running on type "class org.apache.oozie.BundleJobBean".
15/01/01 15:16:20 INFO openjpa.Tool: Enhancer running on type "class org.apache.oozie.CoordinatorActionBean".
15/01/01 15:16:20 INFO openjpa.Tool: Enhancer running on type "class org.apache.oozie.WorkflowJobBean".
15/01/01 15:16:20 INFO openjpa.Tool: Enhancer running on type "class org.apache.oozie.WorkflowActionBean".
15/01/01 15:16:20 INFO openjpa.Tool: Enhancer running on type "class org.apache.oozie.SLAEventBean".
15/01/01 15:16:20 INFO openjpa.Tool: Enhancer running on type "class org.apache.oozie.sla.SLASummaryBean".
15/01/01 15:16:20 INFO openjpa.Tool: Enhancer running on type "class org.apache.oozie.BundleActionBean".
15/01/01 15:16:20 INFO openjpa.Tool: Enhancer running on type "class org.apache.oozie.util.db.ValidateConnectionBean".
15/01/01 15:16:20 INFO openjpa.Tool: Enhancer running on type "class org.apache.oozie.client.rest.JsonSLAEvent".
15/01/01 15:16:20 INFO openjpa.Tool: Enhancer running on type "class org.apache.oozie.sla.SLARegistrationBean".
15/01/01 15:16:20 INFO openjpa.Tool: Enhancer running on type "class org.apache.oozie.CoordinatorJobBean".
15/01/01 15:16:20 INFO openjpa.Tool: Enhancer running on type "class org.apache.oozie.BundleJobBean".
15/01/01 15:16:20 INFO openjpa.Tool: Enhancer running on type "class org.apache.oozie.CoordinatorActionBean".
15/01/01 15:16:20 INFO openjpa.Tool: Enhancer running on type "class org.apache.oozie.WorkflowJobBean".
15/01/01 15:16:20 INFO openjpa.Tool: Enhancer running on type "class org.apache.oozie.WorkflowActionBean".
15/01/01 15:16:21 INFO openjpa.Tool: Enhancer running on type "class org.apache.oozie.SLAEventBean".
15/01/01 15:16:21 INFO openjpa.Tool: Enhancer running on type "class org.apache.oozie.sla.SLASummaryBean".
15/01/01 15:16:21 INFO openjpa.Tool: Enhancer running on type "class org.apache.oozie.BundleActionBean".
[INFO]
[INFO] --- maven-dependency-plugin:2.4:build-classpath (create-mrapp-generated-classpath) @ oozie-core ---
[INFO] Wrote classpath file '<https://builds.apache.org/job/oozie-trunk-precommit-build/ws/core/target/test-classes/mrapp-generated-classpath'.>
[INFO]
[INFO] --- maven-resources-plugin:2.5:testResources (default-testResources) @ oozie-core ---
[debug] execute contextualize
[INFO] Using 'UTF-8' encoding to copy filtered resources.
[INFO] Copying 98 resources
[INFO] Copying 3 resources
[INFO]
[INFO] --- maven-compiler-plugin:2.3.2:testCompile (default-testCompile) @ oozie-core ---
[INFO] Compiling 271 source files to <https://builds.apache.org/job/oozie-trunk-precommit-build/ws/core/target/test-classes>
[INFO] -------------------------------------------------------------
[ERROR] COMPILATION ERROR :
[INFO] -------------------------------------------------------------
[ERROR] <https://builds.apache.org/job/oozie-trunk-precommit-build/ws/core/src/test/java/org/apache/oozie/command/coord/TestCoordRerunXCommand.java>:[1565,33] cannot find symbol
symbol : class XConfiguration
location: class org.apache.oozie.command.coord.TestCoordRerunXCommand
[ERROR] <https://builds.apache.org/job/oozie-trunk-precommit-build/ws/core/src/test/java/org/apache/oozie/command/coord/TestCoordRerunXCommand.java>:[1565,52] cannot find symbol
symbol : class StringReader
location: class org.apache.oozie.command.coord.TestCoordRerunXCommand
[INFO] 2 errors
[INFO] -------------------------------------------------------------
[INFO] ------------------------------------------------------------------------
[INFO] Reactor Summary:
[INFO]
[INFO] Apache Oozie Main ................................. SUCCESS [ 1.782 s]
[INFO] Apache Oozie Hadoop Utils ......................... SUCCESS [ 0.606 s]
[INFO] Apache Oozie Hadoop Distcp hadoop-1-4.2.0-SNAPSHOT SUCCESS [ 0.127 s]
[INFO] Apache Oozie Hadoop Auth hadoop-1-4.2.0-SNAPSHOT .. SUCCESS [ 0.159 s]
[INFO] Apache Oozie Hadoop Libs .......................... SUCCESS [ 0.020 s]
[INFO] Apache Oozie Client ............................... SUCCESS [ 31.243 s]
[INFO] Apache Oozie Share Lib Oozie ...................... SUCCESS [ 0.900 s]
[INFO] Apache Oozie Share Lib HCatalog ................... SUCCESS [ 1.722 s]
[INFO] Apache Oozie Share Lib Distcp ..................... SUCCESS [ 0.245 s]
[INFO] Apache Oozie Core ................................. FAILURE [ 9.237 s]
[INFO] Apache Oozie Share Lib Streaming .................. SKIPPED
[INFO] Apache Oozie Share Lib Pig ........................ SKIPPED
[INFO] Apache Oozie Share Lib Hive ....................... SKIPPED
[INFO] Apache Oozie Share Lib Hive 2 ..................... SKIPPED
[INFO] Apache Oozie Share Lib Sqoop ...................... SKIPPED
[INFO] Apache Oozie Share Lib Spark ...................... SKIPPED
[INFO] Apache Oozie Share Lib ............................ SKIPPED
[INFO] Apache Oozie Docs ................................. SKIPPED
[INFO] Apache Oozie WebApp ............................... SKIPPED
[INFO] Apache Oozie Examples ............................. SKIPPED
[INFO] Apache Oozie Tools ................................ SKIPPED
[INFO] Apache Oozie MiniOozie ............................ SKIPPED
[INFO] Apache Oozie Distro ............................... SKIPPED
[INFO] Apache Oozie ZooKeeper Security Tests ............. SKIPPED
[INFO] ------------------------------------------------------------------------
[INFO] BUILD FAILURE
[INFO] ------------------------------------------------------------------------
[INFO] Total time: 47.646 s
[INFO] Finished at: 2015-01-01T15:16:26+00:00
[INFO] Final Memory: 49M/495M
[INFO] ------------------------------------------------------------------------
[ERROR] Failed to execute goal org.apache.maven.plugins:maven-compiler-plugin:2.3.2:testCompile (default-testCompile) on project oozie-core: Compilation failure: Compilation failure:
[ERROR] <https://builds.apache.org/job/oozie-trunk-precommit-build/ws/core/src/test/java/org/apache/oozie/command/coord/TestCoordRerunXCommand.java>:[1565,33] cannot find symbol
[ERROR] symbol : class XConfiguration
[ERROR] location: class org.apache.oozie.command.coord.TestCoordRerunXCommand
[ERROR] <https://builds.apache.org/job/oozie-trunk-precommit-build/ws/core/src/test/java/org/apache/oozie/command/coord/TestCoordRerunXCommand.java>:[1565,52] cannot find symbol
[ERROR] symbol : class StringReader
[ERROR] location: class org.apache.oozie.command.coord.TestCoordRerunXCommand
[ERROR] -> [Help 1]
[ERROR]
[ERROR] To see the full stack trace of the errors, re-run Maven with the -e switch.
[ERROR] Re-run Maven using the -X switch to enable full debug logging.
[ERROR]
[ERROR] For more information about the errors and possible solutions, please read the following articles:
[ERROR] [Help 1] http://cwiki.apache.org/confluence/display/MAVEN/MojoFailureException
[ERROR]
[ERROR] After correcting the problems, you can resume the build with the command
[ERROR] mvn <goals> -rf :oozie-core
Reports
Running test-patch task CLEAN
Running test-patch task RAW_PATCH_ANALYSIS
Running test-patch task RAT
Running test-patch task JAVADOC
Running test-patch task COMPILE
Running test-patch task BACKWARDS_COMPATIBILITY
Running test-patch task TESTS
Running test-patch task DISTRO
Testing JIRA OOZIE-2092
Cleaning local git workspace
----------------------------
+1 PATCH_APPLIES
+1 CLEAN
-1 RAW_PATCH_ANALYSIS
+1 the patch does not introduce any @author tags
+1 the patch does not introduce any tabs
+1 the patch does not introduce any trailing spaces
-1 the patch contains 2 line(s) longer than 132 characters
+1 the patch does adds/modifies 4 testcase(s)
+1 RAT
+1 the patch does not seem to introduce new RAT warnings
+1 JAVADOC
+1 the patch does not seem to introduce new Javadoc warnings
-1 COMPILE
+1 HEAD compiles
-1 patch does not compile
+1 the patch does not seem to introduce new javac warnings
+1 BACKWARDS_COMPATIBILITY
+1 the patch does not change any JPA Entity/Colum/Basic/Lob/Transient annotations
+1 the patch does not modify JPA files
-1 TESTS - patch does not compile, cannot run testcases
-1 DISTRO
-1 distro tarball fails with the patch
----------------------------
-1 Overall result, please check the reported -1(s)
The full output of the test-patch run is available at
https://builds.apache.org/job/oozie-trunk-precommit-build/2161/
Adding comment to JIRA
Comment added.
test-patch exit code: 1
Build step 'Execute shell' marked build as failure
Archiving artifacts
Sending artifact delta relative to oozie-trunk-precommit-build #2091
Archived 10 artifacts
Archive block size is 32768
Received 0 blocks and 827591 bytes
Compression is 0.0%
Took 0.52 sec
Recording test results
Build failed in Jenkins: oozie-trunk-precommit-build #2160
Posted by Apache Jenkins Server <je...@builds.apache.org>.
See <https://builds.apache.org/job/oozie-trunk-precommit-build/2160/changes>
Changes:
[shwethags] OOZIE-1876 use pom properties rather than specific version numbers in the pom files of hbaselibs, hcataloglibs, sharelib, etc (shwethags)
[shwethags] OOZIE-1889 Convert NamedNativeQueries to JPQL (dvillegas via shwethags)
------------------------------------------
[...truncated 12241 lines...]
o '*:*:pom:*'
[INFO] Copying files to <https://builds.apache.org/job/oozie-trunk-precommit-build/ws/tools/target/oozie-tools-4.2.0-SNAPSHOT-tools>
[WARNING] Assembly file: <https://builds.apache.org/job/oozie-trunk-precommit-build/ws/tools/target/oozie-tools-4.2.0-SNAPSHOT-tools> is not a regular file (it may be a directory). It cannot be attached to the project build for installation or deployment.
[INFO]
[INFO] ------------------------------------------------------------------------
[INFO] Building Apache Oozie MiniOozie 4.2.0-SNAPSHOT
[INFO] ------------------------------------------------------------------------
[INFO]
[INFO] --- maven-remote-resources-plugin:1.5:process (default) @ oozie-mini ---
[INFO]
[INFO] --- maven-resources-plugin:2.5:resources (default-resources) @ oozie-mini ---
[debug] execute contextualize
[INFO] Using 'UTF-8' encoding to copy filtered resources.
[INFO] skip non existing resourceDirectory <https://builds.apache.org/job/oozie-trunk-precommit-build/ws/minitest/src/main/resources>
[INFO] Copying 3 resources
[INFO]
[INFO] --- maven-compiler-plugin:2.3.2:compile (default-compile) @ oozie-mini ---
[INFO] No sources to compile
[INFO]
[INFO] --- maven-resources-plugin:2.5:testResources (default-testResources) @ oozie-mini ---
[debug] execute contextualize
[INFO] Using 'UTF-8' encoding to copy filtered resources.
[INFO] Copying 3 resources
[INFO] Copying 3 resources
[INFO]
[INFO] --- maven-compiler-plugin:2.3.2:testCompile (default-testCompile) @ oozie-mini ---
[INFO] Nothing to compile - all classes are up to date
[INFO]
[INFO] --- maven-surefire-plugin:2.12.2:test (default-test) @ oozie-mini ---
[INFO] Tests are skipped.
[INFO]
[INFO] --- maven-jar-plugin:2.3.1:jar (default-jar) @ oozie-mini ---
[INFO] Building jar: <https://builds.apache.org/job/oozie-trunk-precommit-build/ws/minitest/target/oozie-mini-4.2.0-SNAPSHOT.jar>
[INFO]
[INFO] --- maven-site-plugin:2.0-beta-6:attach-descriptor (attach-descriptor) @ oozie-mini ---
[INFO]
[INFO] --- maven-assembly-plugin:2.2.1:single (default-cli) @ oozie-mini ---
[INFO] Reading assembly descriptor: src/main/assemblies/empty.xml
[INFO]
[INFO] ------------------------------------------------------------------------
[INFO] Building Apache Oozie Distro 4.2.0-SNAPSHOT
[INFO] ------------------------------------------------------------------------
[INFO]
[INFO] --- maven-remote-resources-plugin:1.5:process (default) @ oozie-distro ---
[INFO]
[INFO] --- maven-resources-plugin:2.5:resources (default-resources) @ oozie-distro ---
[debug] execute contextualize
[INFO] Using 'UTF-8' encoding to copy filtered resources.
[INFO] skip non existing resourceDirectory <https://builds.apache.org/job/oozie-trunk-precommit-build/ws/distro/src/main/resources>
[INFO] Copying 3 resources
[INFO]
[INFO] --- maven-compiler-plugin:2.3.2:compile (default-compile) @ oozie-distro ---
[INFO] No sources to compile
[INFO]
[INFO] --- maven-resources-plugin:2.5:testResources (default-testResources) @ oozie-distro ---
[debug] execute contextualize
[INFO] Using 'UTF-8' encoding to copy filtered resources.
[INFO] skip non existing resourceDirectory <https://builds.apache.org/job/oozie-trunk-precommit-build/ws/distro/src/test/resources>
[INFO] Copying 3 resources
[INFO]
[INFO] --- maven-compiler-plugin:2.3.2:testCompile (default-testCompile) @ oozie-distro ---
[INFO] No sources to compile
[INFO]
[INFO] --- maven-surefire-plugin:2.12.2:test (default-test) @ oozie-distro ---
[INFO] Tests are skipped.
[INFO]
[INFO] --- maven-jar-plugin:2.3.1:jar (default-jar) @ oozie-distro ---
[INFO] Building jar: <https://builds.apache.org/job/oozie-trunk-precommit-build/ws/distro/target/oozie-distro-4.2.0-SNAPSHOT.jar>
[INFO]
[INFO] --- maven-site-plugin:2.0-beta-6:attach-descriptor (attach-descriptor) @ oozie-distro ---
[INFO]
[INFO] --- maven-antrun-plugin:1.6:run (default) @ oozie-distro ---
[INFO] Executing tasks
main:
[mkdir] Created dir: <https://builds.apache.org/job/oozie-trunk-precommit-build/ws/distro/downloads>
[get] Getting: http://archive.apache.org/dist/tomcat/tomcat-6/v6.0.41/bin/apache-tomcat-6.0.41.tar.gz
[get] To: <https://builds.apache.org/job/oozie-trunk-precommit-build/ws/distro/downloads/tomcat-6.0.41.tar.gz>
............................................................................................................................................................................................................................................................................................................................................................................................................................................................................................................................................................................................................................................................................................................................................................................................................................................................................................................................................
[mkdir] Created dir: <https://builds.apache.org/job/oozie-trunk-precommit-build/ws/distro/target/tomcat>
[gunzip] Expanding <https://builds.apache.org/job/oozie-trunk-precommit-build/ws/distro/downloads/tomcat-6.0.41.tar.gz> to <https://builds.apache.org/job/oozie-trunk-precommit-build/ws/distro/target/tomcat/tomcat-6.0.41.tar>
[untar] Expanding: <https://builds.apache.org/job/oozie-trunk-precommit-build/ws/distro/target/tomcat/tomcat-6.0.41.tar> into <https://builds.apache.org/job/oozie-trunk-precommit-build/ws/distro/target/tomcat>
[delete] Deleting directory <https://builds.apache.org/job/oozie-trunk-precommit-build/ws/distro/target/tomcat/oozie-server/webapps>
[mkdir] Created dir: <https://builds.apache.org/job/oozie-trunk-precommit-build/ws/distro/target/tomcat/oozie-server/webapps>
[delete] Deleting: <https://builds.apache.org/job/oozie-trunk-precommit-build/ws/distro/target/tomcat/oozie-server/conf/server.xml>
[copy] Copying 1 file to <https://builds.apache.org/job/oozie-trunk-precommit-build/ws/distro/target/tomcat/oozie-server/conf>
[copy] Copying 1 file to <https://builds.apache.org/job/oozie-trunk-precommit-build/ws/distro/target/tomcat/oozie-server/conf>
[mkdir] Created dir: <https://builds.apache.org/job/oozie-trunk-precommit-build/ws/distro/target/tomcat/oozie-server/conf/ssl>
[copy] Copying 1 file to <https://builds.apache.org/job/oozie-trunk-precommit-build/ws/distro/target/tomcat/oozie-server/conf/ssl>
[copy] Copying 1 file to <https://builds.apache.org/job/oozie-trunk-precommit-build/ws/distro/target/tomcat/oozie-server/conf/ssl>
[copy] Copying 1 file to <https://builds.apache.org/job/oozie-trunk-precommit-build/ws/distro/target/tomcat/oozie-server/conf/ssl>
[copy] Copying 3 files to <https://builds.apache.org/job/oozie-trunk-precommit-build/ws/distro/target/tomcat/oozie-server/webapps/ROOT>
[INFO] Executed tasks
[INFO]
[INFO] --- maven-assembly-plugin:2.2.1:single (default-cli) @ oozie-distro ---
[INFO] Reading assembly descriptor: ../src/main/assemblies/distro.xml
[INFO] Copying files to <https://builds.apache.org/job/oozie-trunk-precommit-build/ws/distro/target/oozie-4.2.0-SNAPSHOT-distro>
[WARNING] Assembly file: <https://builds.apache.org/job/oozie-trunk-precommit-build/ws/distro/target/oozie-4.2.0-SNAPSHOT-distro> is not a regular file (it may be a directory). It cannot be attached to the project build for installation or deployment.
[INFO] Building tar : <https://builds.apache.org/job/oozie-trunk-precommit-build/ws/distro/target/oozie-4.2.0-SNAPSHOT-distro.tar.gz>
[INFO]
[INFO] ------------------------------------------------------------------------
[INFO] Building Apache Oozie ZooKeeper Security Tests 4.2.0-SNAPSHOT
[INFO] ------------------------------------------------------------------------
[INFO]
[INFO] --- maven-remote-resources-plugin:1.5:process (default) @ oozie-zookeeper-security-tests ---
[INFO]
[INFO] --- maven-resources-plugin:2.5:resources (default-resources) @ oozie-zookeeper-security-tests ---
[debug] execute contextualize
[INFO] Using 'UTF-8' encoding to copy filtered resources.
[INFO] skip non existing resourceDirectory <https://builds.apache.org/job/oozie-trunk-precommit-build/ws/zookeeper-security-tests/src/main/resources>
[INFO] Copying 3 resources
[INFO]
[INFO] --- maven-compiler-plugin:2.3.2:compile (default-compile) @ oozie-zookeeper-security-tests ---
[INFO] No sources to compile
[INFO]
[INFO] --- maven-resources-plugin:2.5:testResources (default-testResources) @ oozie-zookeeper-security-tests ---
[debug] execute contextualize
[INFO] Using 'UTF-8' encoding to copy filtered resources.
[INFO] skip non existing resourceDirectory <https://builds.apache.org/job/oozie-trunk-precommit-build/ws/zookeeper-security-tests/src/test/resources>
[INFO] Copying 3 resources
[INFO]
[INFO] --- maven-compiler-plugin:2.3.2:testCompile (default-testCompile) @ oozie-zookeeper-security-tests ---
[INFO] Nothing to compile - all classes are up to date
[INFO]
[INFO] --- maven-surefire-plugin:2.12.2:test (default-test) @ oozie-zookeeper-security-tests ---
[INFO] Tests are skipped.
[INFO]
[INFO] --- maven-jar-plugin:2.3.1:jar (default-jar) @ oozie-zookeeper-security-tests ---
[INFO] Building jar: <https://builds.apache.org/job/oozie-trunk-precommit-build/ws/zookeeper-security-tests/target/oozie-zookeeper-security-tests-4.2.0-SNAPSHOT.jar>
[INFO]
[INFO] --- maven-site-plugin:2.0-beta-6:attach-descriptor (attach-descriptor) @ oozie-zookeeper-security-tests ---
[INFO]
[INFO] --- maven-assembly-plugin:2.2.1:single (default-cli) @ oozie-zookeeper-security-tests ---
[INFO] Reading assembly descriptor: src/main/assemblies/empty.xml
[INFO] ------------------------------------------------------------------------
[INFO] Reactor Summary:
[INFO]
[INFO] Apache Oozie Main ................................. SUCCESS [ 9.562 s]
[INFO] Apache Oozie Hadoop Utils ......................... SUCCESS [ 0.634 s]
[INFO] Apache Oozie Hadoop Distcp hadoop-1-4.2.0-SNAPSHOT SUCCESS [ 0.117 s]
[INFO] Apache Oozie Hadoop Auth hadoop-1-4.2.0-SNAPSHOT .. SUCCESS [ 0.197 s]
[INFO] Apache Oozie Hadoop Libs .......................... SUCCESS [ 0.023 s]
[INFO] Apache Oozie Client ............................... SUCCESS [01:23 min]
[INFO] Apache Oozie Share Lib Oozie ...................... SUCCESS [ 0.954 s]
[INFO] Apache Oozie Share Lib HCatalog ................... SUCCESS [ 1.376 s]
[INFO] Apache Oozie Share Lib Distcp ..................... SUCCESS [ 0.256 s]
[INFO] Apache Oozie Core ................................. SUCCESS [ 40.489 s]
[INFO] Apache Oozie Share Lib Streaming .................. SUCCESS [ 1.043 s]
[INFO] Apache Oozie Share Lib Pig ........................ SUCCESS [ 0.965 s]
[INFO] Apache Oozie Share Lib Hive ....................... SUCCESS [ 2.386 s]
[INFO] Apache Oozie Share Lib Hive 2 ..................... SUCCESS [ 1.959 s]
[INFO] Apache Oozie Share Lib Sqoop ...................... SUCCESS [ 0.547 s]
[INFO] Apache Oozie Share Lib Spark ...................... SUCCESS [ 4.690 s]
[INFO] Apache Oozie Share Lib ............................ SUCCESS [ 17.029 s]
[INFO] Apache Oozie Docs ................................. SUCCESS [ 13.116 s]
[INFO] Apache Oozie WebApp ............................... SUCCESS [ 17.182 s]
[INFO] Apache Oozie Examples ............................. SUCCESS [ 1.326 s]
[INFO] Apache Oozie Tools ................................ SUCCESS [ 0.265 s]
[INFO] Apache Oozie MiniOozie ............................ SUCCESS [ 0.135 s]
[INFO] Apache Oozie Distro ............................... SUCCESS [01:05 min]
[INFO] Apache Oozie ZooKeeper Security Tests ............. SUCCESS [ 1.842 s]
[INFO] ------------------------------------------------------------------------
[INFO] BUILD SUCCESS
[INFO] ------------------------------------------------------------------------
[INFO] Total time: 04:26 min
[INFO] Finished at: 2014-12-30T11:37:21+00:00
[INFO] Final Memory: 96M/943M
[INFO] ------------------------------------------------------------------------
Reports
Running test-patch task CLEAN
Running test-patch task RAW_PATCH_ANALYSIS
Running test-patch task RAT
Running test-patch task JAVADOC
Running test-patch task COMPILE
Running test-patch task BACKWARDS_COMPATIBILITY
Running test-patch task TESTS
Running test-patch task DISTRO
Testing JIRA OOZIE-2102
Cleaning local git workspace
----------------------------
+1 PATCH_APPLIES
+1 CLEAN
-1 RAW_PATCH_ANALYSIS
+1 the patch does not introduce any @author tags
+1 the patch does not introduce any tabs
+1 the patch does not introduce any trailing spaces
+1 the patch does not introduce any line longer than 132
-1 the patch does not add/modify any testcase
+1 RAT
+1 the patch does not seem to introduce new RAT warnings
+1 JAVADOC
+1 the patch does not seem to introduce new Javadoc warnings
+1 COMPILE
+1 HEAD compiles
+1 patch compiles
+1 the patch does not seem to introduce new javac warnings
+1 BACKWARDS_COMPATIBILITY
+1 the patch does not change any JPA Entity/Colum/Basic/Lob/Transient annotations
+1 the patch does not modify JPA files
-1 TESTS
Tests run: 1561
Tests failed: 1
Tests errors: 0
The patch failed the following testcases:
testNone(org.apache.oozie.command.coord.TestCoordActionInputCheckXCommand)
+1 DISTRO
+1 distro tarball builds with the patch
----------------------------
-1 Overall result, please check the reported -1(s)
The full output of the test-patch run is available at
https://builds.apache.org/job/oozie-trunk-precommit-build/2160/
% Total % Received % Xferd Average Speed Time Time Time Current
Dload Upload Total Spent Left Speed
0 0 0 0 0 0 0 0 --:--:-- --:--:-- --:--:-- 0
0 0 0 0 0 0 0 0 --:--:-- --:--:-- --:--:-- 0
2 3706k 2 97733 0 0 66571 0 0:00:57 0:00:01 0:00:56 66575
40 3706k 40 1519k 0 0 606k 0 0:00:06 0:00:02 0:00:04 606k
93 3706k 93 3471k 0 0 998k 0 0:00:03 0:00:03 --:--:-- 997k
100 3706k 100 3706k 0 0 1064k 0 0:00:03 0:00:03 --:--:-- 1064k
Adding comment to JIRA
Comment added.
test-patch exit code: 1
Build step 'Execute shell' marked build as failure
Archiving artifacts
Sending artifact delta relative to oozie-trunk-precommit-build #2091
Archived 10 artifacts
Archive block size is 32768
Received 0 blocks and 1160909 bytes
Compression is 0.0%
Took 0.49 sec
Recording test results