You are viewing a plain text version of this content. The canonical link for it is here.
Posted to builds@cassandra.apache.org by Apache Jenkins Server <je...@builds.apache.org> on 2026/02/19 14:58:57 UTC

Build complete: Cassandra-5.0 #559 [UNSTABLE] 83032572972360c057369fdea4792a363fbd185b

-------------------------------------------------------------------------------
  Build Cassandra-5.0 #559 Still unstable
  URL: https://ci-cassandra.apache.org/job/Cassandra-5.0/559/
  -------------------------------------------------------------------------------
  Changes:
  [Dmitry Konstantinov] Improve diagnostics for JUnit tests which crashed or timed out on


  -------------------------------------------------------------------------------
  Failed Tests:
  9 tests failed.
FAILED:  dtest-large-latest.replace_address_test.TestReplaceAddress.Tests / dtest-large-latest jdk17 3/6 / test_restart_failed_replace
FAILED:  dtest-large-latest.replace_address_test.TestReplaceAddress.Tests / dtest-large-latest jdk11 3/6 / test_restart_failed_replace
FAILED:  dtest-large-novnode.replace_address_test.TestReplaceAddress.Tests / dtest-large-novnode jdk11 3/6 / test_restart_failed_replace_with_reset_resume_state
FAILED:  dtest-large.replace_address_test.TestReplaceAddress.Tests / dtest-large jdk11 3/6 / test_restart_failed_replace
FAILED:  dtest-latest.materialized_views_test.TestMaterializedViews.Tests / dtest-latest jdk17 17/64 / test_complex_mv_select_statements
FAILED:  dtest-latest.materialized_views_test.TestMaterializedViews.Tests / dtest-latest jdk17 63/64 / test_drop_with_stopped_build
FAILED:  dtest-latest.secondary_indexes_test.TestSecondaryIndexes.Tests / dtest-latest jdk17 63/64 / test_6924_dropping_ks
FAILED:  dtest-novnode.secondary_indexes_test.TestSecondaryIndexes.Tests / dtest-novnode jdk17 13/64 / test_6924_dropping_ks
FAILED:  dtest-upgrade.upgrade_tests.bootstrap_upgrade_test.TestBootstrapUpgrade.Tests / dtest-upgrade jdk11 19/128 / test_killed_wiped_node_cannot_join

  -------------------------------------------------------------------------------
  For complete test report and logs see https://nightlies.apache.org/cassandra/Cassandra-5.0/559/