You are viewing a plain text version of this content. The canonical link for it is here.
Posted to yarn-dev@hadoop.apache.org by Apache Jenkins Server <je...@builds.apache.org> on 2014/11/28 11:42:34 UTC

Build failed in Jenkins: Hadoop-Yarn-trunk #757

See <https://builds.apache.org/job/Hadoop-Yarn-trunk/757/>

------------------------------------------
[...truncated 7767 lines...]
	at org.apache.hadoop.yarn.server.nodemanager.webapp.TestNMWebServicesContainers.<init>(TestNMWebServicesContainers.java:177)

testNodeSingleContainers(org.apache.hadoop.yarn.server.nodemanager.webapp.TestNMWebServicesContainers)  Time elapsed: 0.001 sec  <<< ERROR!
com.sun.jersey.test.framework.spi.container.TestContainerException: java.net.BindException: Address already in use
	at sun.nio.ch.Net.bind(Native Method)
	at sun.nio.ch.ServerSocketChannelImpl.bind(ServerSocketChannelImpl.java:124)
	at sun.nio.ch.ServerSocketAdaptor.bind(ServerSocketAdaptor.java:59)
	at org.glassfish.grizzly.nio.transport.TCPNIOTransport.bind(TCPNIOTransport.java:413)
	at org.glassfish.grizzly.nio.transport.TCPNIOTransport.bind(TCPNIOTransport.java:384)
	at org.glassfish.grizzly.nio.transport.TCPNIOTransport.bind(TCPNIOTransport.java:375)
	at org.glassfish.grizzly.http.server.NetworkListener.start(NetworkListener.java:549)
	at org.glassfish.grizzly.http.server.HttpServer.start(HttpServer.java:255)
	at com.sun.jersey.api.container.grizzly2.GrizzlyServerFactory.createHttpServer(GrizzlyServerFactory.java:326)
	at com.sun.jersey.api.container.grizzly2.GrizzlyServerFactory.createHttpServer(GrizzlyServerFactory.java:343)
	at com.sun.jersey.test.framework.spi.container.grizzly2.web.GrizzlyWebTestContainerFactory$GrizzlyWebTestContainer.instantiateGrizzlyWebServer(GrizzlyWebTestContainerFactory.java:219)
	at com.sun.jersey.test.framework.spi.container.grizzly2.web.GrizzlyWebTestContainerFactory$GrizzlyWebTestContainer.<init>(GrizzlyWebTestContainerFactory.java:129)
	at com.sun.jersey.test.framework.spi.container.grizzly2.web.GrizzlyWebTestContainerFactory$GrizzlyWebTestContainer.<init>(GrizzlyWebTestContainerFactory.java:86)
	at com.sun.jersey.test.framework.spi.container.grizzly2.web.GrizzlyWebTestContainerFactory.create(GrizzlyWebTestContainerFactory.java:79)
	at com.sun.jersey.test.framework.JerseyTest.getContainer(JerseyTest.java:342)
	at com.sun.jersey.test.framework.JerseyTest.<init>(JerseyTest.java:217)
	at org.apache.hadoop.yarn.server.nodemanager.webapp.TestNMWebServicesContainers.<init>(TestNMWebServicesContainers.java:177)

Running org.apache.hadoop.yarn.server.nodemanager.webapp.TestContainerLogsPage
Tests run: 4, Failures: 0, Errors: 0, Skipped: 1, Time elapsed: 1.063 sec - in org.apache.hadoop.yarn.server.nodemanager.webapp.TestContainerLogsPage
Running org.apache.hadoop.yarn.server.nodemanager.webapp.TestNMWebServicesApps
Tests run: 19, Failures: 0, Errors: 6, Skipped: 0, Time elapsed: 6.473 sec <<< FAILURE! - in org.apache.hadoop.yarn.server.nodemanager.webapp.TestNMWebServicesApps
testNodeSingleAppsDefault(org.apache.hadoop.yarn.server.nodemanager.webapp.TestNMWebServicesApps)  Time elapsed: 0.008 sec  <<< ERROR!
com.sun.jersey.test.framework.spi.container.TestContainerException: java.net.BindException: Address already in use
	at sun.nio.ch.Net.bind(Native Method)
	at sun.nio.ch.ServerSocketChannelImpl.bind(ServerSocketChannelImpl.java:124)
	at sun.nio.ch.ServerSocketAdaptor.bind(ServerSocketAdaptor.java:59)
	at org.glassfish.grizzly.nio.transport.TCPNIOTransport.bind(TCPNIOTransport.java:413)
	at org.glassfish.grizzly.nio.transport.TCPNIOTransport.bind(TCPNIOTransport.java:384)
	at org.glassfish.grizzly.nio.transport.TCPNIOTransport.bind(TCPNIOTransport.java:375)
	at org.glassfish.grizzly.http.server.NetworkListener.start(NetworkListener.java:549)
	at org.glassfish.grizzly.http.server.HttpServer.start(HttpServer.java:255)
	at com.sun.jersey.api.container.grizzly2.GrizzlyServerFactory.createHttpServer(GrizzlyServerFactory.java:326)
	at com.sun.jersey.api.container.grizzly2.GrizzlyServerFactory.createHttpServer(GrizzlyServerFactory.java:343)
	at com.sun.jersey.test.framework.spi.container.grizzly2.web.GrizzlyWebTestContainerFactory$GrizzlyWebTestContainer.instantiateGrizzlyWebServer(GrizzlyWebTestContainerFactory.java:219)
	at com.sun.jersey.test.framework.spi.container.grizzly2.web.GrizzlyWebTestContainerFactory$GrizzlyWebTestContainer.<init>(GrizzlyWebTestContainerFactory.java:129)
	at com.sun.jersey.test.framework.spi.container.grizzly2.web.GrizzlyWebTestContainerFactory$GrizzlyWebTestContainer.<init>(GrizzlyWebTestContainerFactory.java:86)
	at com.sun.jersey.test.framework.spi.container.grizzly2.web.GrizzlyWebTestContainerFactory.create(GrizzlyWebTestContainerFactory.java:79)
	at com.sun.jersey.test.framework.JerseyTest.getContainer(JerseyTest.java:342)
	at com.sun.jersey.test.framework.JerseyTest.<init>(JerseyTest.java:217)
	at org.apache.hadoop.yarn.server.nodemanager.webapp.TestNMWebServicesApps.<init>(TestNMWebServicesApps.java:172)

testNodeSingleApps(org.apache.hadoop.yarn.server.nodemanager.webapp.TestNMWebServicesApps)  Time elapsed: 0.001 sec  <<< ERROR!
com.sun.jersey.test.framework.spi.container.TestContainerException: java.net.BindException: Address already in use
	at sun.nio.ch.Net.bind(Native Method)
	at sun.nio.ch.ServerSocketChannelImpl.bind(ServerSocketChannelImpl.java:124)
	at sun.nio.ch.ServerSocketAdaptor.bind(ServerSocketAdaptor.java:59)
	at org.glassfish.grizzly.nio.transport.TCPNIOTransport.bind(TCPNIOTransport.java:413)
	at org.glassfish.grizzly.nio.transport.TCPNIOTransport.bind(TCPNIOTransport.java:384)
	at org.glassfish.grizzly.nio.transport.TCPNIOTransport.bind(TCPNIOTransport.java:375)
	at org.glassfish.grizzly.http.server.NetworkListener.start(NetworkListener.java:549)
	at org.glassfish.grizzly.http.server.HttpServer.start(HttpServer.java:255)
	at com.sun.jersey.api.container.grizzly2.GrizzlyServerFactory.createHttpServer(GrizzlyServerFactory.java:326)
	at com.sun.jersey.api.container.grizzly2.GrizzlyServerFactory.createHttpServer(GrizzlyServerFactory.java:343)
	at com.sun.jersey.test.framework.spi.container.grizzly2.web.GrizzlyWebTestContainerFactory$GrizzlyWebTestContainer.instantiateGrizzlyWebServer(GrizzlyWebTestContainerFactory.java:219)
	at com.sun.jersey.test.framework.spi.container.grizzly2.web.GrizzlyWebTestContainerFactory$GrizzlyWebTestContainer.<init>(GrizzlyWebTestContainerFactory.java:129)
	at com.sun.jersey.test.framework.spi.container.grizzly2.web.GrizzlyWebTestContainerFactory$GrizzlyWebTestContainer.<init>(GrizzlyWebTestContainerFactory.java:86)
	at com.sun.jersey.test.framework.spi.container.grizzly2.web.GrizzlyWebTestContainerFactory.create(GrizzlyWebTestContainerFactory.java:79)
	at com.sun.jersey.test.framework.JerseyTest.getContainer(JerseyTest.java:342)
	at com.sun.jersey.test.framework.JerseyTest.<init>(JerseyTest.java:217)
	at org.apache.hadoop.yarn.server.nodemanager.webapp.TestNMWebServicesApps.<init>(TestNMWebServicesApps.java:172)

testNodeSingleAppsXML(org.apache.hadoop.yarn.server.nodemanager.webapp.TestNMWebServicesApps)  Time elapsed: 0.002 sec  <<< ERROR!
com.sun.jersey.test.framework.spi.container.TestContainerException: java.net.BindException: Address already in use
	at sun.nio.ch.Net.bind(Native Method)
	at sun.nio.ch.ServerSocketChannelImpl.bind(ServerSocketChannelImpl.java:124)
	at sun.nio.ch.ServerSocketAdaptor.bind(ServerSocketAdaptor.java:59)
	at org.glassfish.grizzly.nio.transport.TCPNIOTransport.bind(TCPNIOTransport.java:413)
	at org.glassfish.grizzly.nio.transport.TCPNIOTransport.bind(TCPNIOTransport.java:384)
	at org.glassfish.grizzly.nio.transport.TCPNIOTransport.bind(TCPNIOTransport.java:375)
	at org.glassfish.grizzly.http.server.NetworkListener.start(NetworkListener.java:549)
	at org.glassfish.grizzly.http.server.HttpServer.start(HttpServer.java:255)
	at com.sun.jersey.api.container.grizzly2.GrizzlyServerFactory.createHttpServer(GrizzlyServerFactory.java:326)
	at com.sun.jersey.api.container.grizzly2.GrizzlyServerFactory.createHttpServer(GrizzlyServerFactory.java:343)
	at com.sun.jersey.test.framework.spi.container.grizzly2.web.GrizzlyWebTestContainerFactory$GrizzlyWebTestContainer.instantiateGrizzlyWebServer(GrizzlyWebTestContainerFactory.java:219)
	at com.sun.jersey.test.framework.spi.container.grizzly2.web.GrizzlyWebTestContainerFactory$GrizzlyWebTestContainer.<init>(GrizzlyWebTestContainerFactory.java:129)
	at com.sun.jersey.test.framework.spi.container.grizzly2.web.GrizzlyWebTestContainerFactory$GrizzlyWebTestContainer.<init>(GrizzlyWebTestContainerFactory.java:86)
	at com.sun.jersey.test.framework.spi.container.grizzly2.web.GrizzlyWebTestContainerFactory.create(GrizzlyWebTestContainerFactory.java:79)
	at com.sun.jersey.test.framework.JerseyTest.getContainer(JerseyTest.java:342)
	at com.sun.jersey.test.framework.JerseyTest.<init>(JerseyTest.java:217)
	at org.apache.hadoop.yarn.server.nodemanager.webapp.TestNMWebServicesApps.<init>(TestNMWebServicesApps.java:172)

testNodeSingleAppsInvalid(org.apache.hadoop.yarn.server.nodemanager.webapp.TestNMWebServicesApps)  Time elapsed: 0.001 sec  <<< ERROR!
com.sun.jersey.test.framework.spi.container.TestContainerException: java.net.BindException: Address already in use
	at sun.nio.ch.Net.bind(Native Method)
	at sun.nio.ch.ServerSocketChannelImpl.bind(ServerSocketChannelImpl.java:124)
	at sun.nio.ch.ServerSocketAdaptor.bind(ServerSocketAdaptor.java:59)
	at org.glassfish.grizzly.nio.transport.TCPNIOTransport.bind(TCPNIOTransport.java:413)
	at org.glassfish.grizzly.nio.transport.TCPNIOTransport.bind(TCPNIOTransport.java:384)
	at org.glassfish.grizzly.nio.transport.TCPNIOTransport.bind(TCPNIOTransport.java:375)
	at org.glassfish.grizzly.http.server.NetworkListener.start(NetworkListener.java:549)
	at org.glassfish.grizzly.http.server.HttpServer.start(HttpServer.java:255)
	at com.sun.jersey.api.container.grizzly2.GrizzlyServerFactory.createHttpServer(GrizzlyServerFactory.java:326)
	at com.sun.jersey.api.container.grizzly2.GrizzlyServerFactory.createHttpServer(GrizzlyServerFactory.java:343)
	at com.sun.jersey.test.framework.spi.container.grizzly2.web.GrizzlyWebTestContainerFactory$GrizzlyWebTestContainer.instantiateGrizzlyWebServer(GrizzlyWebTestContainerFactory.java:219)
	at com.sun.jersey.test.framework.spi.container.grizzly2.web.GrizzlyWebTestContainerFactory$GrizzlyWebTestContainer.<init>(GrizzlyWebTestContainerFactory.java:129)
	at com.sun.jersey.test.framework.spi.container.grizzly2.web.GrizzlyWebTestContainerFactory$GrizzlyWebTestContainer.<init>(GrizzlyWebTestContainerFactory.java:86)
	at com.sun.jersey.test.framework.spi.container.grizzly2.web.GrizzlyWebTestContainerFactory.create(GrizzlyWebTestContainerFactory.java:79)
	at com.sun.jersey.test.framework.JerseyTest.getContainer(JerseyTest.java:342)
	at com.sun.jersey.test.framework.JerseyTest.<init>(JerseyTest.java:217)
	at org.apache.hadoop.yarn.server.nodemanager.webapp.TestNMWebServicesApps.<init>(TestNMWebServicesApps.java:172)

testNodeAppsDefault(org.apache.hadoop.yarn.server.nodemanager.webapp.TestNMWebServicesApps)  Time elapsed: 0.001 sec  <<< ERROR!
com.sun.jersey.test.framework.spi.container.TestContainerException: java.net.BindException: Address already in use
	at sun.nio.ch.Net.bind(Native Method)
	at sun.nio.ch.ServerSocketChannelImpl.bind(ServerSocketChannelImpl.java:124)
	at sun.nio.ch.ServerSocketAdaptor.bind(ServerSocketAdaptor.java:59)
	at org.glassfish.grizzly.nio.transport.TCPNIOTransport.bind(TCPNIOTransport.java:413)
	at org.glassfish.grizzly.nio.transport.TCPNIOTransport.bind(TCPNIOTransport.java:384)
	at org.glassfish.grizzly.nio.transport.TCPNIOTransport.bind(TCPNIOTransport.java:375)
	at org.glassfish.grizzly.http.server.NetworkListener.start(NetworkListener.java:549)
	at org.glassfish.grizzly.http.server.HttpServer.start(HttpServer.java:255)
	at com.sun.jersey.api.container.grizzly2.GrizzlyServerFactory.createHttpServer(GrizzlyServerFactory.java:326)
	at com.sun.jersey.api.container.grizzly2.GrizzlyServerFactory.createHttpServer(GrizzlyServerFactory.java:343)
	at com.sun.jersey.test.framework.spi.container.grizzly2.web.GrizzlyWebTestContainerFactory$GrizzlyWebTestContainer.instantiateGrizzlyWebServer(GrizzlyWebTestContainerFactory.java:219)
	at com.sun.jersey.test.framework.spi.container.grizzly2.web.GrizzlyWebTestContainerFactory$GrizzlyWebTestContainer.<init>(GrizzlyWebTestContainerFactory.java:129)
	at com.sun.jersey.test.framework.spi.container.grizzly2.web.GrizzlyWebTestContainerFactory$GrizzlyWebTestContainer.<init>(GrizzlyWebTestContainerFactory.java:86)
	at com.sun.jersey.test.framework.spi.container.grizzly2.web.GrizzlyWebTestContainerFactory.create(GrizzlyWebTestContainerFactory.java:79)
	at com.sun.jersey.test.framework.JerseyTest.getContainer(JerseyTest.java:342)
	at com.sun.jersey.test.framework.JerseyTest.<init>(JerseyTest.java:217)
	at org.apache.hadoop.yarn.server.nodemanager.webapp.TestNMWebServicesApps.<init>(TestNMWebServicesApps.java:172)

testNodeAppsSlash(org.apache.hadoop.yarn.server.nodemanager.webapp.TestNMWebServicesApps)  Time elapsed: 0.001 sec  <<< ERROR!
com.sun.jersey.test.framework.spi.container.TestContainerException: java.net.BindException: Address already in use
	at sun.nio.ch.Net.bind(Native Method)
	at sun.nio.ch.ServerSocketChannelImpl.bind(ServerSocketChannelImpl.java:124)
	at sun.nio.ch.ServerSocketAdaptor.bind(ServerSocketAdaptor.java:59)
	at org.glassfish.grizzly.nio.transport.TCPNIOTransport.bind(TCPNIOTransport.java:413)
	at org.glassfish.grizzly.nio.transport.TCPNIOTransport.bind(TCPNIOTransport.java:384)
	at org.glassfish.grizzly.nio.transport.TCPNIOTransport.bind(TCPNIOTransport.java:375)
	at org.glassfish.grizzly.http.server.NetworkListener.start(NetworkListener.java:549)
	at org.glassfish.grizzly.http.server.HttpServer.start(HttpServer.java:255)
	at com.sun.jersey.api.container.grizzly2.GrizzlyServerFactory.createHttpServer(GrizzlyServerFactory.java:326)
	at com.sun.jersey.api.container.grizzly2.GrizzlyServerFactory.createHttpServer(GrizzlyServerFactory.java:343)
	at com.sun.jersey.test.framework.spi.container.grizzly2.web.GrizzlyWebTestContainerFactory$GrizzlyWebTestContainer.instantiateGrizzlyWebServer(GrizzlyWebTestContainerFactory.java:219)
	at com.sun.jersey.test.framework.spi.container.grizzly2.web.GrizzlyWebTestContainerFactory$GrizzlyWebTestContainer.<init>(GrizzlyWebTestContainerFactory.java:129)
	at com.sun.jersey.test.framework.spi.container.grizzly2.web.GrizzlyWebTestContainerFactory$GrizzlyWebTestContainer.<init>(GrizzlyWebTestContainerFactory.java:86)
	at com.sun.jersey.test.framework.spi.container.grizzly2.web.GrizzlyWebTestContainerFactory.create(GrizzlyWebTestContainerFactory.java:79)
	at com.sun.jersey.test.framework.JerseyTest.getContainer(JerseyTest.java:342)
	at com.sun.jersey.test.framework.JerseyTest.<init>(JerseyTest.java:217)
	at org.apache.hadoop.yarn.server.nodemanager.webapp.TestNMWebServicesApps.<init>(TestNMWebServicesApps.java:172)

Running org.apache.hadoop.yarn.server.nodemanager.webapp.TestNMWebServer
Tests run: 3, Failures: 0, Errors: 0, Skipped: 0, Time elapsed: 2.198 sec - in org.apache.hadoop.yarn.server.nodemanager.webapp.TestNMWebServer

Results :

Failed tests: 
  TestNodeStatusUpdater.testNMRegistration:1027 NodeManager failed to start

Tests in error: 
  TestNodeStatusUpdater.testStopReentrant:1076 » YarnRuntime java.net.BindExcept...
  TestNodeStatusUpdater.testRMVersionLessThanMinimum:1438 » YarnRuntime java.net...
  TestNodeStatusUpdater.testNMConnectionToRM:1205  NM should have tried re-conne...
  TestNodeStatusUpdater.testNMShutdownForRegistrationFailure:1162->verifyNodeStartFailure:1533 » YarnRuntime
  TestNodeStatusUpdater.testApplicationKeepAlive:1298 » YarnRuntime java.net.Bin...
  TestNodeStatusUpdater.testNodeStatusUpdaterRetryAndNMShutdown:1383 » YarnRuntime
  TestNodeManagerShutdown.testStateStoreRemovalOnDecommission:121 » YarnRuntime ...
  TestNodeManagerShutdown.testKillContainersOnShutdown:146 » YarnRuntime java.ne...
  TestLogAggregationService.testLogAggregationForRealContainerLaunch:830 » YarnRuntime
  TestContainerManager.testContainerSetup:180 » YarnRuntime java.net.BindExcepti...
  TestContainerManager.testContainerManagerInitialization:148 » YarnRuntime java...
  TestContainerManager.testStartContainerFailureWithUnknownAuxService:760 » YarnRuntime
  TestContainerManager.testContainerLaunchAndStop:260 » YarnRuntime java.net.Bin...
  TestContainerManager.testLocalFilesCleanup:467 » YarnRuntime java.net.BindExce...
  TestContainerManager.testContainerLaunchFromPreviousRM:574 » YarnRuntime java....
  TestContainerManager.testContainerLaunchAndExitSuccess:439 » YarnRuntime java....
  TestContainerManager.testMultipleContainersLaunch:638 » YarnRuntime java.net.B...
  TestContainerManager.testMultipleContainersStopAndGetStatus:683 » YarnRuntime ...
  TestContainersMonitor.testContainerKillOnMemoryOverflow:191 » YarnRuntime java...
  TestNMWebServices.<init>:176->JerseyTest.<init>:217->JerseyTest.getContainer:342 » TestContainer
  TestNMWebServices.<init>:176->JerseyTest.<init>:217->JerseyTest.getContainer:342 » TestContainer
  TestNMWebServices.<init>:176->JerseyTest.<init>:217->JerseyTest.getContainer:342 » TestContainer
  TestNMWebServices.<init>:176->JerseyTest.<init>:217->JerseyTest.getContainer:342 » TestContainer
  TestNMWebServices.<init>:176->JerseyTest.<init>:217->JerseyTest.getContainer:342 » TestContainer
  TestNMWebServices.<init>:176->JerseyTest.<init>:217->JerseyTest.getContainer:342 » TestContainer
  TestNMWebServices.<init>:176->JerseyTest.<init>:217->JerseyTest.getContainer:342 » TestContainer
  TestNMWebServices.<init>:176->JerseyTest.<init>:217->JerseyTest.getContainer:342 » TestContainer
  TestNMWebServices.<init>:176->JerseyTest.<init>:217->JerseyTest.getContainer:342 » TestContainer
  TestNMWebServices.<init>:176->JerseyTest.<init>:217->JerseyTest.getContainer:342 » TestContainer
  TestNMWebServices.<init>:176->JerseyTest.<init>:217->JerseyTest.getContainer:342 » TestContainer
  TestNMWebServicesContainers.<init>:177->JerseyTest.<init>:217->JerseyTest.getContainer:342 » TestContainer
  TestNMWebServicesContainers.<init>:177->JerseyTest.<init>:217->JerseyTest.getContainer:342 » TestContainer
  TestNMWebServicesContainers.<init>:177->JerseyTest.<init>:217->JerseyTest.getContainer:342 » TestContainer
  TestNMWebServicesContainers.<init>:177->JerseyTest.<init>:217->JerseyTest.getContainer:342 » TestContainer
  TestNMWebServicesContainers.<init>:177->JerseyTest.<init>:217->JerseyTest.getContainer:342 » TestContainer
  TestNMWebServicesContainers.<init>:177->JerseyTest.<init>:217->JerseyTest.getContainer:342 » TestContainer
  TestNMWebServicesContainers.<init>:177->JerseyTest.<init>:217->JerseyTest.getContainer:342 » TestContainer
  TestNMWebServicesContainers.<init>:177->JerseyTest.<init>:217->JerseyTest.getContainer:342 » TestContainer
  TestNMWebServicesContainers.<init>:177->JerseyTest.<init>:217->JerseyTest.getContainer:342 » TestContainer
  TestNMWebServicesContainers.<init>:177->JerseyTest.<init>:217->JerseyTest.getContainer:342 » TestContainer
  TestNMWebServicesContainers.<init>:177->JerseyTest.<init>:217->JerseyTest.getContainer:342 » TestContainer
  TestNMWebServicesContainers.<init>:177->JerseyTest.<init>:217->JerseyTest.getContainer:342 » TestContainer
  TestNMWebServicesApps.<init>:172->JerseyTest.<init>:217->JerseyTest.getContainer:342 » TestContainer
  TestNMWebServicesApps.<init>:172->JerseyTest.<init>:217->JerseyTest.getContainer:342 » TestContainer
  TestNMWebServicesApps.<init>:172->JerseyTest.<init>:217->JerseyTest.getContainer:342 » TestContainer
  TestNMWebServicesApps.<init>:172->JerseyTest.<init>:217->JerseyTest.getContainer:342 » TestContainer
  TestNMWebServicesApps.<init>:172->JerseyTest.<init>:217->JerseyTest.getContainer:342 » TestContainer
  TestNMWebServicesApps.<init>:172->JerseyTest.<init>:217->JerseyTest.getContainer:342 » TestContainer

Tests run: 278, Failures: 1, Errors: 48, Skipped: 5

[INFO] ------------------------------------------------------------------------
[INFO] Reactor Summary:
[INFO] 
[INFO] hadoop-yarn ....................................... SUCCESS [  2.945 s]
[INFO] hadoop-yarn-api ................................... SUCCESS [03:00 min]
[INFO] hadoop-yarn-common ................................ SUCCESS [02:34 min]
[INFO] hadoop-yarn-server ................................ SUCCESS [  0.080 s]
[INFO] hadoop-yarn-server-common ......................... SUCCESS [ 38.182 s]
[INFO] hadoop-yarn-server-nodemanager .................... FAILURE [04:08 min]
[INFO] hadoop-yarn-server-web-proxy ...................... SKIPPED
[INFO] hadoop-yarn-server-applicationhistoryservice ...... SKIPPED
[INFO] hadoop-yarn-server-resourcemanager ................ SKIPPED
[INFO] hadoop-yarn-server-tests .......................... SKIPPED
[INFO] hadoop-yarn-client ................................ SKIPPED
[INFO] hadoop-yarn-server-sharedcachemanager ............. SKIPPED
[INFO] hadoop-yarn-applications .......................... SKIPPED
[INFO] hadoop-yarn-applications-distributedshell ......... SKIPPED
[INFO] hadoop-yarn-applications-unmanaged-am-launcher .... SKIPPED
[INFO] hadoop-yarn-site .................................. SKIPPED
[INFO] hadoop-yarn-registry .............................. SKIPPED
[INFO] hadoop-yarn-project ............................... SKIPPED
[INFO] ------------------------------------------------------------------------
[INFO] BUILD FAILURE
[INFO] ------------------------------------------------------------------------
[INFO] Total time: 10:26 min
[INFO] Finished at: 2014-11-28T10:42:32+00:00
[INFO] Final Memory: 82M/1115M
[INFO] ------------------------------------------------------------------------
[ERROR] Failed to execute goal org.apache.maven.plugins:maven-surefire-plugin:2.16:test (default-test) on project hadoop-yarn-server-nodemanager: There are test failures.
[ERROR] 
[ERROR] Please refer to <https://builds.apache.org/job/Hadoop-Yarn-trunk/ws/hadoop-yarn-project/hadoop-yarn/hadoop-yarn-server/hadoop-yarn-server-nodemanager/target/surefire-reports> for the individual test results.
[ERROR] -> [Help 1]
[ERROR] 
[ERROR] To see the full stack trace of the errors, re-run Maven with the -e switch.
[ERROR] Re-run Maven using the -X switch to enable full debug logging.
[ERROR] 
[ERROR] For more information about the errors and possible solutions, please read the following articles:
[ERROR] [Help 1] http://cwiki.apache.org/confluence/display/MAVEN/MojoFailureException
[ERROR] 
[ERROR] After correcting the problems, you can resume the build with the command
[ERROR]   mvn <goals> -rf :hadoop-yarn-server-nodemanager
Build step 'Execute shell' marked build as failure
Archiving artifacts

Jenkins build is back to normal : Hadoop-Yarn-trunk #758

Posted by Apache Jenkins Server <je...@builds.apache.org>.
See <https://builds.apache.org/job/Hadoop-Yarn-trunk/758/changes>