You are viewing a plain text version of this content. The canonical link for it is here.
Posted to builds@beam.apache.org by Apache Jenkins Server <je...@builds.apache.org> on 2023/02/04 06:31:39 UTC
Build failed in Jenkins: beam_PostCommit_Java_PVR_Spark_Batch #1615
See <https://ci-beam.apache.org/job/beam_PostCommit_Java_PVR_Spark_Batch/1615/display/redirect?page=changes>
Changes:
[noreply] Optimize PGBK table to only update cache when there is a large enough
[noreply] Swap setting a context from being on the hot path when we emit elements
------------------------------------------
[...truncated 192.31 KB...]
role_payload: "\nCantlr-runtime-3.5.2-zj_I7LEPOemjzdy7LONQ0nLZzT0LHhjm_nPDuTichzQ.jar"
}
dependencies {
type_urn: "beam:artifact:type:file:v1"
type_payload: "\n\254\001/tmp/beam-artifact-staging/68a62fd4366eb6270a16f3edb32efa1ead69c36a4e50a888d94872b9f008f8ce/343-EMBEDDED-javassist-3.20.0-GA-12kQYvt3nCOBZAyPcqy6LCOHOwHCQ4ZtQcFdxMiEjqI.jar"
role_urn: "beam:artifact:role:staging_to:v1"
role_payload: "\nCjavassist-3.20.0-GA-12kQYvt3nCOBZAyPcqy6LCOHOwHCQ4ZtQcFdxMiEjqI.jar"
}
dependencies {
type_urn: "beam:artifact:type:file:v1"
type_payload: "\n\257\001/tmp/beam-artifact-staging/68a62fd4366eb6270a16f3edb32efa1ead69c36a4e50a888d94872b9f008f8ce/344-EMBEDDED-hadoop-apache2-3.2.0-1-utOlhQMw_MZxskVG0O3_tp_lQEfNFCpS6pyHz3TPVKA.jar"
role_urn: "beam:artifact:role:staging_to:v1"
role_payload: "\nFhadoop-apache2-3.2.0-1-utOlhQMw_MZxskVG0O3_tp_lQEfNFCpS6pyHz3TPVKA.jar"
}
dependencies {
type_urn: "beam:artifact:type:file:v1"
type_payload: "\n\262\001/tmp/beam-artifact-staging/68a62fd4366eb6270a16f3edb32efa1ead69c36a4e50a888d94872b9f008f8ce/345-EMBEDDED-checker-compat-qual-2.5.3-12ua_qYcfAgpCAI_DLwUJ_q5q9LfkVyLij56UJvMvG0.jar"
role_urn: "beam:artifact:role:staging_to:v1"
role_payload: "\nIchecker-compat-qual-2.5.3-12ua_qYcfAgpCAI_DLwUJ_q5q9LfkVyLij56UJvMvG0.jar"
}
dependencies {
type_urn: "beam:artifact:type:file:v1"
type_payload: "\n\250\001/tmp/beam-artifact-staging/68a62fd4366eb6270a16f3edb32efa1ead69c36a4e50a888d94872b9f008f8ce/346-EMBEDDED-disruptor-3.4.2-9BLsuyNcJGC0XmNYQQlyPeqNlLgZx4yb_Dj1DLqFRsA.jar"
role_urn: "beam:artifact:role:staging_to:v1"
role_payload: "\n?disruptor-3.4.2-9BLsuyNcJGC0XmNYQQlyPeqNlLgZx4yb_Dj1DLqFRsA.jar"
}
dependencies {
type_urn: "beam:artifact:type:file:v1"
type_payload: "\n\254\001/tmp/beam-artifact-staging/68a62fd4366eb6270a16f3edb32efa1ead69c36a4e50a888d94872b9f008f8ce/347-EMBEDDED-annotations-4.1.1.4-unNOHoTAnWFa9qCdMwNLTwRC-Hct7BIO-zdthqVlrhU.jar"
role_urn: "beam:artifact:role:staging_to:v1"
role_payload: "\nCannotations-4.1.1.4-unNOHoTAnWFa9qCdMwNLTwRC-Hct7BIO-zdthqVlrhU.jar"
}
dependencies {
type_urn: "beam:artifact:type:file:v1"
type_payload: "\n\270\001/tmp/beam-artifact-staging/68a62fd4366eb6270a16f3edb32efa1ead69c36a4e50a888d94872b9f008f8ce/348-EMBEDDED-animal-sniffer-annotations-1.22-8lt6jhYLEwXqcfxhqD-XUEA90jrE3cbcsEkC8EqT8Qc.jar"
role_urn: "beam:artifact:role:staging_to:v1"
role_payload: "\nOanimal-sniffer-annotations-1.22-8lt6jhYLEwXqcfxhqD-XUEA90jrE3cbcsEkC8EqT8Qc.jar"
}
dependencies {
type_urn: "beam:artifact:type:file:v1"
type_payload: "\n\254\001/tmp/beam-artifact-staging/68a62fd4366eb6270a16f3edb32efa1ead69c36a4e50a888d94872b9f008f8ce/349-EMBEDDED-perfmark-api-0.26.0-t9I-k6NFN84zJwgmmg0UBHiKW14ZSegvVTX85Rs-qVs.jar"
role_urn: "beam:artifact:role:staging_to:v1"
role_payload: "\nCperfmark-api-0.26.0-t9I-k6NFN84zJwgmmg0UBHiKW14ZSegvVTX85Rs-qVs.jar"
}
dependencies {
type_urn: "beam:artifact:type:file:v1"
type_payload: "\n\251\001/tmp/beam-artifact-staging/68a62fd4366eb6270a16f3edb32efa1ead69c36a4e50a888d94872b9f008f8ce/350-EMBEDDED-threetenbp-1.6.5-slUWBMDWUWQo4wZSE7dEYSQDeKB2IiAaN60yY47LQXw.jar"
role_urn: "beam:artifact:role:staging_to:v1"
role_payload: "\n@threetenbp-1.6.5-slUWBMDWUWQo4wZSE7dEYSQDeKB2IiAaN60yY47LQXw.jar"
}
dependencies {
type_urn: "beam:artifact:type:file:v1"
type_payload: "\n\245\001/tmp/beam-artifact-staging/68a62fd4366eb6270a16f3edb32efa1ead69c36a4e50a888d94872b9f008f8ce/351-EMBEDDED-okhttp-2.7.5-iKyf0btR-CvMZkzB65wiXJDcQ4nWYCMbTMc3vr_n0Ko.jar"
role_urn: "beam:artifact:role:staging_to:v1"
role_payload: "\n<okhttp-2.7.5-iKyf0btR-CvMZkzB65wiXJDcQ4nWYCMbTMc3vr_n0Ko.jar"
}
dependencies {
type_urn: "beam:artifact:type:file:v1"
type_payload: "\n\254\001/tmp/beam-artifact-staging/68a62fd4366eb6270a16f3edb32efa1ead69c36a4e50a888d94872b9f008f8ce/352-EMBEDDED-hk2-utils-2.4.0-b34-cCEbH5GIGb9q-_adPRnUrm4qddbib2w5up8g645WEtc.jar"
role_urn: "beam:artifact:role:staging_to:v1"
role_payload: "\nChk2-utils-2.4.0-b34-cCEbH5GIGb9q-_adPRnUrm4qddbib2w5up8g645WEtc.jar"
}
dependencies {
type_urn: "beam:artifact:type:file:v1"
type_payload: "\n\271\001/tmp/beam-artifact-staging/68a62fd4366eb6270a16f3edb32efa1ead69c36a4e50a888d94872b9f008f8ce/353-EMBEDDED-aopalliance-repackaged-2.4.0-b34-XTywzs5yLHuoq5h7kxBTzbywyxKtXIyKdpHrb35gpks.jar"
role_urn: "beam:artifact:role:staging_to:v1"
role_payload: "\nPaopalliance-repackaged-2.4.0-b34-XTywzs5yLHuoq5h7kxBTzbywyxKtXIyKdpHrb35gpks.jar"
}
dependencies {
type_urn: "beam:artifact:type:file:v1"
type_payload: "\n\261\001/tmp/beam-artifact-staging/68a62fd4366eb6270a16f3edb32efa1ead69c36a4e50a888d94872b9f008f8ce/354-EMBEDDED-servlet-api-2.5-20081211-BodWCWmW_gD2BKw7ZnLW9mPcd36kqDBW4kDQRW535HI.jar"
role_urn: "beam:artifact:role:staging_to:v1"
role_payload: "\nHservlet-api-2.5-20081211-BodWCWmW_gD2BKw7ZnLW9mPcd36kqDBW4kDQRW535HI.jar"
}
dependencies {
type_urn: "beam:artifact:type:file:v1"
type_payload: "\n\263\001/tmp/beam-artifact-staging/68a62fd4366eb6270a16f3edb32efa1ead69c36a4e50a888d94872b9f008f8ce/355-EMBEDDED-jakarta.xml.bind-api-2.3.3-wEU59HLppt0MdoXqgtZ3KCJpq457rKLhRQDjgeDGzsU.jar"
role_urn: "beam:artifact:role:staging_to:v1"
role_payload: "\nJjakarta.xml.bind-api-2.3.3-wEU59HLppt0MdoXqgtZ3KCJpq457rKLhRQDjgeDGzsU.jar"
}
dependencies {
type_urn: "beam:artifact:type:file:v1"
type_payload: "\n\261\001/tmp/beam-artifact-staging/68a62fd4366eb6270a16f3edb32efa1ead69c36a4e50a888d94872b9f008f8ce/356-EMBEDDED-jakarta.activation-1.2.2-AhVnc-SunQSNFKVq011kS-6fEFKnkdBy3z3tPGVubho.jar"
role_urn: "beam:artifact:role:staging_to:v1"
role_payload: "\nHjakarta.activation-1.2.2-AhVnc-SunQSNFKVq011kS-6fEFKnkdBy3z3tPGVubho.jar"
}
dependencies {
type_urn: "beam:artifact:type:file:v1"
type_payload: "\n\257\001/tmp/beam-artifact-staging/68a62fd4366eb6270a16f3edb32efa1ead69c36a4e50a888d94872b9f008f8ce/357-EMBEDDED-jcip-annotations-1.0-1-T8z_g4Kq_FiZYsTtsmL2qlleNPHhHmEFfRxqluj8cyM.jar"
role_urn: "beam:artifact:role:staging_to:v1"
role_payload: "\nFjcip-annotations-1.0-1-T8z_g4Kq_FiZYsTtsmL2qlleNPHhHmEFfRxqluj8cyM.jar"
}
dependencies {
type_urn: "beam:artifact:type:file:v1"
type_payload: "\n\252\001/tmp/beam-artifact-staging/68a62fd4366eb6270a16f3edb32efa1ead69c36a4e50a888d94872b9f008f8ce/358-EMBEDDED-spring-jcl-5.3.18-V2mq4Oat3Y9fWcus0bBjXYGYUeZrrsT859bB-tH6344.jar"
role_urn: "beam:artifact:role:staging_to:v1"
role_payload: "\nAspring-jcl-5.3.18-V2mq4Oat3Y9fWcus0bBjXYGYUeZrrsT859bB-tH6344.jar"
}
dependencies {
type_urn: "beam:artifact:type:file:v1"
type_payload: "\n\270\001/tmp/beam-artifact-staging/68a62fd4366eb6270a16f3edb32efa1ead69c36a4e50a888d94872b9f008f8ce/359-EMBEDDED-org.abego.treelayout.core-1.0.3--l4xOVw5wufUasoPgfcgYJMWB7L6Qb02A46yy2-5MyY.jar"
role_urn: "beam:artifact:role:staging_to:v1"
role_payload: "\nOorg.abego.treelayout.core-1.0.3--l4xOVw5wufUasoPgfcgYJMWB7L6Qb02A46yy2-5MyY.jar"
}
dependencies {
type_urn: "beam:artifact:type:file:v1"
type_payload: "\n\251\001/tmp/beam-artifact-staging/68a62fd4366eb6270a16f3edb32efa1ead69c36a4e50a888d94872b9f008f8ce/360-EMBEDDED-javax.json-1.0.4-Dh3sQKHt6WWUElHtqWiu7gUsxPUDeLwxbMSOgVm9vrQ.jar"
role_urn: "beam:artifact:role:staging_to:v1"
role_payload: "\n@javax.json-1.0.4-Dh3sQKHt6WWUElHtqWiu7gUsxPUDeLwxbMSOgVm9vrQ.jar"
}
dependencies {
type_urn: "beam:artifact:type:file:v1"
type_payload: "\n\243\001/tmp/beam-artifact-staging/68a62fd4366eb6270a16f3edb32efa1ead69c36a4e50a888d94872b9f008f8ce/361-EMBEDDED-icu4j-58.2-lT4eg7K-fD6i-I2obBNhT0fp5x01eMhSHX8Yd1a2OWI.jar"
role_urn: "beam:artifact:role:staging_to:v1"
role_payload: "\n:icu4j-58.2-lT4eg7K-fD6i-I2obBNhT0fp5x01eMhSHX8Yd1a2OWI.jar"
}
dependencies {
type_urn: "beam:artifact:type:file:v1"
type_payload: "\n\252\001/tmp/beam-artifact-staging/68a62fd4366eb6270a16f3edb32efa1ead69c36a4e50a888d94872b9f008f8ce/362-EMBEDDED-auto-value-1.10.1-6ngBDYLv2y-Rmxb67Z5kJ_B9KZihXE9hnNxqYWTs0zY.jar"
role_urn: "beam:artifact:role:staging_to:v1"
role_payload: "\nAauto-value-1.10.1-6ngBDYLv2y-Rmxb67Z5kJ_B9KZihXE9hnNxqYWTs0zY.jar"
}
dependencies {
type_urn: "beam:artifact:type:file:v1"
type_payload: "\n\243\001/tmp/beam-artifact-staging/68a62fd4366eb6270a16f3edb32efa1ead69c36a4e50a888d94872b9f008f8ce/363-EMBEDDED-okio-1.6.0-EUvcH0czimi8vJWr8vXNxyvu7JGBLy_Ne1IcGTeHYmY.jar"
role_urn: "beam:artifact:role:staging_to:v1"
role_payload: "\n:okio-1.6.0-EUvcH0czimi8vJWr8vXNxyvu7JGBLy_Ne1IcGTeHYmY.jar"
}
dependencies {
type_urn: "beam:artifact:type:file:v1"
type_payload: "\n\247\001/tmp/beam-artifact-staging/68a62fd4366eb6270a16f3edb32efa1ead69c36a4e50a888d94872b9f008f8ce/364-EMBEDDED-stax-api-1.0-2-6McOvXb5gslYKoLvgs9s4Up9WKSk3KXLe3_JiMgAibc.jar"
role_urn: "beam:artifact:role:staging_to:v1"
role_payload: "\n>stax-api-1.0-2-6McOvXb5gslYKoLvgs9s4Up9WKSk3KXLe3_JiMgAibc.jar"
}
dependencies {
type_urn: "beam:artifact:type:file:v1"
type_payload: "\n\242\001/tmp/beam-artifact-staging/68a62fd4366eb6270a16f3edb32efa1ead69c36a4e50a888d94872b9f008f8ce/365-EMBEDDED-guice-3.0-GlnQQh_9NVzAtwtC3xwumvdEyKLQyS2jefX8ovB_HSI.jar"
role_urn: "beam:artifact:role:staging_to:v1"
role_payload: "\n9guice-3.0-GlnQQh_9NVzAtwtC3xwumvdEyKLQyS2jefX8ovB_HSI.jar"
}
dependencies {
type_urn: "beam:artifact:type:file:v1"
type_payload: "\n\247\001/tmp/beam-artifact-staging/68a62fd4366eb6270a16f3edb32efa1ead69c36a4e50a888d94872b9f008f8ce/366-EMBEDDED-javax.inject-1-kcdwRKUMSBY2wy2Rb9ickRinIZU5BFLIEGUID5V95_8.jar"
role_urn: "beam:artifact:role:staging_to:v1"
role_payload: "\n>javax.inject-1-kcdwRKUMSBY2wy2Rb9ickRinIZU5BFLIEGUID5V95_8.jar"
}
dependencies {
type_urn: "beam:artifact:type:file:v1"
type_payload: "\n\275\001/tmp/beam-artifact-staging/68a62fd4366eb6270a16f3edb32efa1ead69c36a4e50a888d94872b9f008f8ce/367-EMBEDDED-geronimo-jcache_1.0_spec-1.0-alpha-1-AHChLlj0kblXGTkTJSmaYpRTDubDziXlC9yYsLcAlmw.jar"
role_urn: "beam:artifact:role:staging_to:v1"
role_payload: "\nTgeronimo-jcache_1.0_spec-1.0-alpha-1-AHChLlj0kblXGTkTJSmaYpRTDubDziXlC9yYsLcAlmw.jar"
}
dependencies {
type_urn: "beam:artifact:type:file:v1"
type_payload: "\n\256\001/tmp/beam-artifact-staging/68a62fd4366eb6270a16f3edb32efa1ead69c36a4e50a888d94872b9f008f8ce/368-EMBEDDED-mssql-jdbc-6.2.1.jre7-nPollFCuNHHS5uLD2K78ziNuPa74s3NNIdyTw6W76AY.jar"
role_urn: "beam:artifact:role:staging_to:v1"
role_payload: "\nEmssql-jdbc-6.2.1.jre7-nPollFCuNHHS5uLD2K78ziNuPa74s3NNIdyTw6W76AY.jar"
}
dependencies {
type_urn: "beam:artifact:type:file:v1"
type_payload: "\n\250\001/tmp/beam-artifact-staging/68a62fd4366eb6270a16f3edb32efa1ead69c36a4e50a888d94872b9f008f8ce/369-EMBEDDED-aopalliance-1.0-Ct3sZw_tzT8RPFyAkdeDKA0j9146y4QbYanNsHk3agg.jar"
role_urn: "beam:artifact:role:staging_to:v1"
role_payload: "\n?aopalliance-1.0-Ct3sZw_tzT8RPFyAkdeDKA0j9146y4QbYanNsHk3agg.jar"
}
dependencies {
type_urn: "beam:artifact:type:file:v1"
type_payload: "\n\256\001/tmp/beam-artifact-staging/68a62fd4366eb6270a16f3edb32efa1ead69c36a4e50a888d94872b9f008f8ce/370-EMBEDDED-cglib-2.2.1-v20090111-QuHfsmvsvxpjPyW0fjn8xCK4XnfkwEaNmkT4hfX6C-I.jar"
role_urn: "beam:artifact:role:staging_to:v1"
role_payload: "\nEcglib-2.2.1-v20090111-QuHfsmvsvxpjPyW0fjn8xCK4XnfkwEaNmkT4hfX6C-I.jar"
}
[ScheduledExecutor-thread] WARN org.apache.beam.sdk.fn.data.BeamFnDataGrpcMultiplexer - Hanged up for unknown endpoint.
[grpc-default-executor-155] ERROR org.apache.beam.sdk.fn.data.BeamFnDataGrpcMultiplexer - Failed to handle for url: "InProcessServer_568"
org.apache.beam.vendor.grpc.v1p48p1.io.grpc.StatusRuntimeException: CANCELLED: Multiplexer hanging up
at org.apache.beam.vendor.grpc.v1p48p1.io.grpc.Status.asRuntimeException(Status.java:535)
at org.apache.beam.vendor.grpc.v1p48p1.io.grpc.stub.ClientCalls$StreamObserverToCallListenerAdapter.onClose(ClientCalls.java:487)
at org.apache.beam.vendor.grpc.v1p48p1.io.grpc.internal.ClientCallImpl.closeObserver(ClientCallImpl.java:562)
at org.apache.beam.vendor.grpc.v1p48p1.io.grpc.internal.ClientCallImpl.access$300(ClientCallImpl.java:70)
at org.apache.beam.vendor.grpc.v1p48p1.io.grpc.internal.ClientCallImpl$ClientStreamListenerImpl$1StreamClosed.runInternal(ClientCallImpl.java:743)
at org.apache.beam.vendor.grpc.v1p48p1.io.grpc.internal.ClientCallImpl$ClientStreamListenerImpl$1StreamClosed.runInContext(ClientCallImpl.java:722)
at org.apache.beam.vendor.grpc.v1p48p1.io.grpc.internal.ContextRunnable.run(ContextRunnable.java:37)
at org.apache.beam.vendor.grpc.v1p48p1.io.grpc.internal.SerializingExecutor.run(SerializingExecutor.java:133)
at java.util.concurrent.ThreadPoolExecutor.runWorker(ThreadPoolExecutor.java:1149)
at java.util.concurrent.ThreadPoolExecutor$Worker.run(ThreadPoolExecutor.java:624)
at java.lang.Thread.run(Thread.java:750)
229 tests completed, 1 failed, 1 skipped
> Task :runners:spark:2:job-server:validatesPortableRunnerBatch FAILED
> Task :runners:spark:2:job-server:validatesPortableRunnerDocker
[shutdown-hook-0] INFO org.apache.spark.util.ShutdownHookManager - Shutdown hook called
[shutdown-hook-0] INFO org.apache.spark.util.ShutdownHookManager - Deleting directory /tmp/spark-a1020c57-5931-41f0-a1b9-153dc8b03193
> Task :runners:spark:3:job-server:validatesPortableRunnerBatch
[grpc-default-executor-144] INFO org.apache.beam.runners.fnexecution.logging.GrpcLoggingService - Logging client hanged up.
[shutdown-hook-0] INFO org.apache.spark.util.ShutdownHookManager - Shutdown hook called
[shutdown-hook-0] INFO org.apache.spark.util.ShutdownHookManager - Deleting directory /tmp/spark-8b76cc33-8d3a-4a81-ac2e-f39105edc3e6
229 tests completed, 1 failed, 1 skipped
> Task :runners:spark:3:job-server:validatesPortableRunnerBatch FAILED
> Task :runners:spark:3:job-server:validatesPortableRunnerDocker
[shutdown-hook-0] INFO org.apache.spark.util.ShutdownHookManager - Shutdown hook called
[shutdown-hook-0] INFO org.apache.spark.util.ShutdownHookManager - Deleting directory /tmp/spark-065c2d8c-5d36-4445-97d5-f7929c6263bc
FAILURE: Build completed with 2 failures.
1: Task failed with an exception.
-----------
* What went wrong:
Execution failed for task ':runners:spark:2:job-server:validatesPortableRunnerBatch'.
> There were failing tests. See the report at: file://<https://ci-beam.apache.org/job/beam_PostCommit_Java_PVR_Spark_Batch/ws/src/runners/spark/2/job-server/build/reports/tests/validatesPortableRunnerBatch/index.html>
* Try:
> Run with --stacktrace option to get the stack trace.
> Run with --info or --debug option to get more log output.
==============================================================================
2: Task failed with an exception.
-----------
* What went wrong:
Execution failed for task ':runners:spark:3:job-server:validatesPortableRunnerBatch'.
> There were failing tests. See the report at: file://<https://ci-beam.apache.org/job/beam_PostCommit_Java_PVR_Spark_Batch/ws/src/runners/spark/3/job-server/build/reports/tests/validatesPortableRunnerBatch/index.html>
* Try:
> Run with --stacktrace option to get the stack trace.
> Run with --info or --debug option to get more log output.
==============================================================================
* Get more help at https://help.gradle.org
Deprecated Gradle features were used in this build, making it incompatible with Gradle 8.0.
You can use '--warning-mode all' to show the individual deprecation warnings and determine if they come from your own scripts or plugins.
See https://docs.gradle.org/7.5.1/userguide/command_line_interface.html#sec:command_line_warnings
Execution optimizations have been disabled for 1 invalid unit(s) of work during this build to ensure correctness.
Please consult deprecation warnings for more details.
BUILD FAILED in 2h 11m 2s
119 actionable tasks: 82 executed, 33 from cache, 4 up-to-date
Publishing build scan...
https://gradle.com/s/vydyebz4g64sy
Build step 'Invoke Gradle script' changed build result to FAILURE
Build step 'Invoke Gradle script' marked build as failure
---------------------------------------------------------------------
To unsubscribe, e-mail: builds-unsubscribe@beam.apache.org
For additional commands, e-mail: builds-help@beam.apache.org
Jenkins build is back to normal : beam_PostCommit_Java_PVR_Spark_Batch #1626
Posted by Apache Jenkins Server <je...@builds.apache.org>.
See <https://ci-beam.apache.org/job/beam_PostCommit_Java_PVR_Spark_Batch/1626/display/redirect?page=changes>
---------------------------------------------------------------------
To unsubscribe, e-mail: builds-unsubscribe@beam.apache.org
For additional commands, e-mail: builds-help@beam.apache.org
Build failed in Jenkins: beam_PostCommit_Java_PVR_Spark_Batch #1625
Posted by Apache Jenkins Server <je...@builds.apache.org>.
See <https://ci-beam.apache.org/job/beam_PostCommit_Java_PVR_Spark_Batch/1625/display/redirect?page=changes>
Changes:
[noreply] Allow for setMaxRetryJobs in BigQueryIO to be configurable (#25224)
------------------------------------------
[...truncated 8.17 MB...]
This problem might be caused by incorrect test process configuration.
Please refer to the test execution section in the User Manual at https://docs.gradle.org/7.5.1/userguide/java_testing.html#sec:test_execution
at org.gradle.api.internal.tasks.testing.worker.ForkingTestClassProcessor.stop(ForkingTestClassProcessor.java:192)
at org.gradle.api.internal.tasks.testing.processors.RestartEveryNTestClassProcessor.endBatch(RestartEveryNTestClassProcessor.java:77)
at org.gradle.api.internal.tasks.testing.processors.RestartEveryNTestClassProcessor.stop(RestartEveryNTestClassProcessor.java:62)
at sun.reflect.NativeMethodAccessorImpl.invoke0(Native Method)
at sun.reflect.NativeMethodAccessorImpl.invoke(NativeMethodAccessorImpl.java:62)
at sun.reflect.DelegatingMethodAccessorImpl.invoke(DelegatingMethodAccessorImpl.java:43)
at java.lang.reflect.Method.invoke(Method.java:498)
at org.gradle.internal.dispatch.ReflectionDispatch.dispatch(ReflectionDispatch.java:36)
at org.gradle.internal.dispatch.ReflectionDispatch.dispatch(ReflectionDispatch.java:24)
at org.gradle.internal.dispatch.FailureHandlingDispatch.dispatch(FailureHandlingDispatch.java:30)
... 10 more
Could not stop org.gradle.internal.actor.internal.DefaultActorFactory$NonBlockingActor@1ac4bc81.
org.gradle.internal.dispatch.DispatchException: Could not dispatch message [MethodInvocation method: stop()].
at org.gradle.internal.dispatch.ExceptionTrackingFailureHandler.dispatchFailed(ExceptionTrackingFailureHandler.java:35)
at org.gradle.internal.dispatch.FailureHandlingDispatch.dispatch(FailureHandlingDispatch.java:32)
at org.gradle.internal.dispatch.AsyncDispatch.dispatchMessages(AsyncDispatch.java:87)
at org.gradle.internal.dispatch.AsyncDispatch.access$000(AsyncDispatch.java:36)
at org.gradle.internal.dispatch.AsyncDispatch$1.run(AsyncDispatch.java:71)
at org.gradle.internal.concurrent.InterruptibleRunnable.run(InterruptibleRunnable.java:42)
at org.gradle.internal.operations.CurrentBuildOperationPreservingRunnable.run(CurrentBuildOperationPreservingRunnable.java:42)
at org.gradle.internal.concurrent.ExecutorPolicy$CatchAndRecordFailures.onExecute(ExecutorPolicy.java:64)
at org.gradle.internal.concurrent.ManagedExecutorImpl$1.run(ManagedExecutorImpl.java:48)
at java.util.concurrent.ThreadPoolExecutor.runWorker(ThreadPoolExecutor.java:1149)
at java.util.concurrent.ThreadPoolExecutor$Worker.run(ThreadPoolExecutor.java:624)
at java.lang.Thread.run(Thread.java:750)
Caused by: org.gradle.process.internal.ExecException: Process 'Gradle Test Executor 8' finished with non-zero exit value 56
This problem might be caused by incorrect test process configuration.
Please refer to the test execution section in the User Manual at https://docs.gradle.org/7.5.1/userguide/java_testing.html#sec:test_execution
at org.gradle.api.internal.tasks.testing.worker.ForkingTestClassProcessor.stop(ForkingTestClassProcessor.java:192)
at org.gradle.api.internal.tasks.testing.processors.RestartEveryNTestClassProcessor.endBatch(RestartEveryNTestClassProcessor.java:77)
at org.gradle.api.internal.tasks.testing.processors.RestartEveryNTestClassProcessor.stop(RestartEveryNTestClassProcessor.java:62)
at sun.reflect.NativeMethodAccessorImpl.invoke0(Native Method)
at sun.reflect.NativeMethodAccessorImpl.invoke(NativeMethodAccessorImpl.java:62)
at sun.reflect.DelegatingMethodAccessorImpl.invoke(DelegatingMethodAccessorImpl.java:43)
at java.lang.reflect.Method.invoke(Method.java:498)
at org.gradle.internal.dispatch.ReflectionDispatch.dispatch(ReflectionDispatch.java:36)
at org.gradle.internal.dispatch.ReflectionDispatch.dispatch(ReflectionDispatch.java:24)
at org.gradle.internal.dispatch.FailureHandlingDispatch.dispatch(FailureHandlingDispatch.java:30)
... 10 more
Could not stop org.gradle.internal.actor.internal.DefaultActorFactory$NonBlockingActor@ac8ba9.
org.gradle.internal.dispatch.DispatchException: Could not dispatch message [MethodInvocation method: output(4.65, org.gradle.api.internal.tasks.testing.DefaultTestOutputEvent@eb752d8b)].
at org.gradle.internal.dispatch.ExceptionTrackingFailureHandler.dispatchFailed(ExceptionTrackingFailureHandler.java:35)
at org.gradle.internal.dispatch.FailureHandlingDispatch.dispatch(FailureHandlingDispatch.java:32)
at org.gradle.internal.dispatch.AsyncDispatch.dispatchMessages(AsyncDispatch.java:87)
at org.gradle.internal.dispatch.AsyncDispatch.access$000(AsyncDispatch.java:36)
at org.gradle.internal.dispatch.AsyncDispatch$1.run(AsyncDispatch.java:71)
at org.gradle.internal.concurrent.InterruptibleRunnable.run(InterruptibleRunnable.java:42)
at org.gradle.internal.operations.CurrentBuildOperationPreservingRunnable.run(CurrentBuildOperationPreservingRunnable.java:42)
at org.gradle.internal.concurrent.ExecutorPolicy$CatchAndRecordFailures.onExecute(ExecutorPolicy.java:64)
at org.gradle.internal.concurrent.ManagedExecutorImpl$1.run(ManagedExecutorImpl.java:48)
at java.util.concurrent.ThreadPoolExecutor.runWorker(ThreadPoolExecutor.java:1149)
at java.util.concurrent.ThreadPoolExecutor$Worker.run(ThreadPoolExecutor.java:624)
at java.lang.Thread.run(Thread.java:750)
Caused by: com.esotericsoftware.kryo.KryoException: java.io.IOException: No space left on device
at com.esotericsoftware.kryo.io.Output.flush(Output.java:165)
at com.esotericsoftware.kryo.io.Output.require(Output.java:142)
at com.esotericsoftware.kryo.io.Output.writeBytes(Output.java:228)
at org.gradle.internal.serialize.kryo.KryoBackedEncoder.writeBytes(KryoBackedEncoder.java:48)
at org.gradle.api.internal.tasks.testing.junit.result.TestOutputStore$Writer.onOutput(TestOutputStore.java:118)
at org.gradle.api.internal.tasks.testing.junit.result.TestReportDataCollector.onOutput(TestReportDataCollector.java:152)
at sun.reflect.GeneratedMethodAccessor749.invoke(Unknown Source)
at sun.reflect.DelegatingMethodAccessorImpl.invoke(DelegatingMethodAccessorImpl.java:43)
at java.lang.reflect.Method.invoke(Method.java:498)
at org.gradle.internal.dispatch.ReflectionDispatch.dispatch(ReflectionDispatch.java:36)
at org.gradle.internal.dispatch.ReflectionDispatch.dispatch(ReflectionDispatch.java:24)
at org.gradle.internal.event.AbstractBroadcastDispatch.dispatch(AbstractBroadcastDispatch.java:43)
at org.gradle.internal.event.BroadcastDispatch$SingletonDispatch.dispatch(BroadcastDispatch.java:245)
at org.gradle.internal.event.BroadcastDispatch$SingletonDispatch.dispatch(BroadcastDispatch.java:157)
at org.gradle.internal.event.AbstractBroadcastDispatch.dispatch(AbstractBroadcastDispatch.java:61)
at org.gradle.internal.event.BroadcastDispatch$CompositeDispatch.dispatch(BroadcastDispatch.java:346)
at org.gradle.internal.event.BroadcastDispatch$CompositeDispatch.dispatch(BroadcastDispatch.java:249)
at org.gradle.internal.event.ListenerBroadcast.dispatch(ListenerBroadcast.java:141)
at org.gradle.internal.event.ListenerBroadcast.dispatch(ListenerBroadcast.java:37)
at org.gradle.internal.dispatch.ProxyDispatchAdapter$DispatchingInvocationHandler.invoke(ProxyDispatchAdapter.java:94)
at com.sun.proxy.$Proxy107.onOutput(Unknown Source)
at org.gradle.api.internal.tasks.testing.results.TestListenerAdapter.output(TestListenerAdapter.java:56)
at sun.reflect.GeneratedMethodAccessor748.invoke(Unknown Source)
at sun.reflect.DelegatingMethodAccessorImpl.invoke(DelegatingMethodAccessorImpl.java:43)
at java.lang.reflect.Method.invoke(Method.java:498)
at org.gradle.internal.dispatch.ReflectionDispatch.dispatch(ReflectionDispatch.java:36)
at org.gradle.internal.dispatch.ReflectionDispatch.dispatch(ReflectionDispatch.java:24)
at org.gradle.internal.event.AbstractBroadcastDispatch.dispatch(AbstractBroadcastDispatch.java:43)
at org.gradle.internal.event.BroadcastDispatch$SingletonDispatch.dispatch(BroadcastDispatch.java:245)
at org.gradle.internal.event.BroadcastDispatch$SingletonDispatch.dispatch(BroadcastDispatch.java:157)
at org.gradle.internal.event.AbstractBroadcastDispatch.dispatch(AbstractBroadcastDispatch.java:61)
at org.gradle.internal.event.BroadcastDispatch$CompositeDispatch.dispatch(BroadcastDispatch.java:346)
at org.gradle.internal.event.BroadcastDispatch$CompositeDispatch.dispatch(BroadcastDispatch.java:249)
at org.gradle.internal.event.ListenerBroadcast.dispatch(ListenerBroadcast.java:141)
at org.gradle.internal.event.ListenerBroadcast.dispatch(ListenerBroadcast.java:37)
at org.gradle.internal.dispatch.ProxyDispatchAdapter$DispatchingInvocationHandler.invoke(ProxyDispatchAdapter.java:94)
at com.sun.proxy.$Proxy108.output(Unknown Source)
at org.gradle.api.internal.tasks.testing.results.StateTrackingTestResultProcessor.output(StateTrackingTestResultProcessor.java:112)
at org.gradle.api.internal.tasks.testing.results.AttachParentTestResultProcessor.output(AttachParentTestResultProcessor.java:48)
at sun.reflect.GeneratedMethodAccessor753.invoke(Unknown Source)
at sun.reflect.DelegatingMethodAccessorImpl.invoke(DelegatingMethodAccessorImpl.java:43)
at java.lang.reflect.Method.invoke(Method.java:498)
at org.gradle.internal.dispatch.ReflectionDispatch.dispatch(ReflectionDispatch.java:36)
at org.gradle.internal.dispatch.ReflectionDispatch.dispatch(ReflectionDispatch.java:24)
at org.gradle.internal.dispatch.FailureHandlingDispatch.dispatch(FailureHandlingDispatch.java:30)
... 10 more
Caused by: java.io.IOException: No space left on device
at java.io.FileOutputStream.writeBytes(Native Method)
at java.io.FileOutputStream.write(FileOutputStream.java:326)
at com.esotericsoftware.kryo.io.Output.flush(Output.java:163)
... 54 more
123 tests completed, 35 failed, 3 skipped
> Task :runners:spark:3:job-server:validatesPortableRunnerBatch FAILED
> Task :runners:spark:3:job-server:validatesPortableRunnerDocker FROM-CACHE
> Task :runners:spark:2:job-server:validatesPortableRunnerBatch
[grpc-default-executor-17] INFO org.apache.beam.runners.fnexecution.logging.GrpcLoggingService - Logging client hanged up.
[shutdown-hook-0] INFO org.apache.spark.util.ShutdownHookManager - Shutdown hook called
[shutdown-hook-0] INFO org.apache.spark.util.ShutdownHookManager - Deleting directory /tmp/spark-56829aee-9b94-4db8-bc92-01a0b3059cba
[shutdown-hook-0] INFO org.apache.spark.util.ShutdownHookManager - Shutdown hook called
[shutdown-hook-0] INFO org.apache.spark.util.ShutdownHookManager - Deleting directory /tmp/spark-0d762e0d-55fb-4c32-a002-cd9822b58a68
Could not stop org.gradle.internal.actor.internal.DefaultActorFactory$NonBlockingActor@608e362.
org.gradle.internal.dispatch.DispatchException: Could not dispatch message [MethodInvocation method: output(7.65, org.gradle.api.internal.tasks.testing.DefaultTestOutputEvent@48c33860)].
at org.gradle.internal.dispatch.ExceptionTrackingFailureHandler.dispatchFailed(ExceptionTrackingFailureHandler.java:35)
at org.gradle.internal.dispatch.FailureHandlingDispatch.dispatch(FailureHandlingDispatch.java:32)
at org.gradle.internal.dispatch.AsyncDispatch.dispatchMessages(AsyncDispatch.java:87)
at org.gradle.internal.dispatch.AsyncDispatch.access$000(AsyncDispatch.java:36)
at org.gradle.internal.dispatch.AsyncDispatch$1.run(AsyncDispatch.java:71)
at org.gradle.internal.concurrent.InterruptibleRunnable.run(InterruptibleRunnable.java:42)
at org.gradle.internal.operations.CurrentBuildOperationPreservingRunnable.run(CurrentBuildOperationPreservingRunnable.java:42)
at org.gradle.internal.concurrent.ExecutorPolicy$CatchAndRecordFailures.onExecute(ExecutorPolicy.java:64)
at org.gradle.internal.concurrent.ManagedExecutorImpl$1.run(ManagedExecutorImpl.java:48)
at java.util.concurrent.ThreadPoolExecutor.runWorker(ThreadPoolExecutor.java:1149)
at java.util.concurrent.ThreadPoolExecutor$Worker.run(ThreadPoolExecutor.java:624)
at java.lang.Thread.run(Thread.java:750)
Caused by: com.esotericsoftware.kryo.KryoException: java.io.IOException: No space left on device
at com.esotericsoftware.kryo.io.Output.flush(Output.java:165)
at com.esotericsoftware.kryo.io.Output.require(Output.java:142)
at com.esotericsoftware.kryo.io.Output.writeBytes(Output.java:228)
at org.gradle.internal.serialize.kryo.KryoBackedEncoder.writeBytes(KryoBackedEncoder.java:48)
at org.gradle.api.internal.tasks.testing.junit.result.TestOutputStore$Writer.onOutput(TestOutputStore.java:118)
at org.gradle.api.internal.tasks.testing.junit.result.TestReportDataCollector.onOutput(TestReportDataCollector.java:152)
at sun.reflect.GeneratedMethodAccessor749.invoke(Unknown Source)
at sun.reflect.DelegatingMethodAccessorImpl.invoke(DelegatingMethodAccessorImpl.java:43)
at java.lang.reflect.Method.invoke(Method.java:498)
at org.gradle.internal.dispatch.ReflectionDispatch.dispatch(ReflectionDispatch.java:36)
at org.gradle.internal.dispatch.ReflectionDispatch.dispatch(ReflectionDispatch.java:24)
at org.gradle.internal.event.AbstractBroadcastDispatch.dispatch(AbstractBroadcastDispatch.java:43)
at org.gradle.internal.event.BroadcastDispatch$SingletonDispatch.dispatch(BroadcastDispatch.java:245)
at org.gradle.internal.event.BroadcastDispatch$SingletonDispatch.dispatch(BroadcastDispatch.java:157)
at org.gradle.internal.event.AbstractBroadcastDispatch.dispatch(AbstractBroadcastDispatch.java:61)
at org.gradle.internal.event.BroadcastDispatch$CompositeDispatch.dispatch(BroadcastDispatch.java:346)
at org.gradle.internal.event.BroadcastDispatch$CompositeDispatch.dispatch(BroadcastDispatch.java:249)
at org.gradle.internal.event.ListenerBroadcast.dispatch(ListenerBroadcast.java:141)
at org.gradle.internal.event.ListenerBroadcast.dispatch(ListenerBroadcast.java:37)
at org.gradle.internal.dispatch.ProxyDispatchAdapter$DispatchingInvocationHandler.invoke(ProxyDispatchAdapter.java:94)
at com.sun.proxy.$Proxy107.onOutput(Unknown Source)
at org.gradle.api.internal.tasks.testing.results.TestListenerAdapter.output(TestListenerAdapter.java:56)
at sun.reflect.GeneratedMethodAccessor748.invoke(Unknown Source)
at sun.reflect.DelegatingMethodAccessorImpl.invoke(DelegatingMethodAccessorImpl.java:43)
at java.lang.reflect.Method.invoke(Method.java:498)
at org.gradle.internal.dispatch.ReflectionDispatch.dispatch(ReflectionDispatch.java:36)
at org.gradle.internal.dispatch.ReflectionDispatch.dispatch(ReflectionDispatch.java:24)
at org.gradle.internal.event.AbstractBroadcastDispatch.dispatch(AbstractBroadcastDispatch.java:43)
at org.gradle.internal.event.BroadcastDispatch$SingletonDispatch.dispatch(BroadcastDispatch.java:245)
at org.gradle.internal.event.BroadcastDispatch$SingletonDispatch.dispatch(BroadcastDispatch.java:157)
at org.gradle.internal.event.AbstractBroadcastDispatch.dispatch(AbstractBroadcastDispatch.java:61)
at org.gradle.internal.event.BroadcastDispatch$CompositeDispatch.dispatch(BroadcastDispatch.java:346)
at org.gradle.internal.event.BroadcastDispatch$CompositeDispatch.dispatch(BroadcastDispatch.java:249)
at org.gradle.internal.event.ListenerBroadcast.dispatch(ListenerBroadcast.java:141)
at org.gradle.internal.event.ListenerBroadcast.dispatch(ListenerBroadcast.java:37)
at org.gradle.internal.dispatch.ProxyDispatchAdapter$DispatchingInvocationHandler.invoke(ProxyDispatchAdapter.java:94)
at com.sun.proxy.$Proxy108.output(Unknown Source)
at org.gradle.api.internal.tasks.testing.results.StateTrackingTestResultProcessor.output(StateTrackingTestResultProcessor.java:112)
at org.gradle.api.internal.tasks.testing.results.AttachParentTestResultProcessor.output(AttachParentTestResultProcessor.java:48)
at sun.reflect.GeneratedMethodAccessor753.invoke(Unknown Source)
at sun.reflect.DelegatingMethodAccessorImpl.invoke(DelegatingMethodAccessorImpl.java:43)
at java.lang.reflect.Method.invoke(Method.java:498)
at org.gradle.internal.dispatch.ReflectionDispatch.dispatch(ReflectionDispatch.java:36)
at org.gradle.internal.dispatch.ReflectionDispatch.dispatch(ReflectionDispatch.java:24)
at org.gradle.internal.dispatch.FailureHandlingDispatch.dispatch(FailureHandlingDispatch.java:30)
... 10 more
Caused by: java.io.IOException: No space left on device
at java.io.FileOutputStream.writeBytes(Native Method)
at java.io.FileOutputStream.write(FileOutputStream.java:326)
at com.esotericsoftware.kryo.io.Output.flush(Output.java:163)
... 54 more
158 tests completed, 31 failed, 2 skipped
> Task :runners:spark:2:job-server:validatesPortableRunnerBatch FAILED
> Task :runners:spark:2:job-server:validatesPortableRunnerDocker FROM-CACHE
FAILURE: Build completed with 2 failures.
1: Task failed with an exception.
-----------
* What went wrong:
Execution failed for task ':runners:spark:3:job-server:validatesPortableRunnerBatch'.
> Process 'Gradle Test Executor 1' finished with non-zero exit value 56
This problem might be caused by incorrect test process configuration.
Please refer to the test execution section in the User Manual at https://docs.gradle.org/7.5.1/userguide/java_testing.html#sec:test_execution
* Try:
> Run with --stacktrace option to get the stack trace.
> Run with --info or --debug option to get more log output.
==============================================================================
2: Task failed with an exception.
-----------
* What went wrong:
Execution failed for task ':runners:spark:2:job-server:validatesPortableRunnerBatch'.
> Process 'Gradle Test Executor 6' finished with non-zero exit value 53
This problem might be caused by incorrect test process configuration.
Please refer to the test execution section in the User Manual at https://docs.gradle.org/7.5.1/userguide/java_testing.html#sec:test_execution
* Try:
> Run with --stacktrace option to get the stack trace.
> Run with --info or --debug option to get more log output.
==============================================================================
* Get more help at https://help.gradle.org
Deprecated Gradle features were used in this build, making it incompatible with Gradle 8.0.
You can use '--warning-mode all' to show the individual deprecation warnings and determine if they come from your own scripts or plugins.
See https://docs.gradle.org/7.5.1/userguide/command_line_interface.html#sec:command_line_warnings
Execution optimizations have been disabled for 1 invalid unit(s) of work during this build to ensure correctness.
Please consult deprecation warnings for more details.
BUILD FAILED in 47m 53s
119 actionable tasks: 77 executed, 38 from cache, 4 up-to-date
A build scan cannot be produced as an error occurred spooling the build data.
Please report this problem via https://gradle.com/help/plugin and include the following via copy/paste:
----------
Gradle version: 7.5.1
Plugin version: 3.4.1
java.lang.IllegalStateException: Could not close the event spooler due to previous errors.
at com.gradle.scan.plugin.internal.f.c.c.a(SourceFile:128)
at com.gradle.scan.plugin.internal.q.a$a.a(SourceFile:31)
at com.gradle.scan.plugin.internal.q.a$a.a(SourceFile:20)
at com.gradle.scan.plugin.internal.q.a.c(SourceFile:67)
----------
Build step 'Invoke Gradle script' changed build result to FAILURE
Build step 'Invoke Gradle script' marked build as failure
---------------------------------------------------------------------
To unsubscribe, e-mail: builds-unsubscribe@beam.apache.org
For additional commands, e-mail: builds-help@beam.apache.org
Build failed in Jenkins: beam_PostCommit_Java_PVR_Spark_Batch #1624
Posted by Apache Jenkins Server <je...@builds.apache.org>.
See <https://ci-beam.apache.org/job/beam_PostCommit_Java_PVR_Spark_Batch/1624/display/redirect>
Changes:
------------------------------------------
[...truncated 184.17 KB...]
java.io.IOException: No space left on device
com.esotericsoftware.kryo.KryoException: java.io.IOException: No space left on device
at com.esotericsoftware.kryo.io.Output.flush(Output.java:165)
at com.esotericsoftware.kryo.io.Output.require(Output.java:142)
at com.esotericsoftware.kryo.io.Output.writeBoolean(Output.java:613)
at org.gradle.internal.serialize.kryo.KryoBackedEncoder.writeBoolean(KryoBackedEncoder.java:73)
at org.gradle.api.internal.tasks.testing.junit.result.TestOutputStore$Writer.onOutput(TestOutputStore.java:107)
at org.gradle.api.internal.tasks.testing.junit.result.TestReportDataCollector.onOutput(TestReportDataCollector.java:152)
at sun.reflect.GeneratedMethodAccessor749.invoke(Unknown Source)
at sun.reflect.DelegatingMethodAccessorImpl.invoke(DelegatingMethodAccessorImpl.java:43)
at java.lang.reflect.Method.invoke(Method.java:498)
at org.gradle.internal.dispatch.ReflectionDispatch.dispatch(ReflectionDispatch.java:36)
at org.gradle.internal.dispatch.ReflectionDispatch.dispatch(ReflectionDispatch.java:24)
at org.gradle.internal.event.AbstractBroadcastDispatch.dispatch(AbstractBroadcastDispatch.java:43)
at org.gradle.internal.event.BroadcastDispatch$SingletonDispatch.dispatch(BroadcastDispatch.java:245)
at org.gradle.internal.event.BroadcastDispatch$SingletonDispatch.dispatch(BroadcastDispatch.java:157)
at org.gradle.internal.event.AbstractBroadcastDispatch.dispatch(AbstractBroadcastDispatch.java:61)
at org.gradle.internal.event.BroadcastDispatch$CompositeDispatch.dispatch(BroadcastDispatch.java:346)
at org.gradle.internal.event.BroadcastDispatch$CompositeDispatch.dispatch(BroadcastDispatch.java:249)
at org.gradle.internal.event.ListenerBroadcast.dispatch(ListenerBroadcast.java:141)
at org.gradle.internal.event.ListenerBroadcast.dispatch(ListenerBroadcast.java:37)
at org.gradle.internal.dispatch.ProxyDispatchAdapter$DispatchingInvocationHandler.invoke(ProxyDispatchAdapter.java:94)
at com.sun.proxy.$Proxy107.onOutput(Unknown Source)
at org.gradle.api.internal.tasks.testing.results.TestListenerAdapter.output(TestListenerAdapter.java:56)
at sun.reflect.GeneratedMethodAccessor748.invoke(Unknown Source)
at sun.reflect.DelegatingMethodAccessorImpl.invoke(DelegatingMethodAccessorImpl.java:43)
at java.lang.reflect.Method.invoke(Method.java:498)
at org.gradle.internal.dispatch.ReflectionDispatch.dispatch(ReflectionDispatch.java:36)
at org.gradle.internal.dispatch.ReflectionDispatch.dispatch(ReflectionDispatch.java:24)
at org.gradle.internal.event.AbstractBroadcastDispatch.dispatch(AbstractBroadcastDispatch.java:43)
at org.gradle.internal.event.BroadcastDispatch$SingletonDispatch.dispatch(BroadcastDispatch.java:245)
at org.gradle.internal.event.BroadcastDispatch$SingletonDispatch.dispatch(BroadcastDispatch.java:157)
at org.gradle.internal.event.AbstractBroadcastDispatch.dispatch(AbstractBroadcastDispatch.java:61)
at org.gradle.internal.event.BroadcastDispatch$CompositeDispatch.dispatch(BroadcastDispatch.java:346)
at org.gradle.internal.event.BroadcastDispatch$CompositeDispatch.dispatch(BroadcastDispatch.java:249)
at org.gradle.internal.event.ListenerBroadcast.dispatch(ListenerBroadcast.java:141)
at org.gradle.internal.event.ListenerBroadcast.dispatch(ListenerBroadcast.java:37)
at org.gradle.internal.dispatch.ProxyDispatchAdapter$DispatchingInvocationHandler.invoke(ProxyDispatchAdapter.java:94)
at com.sun.proxy.$Proxy108.output(Unknown Source)
at org.gradle.api.internal.tasks.testing.results.StateTrackingTestResultProcessor.output(StateTrackingTestResultProcessor.java:112)
at org.gradle.api.internal.tasks.testing.results.AttachParentTestResultProcessor.output(AttachParentTestResultProcessor.java:48)
at sun.reflect.GeneratedMethodAccessor751.invoke(Unknown Source)
at sun.reflect.DelegatingMethodAccessorImpl.invoke(DelegatingMethodAccessorImpl.java:43)
at java.lang.reflect.Method.invoke(Method.java:498)
at org.gradle.internal.dispatch.ReflectionDispatch.dispatch(ReflectionDispatch.java:36)
at org.gradle.internal.dispatch.ReflectionDispatch.dispatch(ReflectionDispatch.java:24)
at org.gradle.internal.dispatch.FailureHandlingDispatch.dispatch(FailureHandlingDispatch.java:30)
at org.gradle.internal.dispatch.AsyncDispatch.dispatchMessages(AsyncDispatch.java:87)
at org.gradle.internal.dispatch.AsyncDispatch.access$000(AsyncDispatch.java:36)
at org.gradle.internal.dispatch.AsyncDispatch$1.run(AsyncDispatch.java:71)
at org.gradle.internal.concurrent.InterruptibleRunnable.run(InterruptibleRunnable.java:42)
at org.gradle.internal.operations.CurrentBuildOperationPreservingRunnable.run(CurrentBuildOperationPreservingRunnable.java:42)
at org.gradle.internal.concurrent.ExecutorPolicy$CatchAndRecordFailures.onExecute(ExecutorPolicy.java:64)
at org.gradle.internal.concurrent.ManagedExecutorImpl$1.run(ManagedExecutorImpl.java:48)
at java.util.concurrent.ThreadPoolExecutor.runWorker(ThreadPoolExecutor.java:1149)
at java.util.concurrent.ThreadPoolExecutor$Worker.run(ThreadPoolExecutor.java:624)
at java.lang.Thread.run(Thread.java:750)
Caused by: java.io.IOException: No space left on device
at java.io.FileOutputStream.writeBytes(Native Method)
at java.io.FileOutputStream.write(FileOutputStream.java:326)
at com.esotericsoftware.kryo.io.Output.flush(Output.java:163)
... 54 more
java.io.IOException: No space left on device
com.esotericsoftware.kryo.KryoException: java.io.IOException: No space left on device
at com.esotericsoftware.kryo.io.Output.flush(Output.java:165)
at com.esotericsoftware.kryo.io.Output.require(Output.java:142)
at com.esotericsoftware.kryo.io.Output.writeBoolean(Output.java:613)
at org.gradle.internal.serialize.kryo.KryoBackedEncoder.writeBoolean(KryoBackedEncoder.java:73)
at org.gradle.api.internal.tasks.testing.junit.result.TestOutputStore$Writer.onOutput(TestOutputStore.java:107)
at org.gradle.api.internal.tasks.testing.junit.result.TestReportDataCollector.onOutput(TestReportDataCollector.java:152)
at sun.reflect.GeneratedMethodAccessor749.invoke(Unknown Source)
at sun.reflect.DelegatingMethodAccessorImpl.invoke(DelegatingMethodAccessorImpl.java:43)
at java.lang.reflect.Method.invoke(Method.java:498)
at org.gradle.internal.dispatch.ReflectionDispatch.dispatch(ReflectionDispatch.java:36)
at org.gradle.internal.dispatch.ReflectionDispatch.dispatch(ReflectionDispatch.java:24)
at org.gradle.internal.event.AbstractBroadcastDispatch.dispatch(AbstractBroadcastDispatch.java:43)
at org.gradle.internal.event.BroadcastDispatch$SingletonDispatch.dispatch(BroadcastDispatch.java:245)
at org.gradle.internal.event.BroadcastDispatch$SingletonDispatch.dispatch(BroadcastDispatch.java:157)
at org.gradle.internal.event.AbstractBroadcastDispatch.dispatch(AbstractBroadcastDispatch.java:61)
at org.gradle.internal.event.BroadcastDispatch$CompositeDispatch.dispatch(BroadcastDispatch.java:346)
at org.gradle.internal.event.BroadcastDispatch$CompositeDispatch.dispatch(BroadcastDispatch.java:249)
at org.gradle.internal.event.ListenerBroadcast.dispatch(ListenerBroadcast.java:141)
at org.gradle.internal.event.ListenerBroadcast.dispatch(ListenerBroadcast.java:37)
at org.gradle.internal.dispatch.ProxyDispatchAdapter$DispatchingInvocationHandler.invoke(ProxyDispatchAdapter.java:94)
at com.sun.proxy.$Proxy107.onOutput(Unknown Source)
at org.gradle.api.internal.tasks.testing.results.TestListenerAdapter.output(TestListenerAdapter.java:56)
at sun.reflect.GeneratedMethodAccessor748.invoke(Unknown Source)
at sun.reflect.DelegatingMethodAccessorImpl.invoke(DelegatingMethodAccessorImpl.java:43)
at java.lang.reflect.Method.invoke(Method.java:498)
at org.gradle.internal.dispatch.ReflectionDispatch.dispatch(ReflectionDispatch.java:36)
at org.gradle.internal.dispatch.ReflectionDispatch.dispatch(ReflectionDispatch.java:24)
at org.gradle.internal.event.AbstractBroadcastDispatch.dispatch(AbstractBroadcastDispatch.java:43)
at org.gradle.internal.event.BroadcastDispatch$SingletonDispatch.dispatch(BroadcastDispatch.java:245)
at org.gradle.internal.event.BroadcastDispatch$SingletonDispatch.dispatch(BroadcastDispatch.java:157)
at org.gradle.internal.event.AbstractBroadcastDispatch.dispatch(AbstractBroadcastDispatch.java:61)
at org.gradle.internal.event.BroadcastDispatch$CompositeDispatch.dispatch(BroadcastDispatch.java:346)
at org.gradle.internal.event.BroadcastDispatch$CompositeDispatch.dispatch(BroadcastDispatch.java:249)
at org.gradle.internal.event.ListenerBroadcast.dispatch(ListenerBroadcast.java:141)
at org.gradle.internal.event.ListenerBroadcast.dispatch(ListenerBroadcast.java:37)
at org.gradle.internal.dispatch.ProxyDispatchAdapter$DispatchingInvocationHandler.invoke(ProxyDispatchAdapter.java:94)
at com.sun.proxy.$Proxy108.output(Unknown Source)
at org.gradle.api.internal.tasks.testing.results.StateTrackingTestResultProcessor.output(StateTrackingTestResultProcessor.java:112)
at org.gradle.api.internal.tasks.testing.results.AttachParentTestResultProcessor.output(AttachParentTestResultProcessor.java:48)
at sun.reflect.GeneratedMethodAccessor751.invoke(Unknown Source)
at sun.reflect.DelegatingMethodAccessorImpl.invoke(DelegatingMethodAccessorImpl.java:43)
at java.lang.reflect.Method.invoke(Method.java:498)
at org.gradle.internal.dispatch.ReflectionDispatch.dispatch(ReflectionDispatch.java:36)
at org.gradle.internal.dispatch.ReflectionDispatch.dispatch(ReflectionDispatch.java:24)
at org.gradle.internal.dispatch.FailureHandlingDispatch.dispatch(FailureHandlingDispatch.java:30)
at org.gradle.internal.dispatch.AsyncDispatch.dispatchMessages(AsyncDispatch.java:87)
at org.gradle.internal.dispatch.AsyncDispatch.access$000(AsyncDispatch.java:36)
at org.gradle.internal.dispatch.AsyncDispatch$1.run(AsyncDispatch.java:71)
at org.gradle.internal.concurrent.InterruptibleRunnable.run(InterruptibleRunnable.java:42)
at org.gradle.internal.operations.CurrentBuildOperationPreservingRunnable.run(CurrentBuildOperationPreservingRunnable.java:42)
at org.gradle.internal.concurrent.ExecutorPolicy$CatchAndRecordFailures.onExecute(ExecutorPolicy.java:64)
at org.gradle.internal.concurrent.ManagedExecutorImpl$1.run(ManagedExecutorImpl.java:48)
at java.util.concurrent.ThreadPoolExecutor.runWorker(ThreadPoolExecutor.java:1149)
at java.util.concurrent.ThreadPoolExecutor$Worker.run(ThreadPoolExecutor.java:624)
at java.lang.Thread.run(Thread.java:750)
Caused by: java.io.IOException: No space left on device
at java.io.FileOutputStream.writeBytes(Native Method)
at java.io.FileOutputStream.write(FileOutputStream.java:326)
at com.esotericsoftware.kryo.io.Output.flush(Output.java:163)
... 54 more
java.io.IOException: No space left on device
com.esotericsoftware.kryo.KryoException: java.io.IOException: No space left on device
at com.esotericsoftware.kryo.io.Output.flush(Output.java:165)
at com.esotericsoftware.kryo.io.Output.require(Output.java:142)
at com.esotericsoftware.kryo.io.Output.writeBoolean(Output.java:613)
at org.gradle.internal.serialize.kryo.KryoBackedEncoder.writeBoolean(KryoBackedEncoder.java:73)
at org.gradle.api.internal.tasks.testing.junit.result.TestOutputStore$Writer.onOutput(TestOutputStore.java:107)
at org.gradle.api.internal.tasks.testing.junit.result.TestReportDataCollector.onOutput(TestReportDataCollector.java:152)
at sun.reflect.GeneratedMethodAccessor749.invoke(Unknown Source)
at sun.reflect.DelegatingMethodAccessorImpl.invoke(DelegatingMethodAccessorImpl.java:43)
at java.lang.reflect.Method.invoke(Method.java:498)
at org.gradle.internal.dispatch.ReflectionDispatch.dispatch(ReflectionDispatch.java:36)
at org.gradle.internal.dispatch.ReflectionDispatch.dispatch(ReflectionDispatch.java:24)
at org.gradle.internal.event.AbstractBroadcastDispatch.dispatch(AbstractBroadcastDispatch.java:43)
at org.gradle.internal.event.BroadcastDispatch$SingletonDispatch.dispatch(BroadcastDispatch.java:245)
at org.gradle.internal.event.BroadcastDispatch$SingletonDispatch.dispatch(BroadcastDispatch.java:157)
at org.gradle.internal.event.AbstractBroadcastDispatch.dispatch(AbstractBroadcastDispatch.java:61)
at org.gradle.internal.event.BroadcastDispatch$CompositeDispatch.dispatch(BroadcastDispatch.java:346)
at org.gradle.internal.event.BroadcastDispatch$CompositeDispatch.dispatch(BroadcastDispatch.java:249)
at org.gradle.internal.event.ListenerBroadcast.dispatch(ListenerBroadcast.java:141)
at org.gradle.internal.event.ListenerBroadcast.dispatch(ListenerBroadcast.java:37)
at org.gradle.internal.dispatch.ProxyDispatchAdapter$DispatchingInvocationHandler.invoke(ProxyDispatchAdapter.java:94)
at com.sun.proxy.$Proxy107.onOutput(Unknown Source)
at org.gradle.api.internal.tasks.testing.results.TestListenerAdapter.output(TestListenerAdapter.java:56)
at sun.reflect.GeneratedMethodAccessor748.invoke(Unknown Source)
at sun.reflect.DelegatingMethodAccessorImpl.invoke(DelegatingMethodAccessorImpl.java:43)
at java.lang.reflect.Method.invoke(Method.java:498)
at org.gradle.internal.dispatch.ReflectionDispatch.dispatch(ReflectionDispatch.java:36)
at org.gradle.internal.dispatch.ReflectionDispatch.dispatch(ReflectionDispatch.java:24)
at org.gradle.internal.event.AbstractBroadcastDispatch.dispatch(AbstractBroadcastDispatch.java:43)
at org.gradle.internal.event.BroadcastDispatch$SingletonDispatch.dispatch(BroadcastDispatch.java:245)
at org.gradle.internal.event.BroadcastDispatch$SingletonDispatch.dispatch(BroadcastDispatch.java:157)
at org.gradle.internal.event.AbstractBroadcastDispatch.dispatch(AbstractBroadcastDispatch.java:61)
at org.gradle.internal.event.BroadcastDispatch$CompositeDispatch.dispatch(BroadcastDispatch.java:346)
at org.gradle.internal.event.BroadcastDispatch$CompositeDispatch.dispatch(BroadcastDispatch.java:249)
at org.gradle.internal.event.ListenerBroadcast.dispatch(ListenerBroadcast.java:141)
at org.gradle.internal.event.ListenerBroadcast.dispatch(ListenerBroadcast.java:37)
at org.gradle.internal.dispatch.ProxyDispatchAdapter$DispatchingInvocationHandler.invoke(ProxyDispatchAdapter.java:94)
at com.sun.proxy.$Proxy108.output(Unknown Source)
at org.gradle.api.internal.tasks.testing.results.StateTrackingTestResultProcessor.output(StateTrackingTestResultProcessor.java:112)
at org.gradle.api.internal.tasks.testing.results.AttachParentTestResultProcessor.output(AttachParentTestResultProcessor.java:48)
at sun.reflect.GeneratedMethodAccessor751.invoke(Unknown Source)
at sun.reflect.DelegatingMethodAccessorImpl.invoke(DelegatingMethodAccessorImpl.java:43)
at java.lang.reflect.Method.invoke(Method.java:498)
at org.gradle.internal.dispatch.ReflectionDispatch.dispatch(ReflectionDispatch.java:36)
at org.gradle.internal.dispatch.ReflectionDispatch.dispatch(ReflectionDispatch.java:24)
at org.gradle.internal.dispatch.FailureHandlingDispatch.dispatch(FailureHandlingDispatch.java:30)
at org.gradle.internal.dispatch.AsyncDispatch.dispatchMessages(AsyncDispatch.java:87)
at org.gradle.internal.dispatch.AsyncDispatch.access$000(AsyncDispatch.java:36)
at org.gradle.internal.dispatch.AsyncDispatch$1.run(AsyncDispatch.java:71)
at org.gradle.internal.concurrent.InterruptibleRunnable.run(InterruptibleRunnable.java:42)
at org.gradle.internal.operations.CurrentBuildOperationPreservingRunnable.run(CurrentBuildOperationPreservingRunnable.java:42)
at org.gradle.internal.concurrent.ExecutorPolicy$CatchAndRecordFailures.onExecute(ExecutorPolicy.java:64)
at org.gradle.internal.concurrent.ManagedExecutorImpl$1.run(ManagedExecutorImpl.java:48)
at java.util.concurrent.ThreadPoolExecutor.runWorker(ThreadPoolExecutor.java:1149)
at java.util.concurrent.ThreadPoolExecutor$Worker.run(ThreadPoolExecutor.java:624)
at java.lang.Thread.run(Thread.java:750)
Caused by: java.io.IOException: No space left on device
at java.io.FileOutputStream.writeBytes(Native Method)
at java.io.FileOutputStream.write(FileOutputStream.java:326)
at com.esotericsoftware.kryo.io.Output.flush(Output.java:163)
... 54 more
org.apache.beam.runners.core.metrics.MetricsPusherTest > pushesSystemMetrics FAILED
java.lang.RuntimeException at MetricsPusherTest.java:91
[shutdown-hook-0] INFO org.apache.spark.util.ShutdownHookManager - Shutdown hook called
[shutdown-hook-0] INFO org.apache.spark.util.ShutdownHookManager - Deleting directory /tmp/spark-4900e2cc-ad29-4ceb-aaff-8682ec85ca0f
229 tests completed, 2 failed, 1 skipped
> Task :runners:spark:2:job-server:validatesPortableRunnerBatch FAILED
> Task :runners:spark:2:job-server:validatesPortableRunnerDocker FROM-CACHE
> Task :runners:spark:3:job-server:validatesPortableRunnerBatch
[shutdown-hook-0] INFO org.apache.spark.util.ShutdownHookManager - Shutdown hook called
[shutdown-hook-0] INFO org.apache.spark.util.ShutdownHookManager - Deleting directory /tmp/spark-8d64c4e5-1bcb-4a15-815d-7a16dcff36ab
229 tests completed, 1 failed, 1 skipped
> Task :runners:spark:3:job-server:validatesPortableRunnerBatch FAILED
> Task :runners:spark:3:job-server:validatesPortableRunnerDocker FROM-CACHE
FAILURE: Build completed with 2 failures.
1: Task failed with an exception.
-----------
* What went wrong:
Execution failed for task ':runners:spark:2:job-server:validatesPortableRunnerBatch'.
> java.io.IOException: No space left on device
* Try:
> Run with --stacktrace option to get the stack trace.
> Run with --info or --debug option to get more log output.
==============================================================================
2: Task failed with an exception.
-----------
* What went wrong:
Execution failed for task ':runners:spark:3:job-server:validatesPortableRunnerBatch'.
> There were failing tests. See the report at: file://<https://ci-beam.apache.org/job/beam_PostCommit_Java_PVR_Spark_Batch/ws/src/runners/spark/3/job-server/build/reports/tests/validatesPortableRunnerBatch/index.html>
* Try:
> Run with --stacktrace option to get the stack trace.
> Run with --info or --debug option to get more log output.
==============================================================================
* Get more help at https://help.gradle.org
Deprecated Gradle features were used in this build, making it incompatible with Gradle 8.0.
You can use '--warning-mode all' to show the individual deprecation warnings and determine if they come from your own scripts or plugins.
See https://docs.gradle.org/7.5.1/userguide/command_line_interface.html#sec:command_line_warnings
Execution optimizations have been disabled for 1 invalid unit(s) of work during this build to ensure correctness.
Please consult deprecation warnings for more details.
BUILD FAILED in 2h 28m 8s
119 actionable tasks: 77 executed, 38 from cache, 4 up-to-date
Publishing build scan...
https://gradle.com/s/vuuw67ugqa3w2
Build step 'Invoke Gradle script' changed build result to FAILURE
Build step 'Invoke Gradle script' marked build as failure
---------------------------------------------------------------------
To unsubscribe, e-mail: builds-unsubscribe@beam.apache.org
For additional commands, e-mail: builds-help@beam.apache.org
Build failed in Jenkins: beam_PostCommit_Java_PVR_Spark_Batch #1623
Posted by Apache Jenkins Server <je...@builds.apache.org>.
See <https://ci-beam.apache.org/job/beam_PostCommit_Java_PVR_Spark_Batch/1623/display/redirect>
Changes:
------------------------------------------
[...truncated 192.96 KB...]
type_payload: "\n\254\001/tmp/beam-artifact-staging/34a3bb8da4e320976e8a0abee8561e8e34e91005d2722d39e71ed4b320e5bb47/345-EMBEDDED-accessors-smart-1.2-DHwmXWL8AHEk3DK5EzbpxCcmUdYpvF-hpOTjvHWOsuQ.jar"
role_urn: "beam:artifact:role:staging_to:v1"
role_payload: "\nCaccessors-smart-1.2-DHwmXWL8AHEk3DK5EzbpxCcmUdYpvF-hpOTjvHWOsuQ.jar"
}
dependencies {
type_urn: "beam:artifact:type:file:v1"
type_payload: "\n\242\001/tmp/beam-artifact-staging/34a3bb8da4e320976e8a0abee8561e8e34e91005d2722d39e71ed4b320e5bb47/346-EMBEDDED-asm-5.0.4-iWYY7YrmJwJSGni8e-QrfEkaCOaSChX4mj7N7DHpoiA.jar"
role_urn: "beam:artifact:role:staging_to:v1"
role_payload: "\n9asm-5.0.4-iWYY7YrmJwJSGni8e-QrfEkaCOaSChX4mj7N7DHpoiA.jar"
}
dependencies {
type_urn: "beam:artifact:type:file:v1"
type_payload: "\n\242\001/tmp/beam-artifact-staging/34a3bb8da4e320976e8a0abee8561e8e34e91005d2722d39e71ed4b320e5bb47/347-EMBEDDED-ST4-4.0.8-WMqrxAyfdLC1mT_YaOD2SlDAdZCU5qJRqq-tmO38ejs.jar"
role_urn: "beam:artifact:role:staging_to:v1"
role_payload: "\n9ST4-4.0.8-WMqrxAyfdLC1mT_YaOD2SlDAdZCU5qJRqq-tmO38ejs.jar"
}
dependencies {
type_urn: "beam:artifact:type:file:v1"
type_payload: "\n\254\001/tmp/beam-artifact-staging/34a3bb8da4e320976e8a0abee8561e8e34e91005d2722d39e71ed4b320e5bb47/348-EMBEDDED-antlr-runtime-3.5.2-zj_I7LEPOemjzdy7LONQ0nLZzT0LHhjm_nPDuTichzQ.jar"
role_urn: "beam:artifact:role:staging_to:v1"
role_payload: "\nCantlr-runtime-3.5.2-zj_I7LEPOemjzdy7LONQ0nLZzT0LHhjm_nPDuTichzQ.jar"
}
dependencies {
type_urn: "beam:artifact:type:file:v1"
type_payload: "\n\257\001/tmp/beam-artifact-staging/34a3bb8da4e320976e8a0abee8561e8e34e91005d2722d39e71ed4b320e5bb47/349-EMBEDDED-hadoop-apache2-3.2.0-1-utOlhQMw_MZxskVG0O3_tp_lQEfNFCpS6pyHz3TPVKA.jar"
role_urn: "beam:artifact:role:staging_to:v1"
role_payload: "\nFhadoop-apache2-3.2.0-1-utOlhQMw_MZxskVG0O3_tp_lQEfNFCpS6pyHz3TPVKA.jar"
}
dependencies {
type_urn: "beam:artifact:type:file:v1"
type_payload: "\n\262\001/tmp/beam-artifact-staging/34a3bb8da4e320976e8a0abee8561e8e34e91005d2722d39e71ed4b320e5bb47/350-EMBEDDED-checker-compat-qual-2.5.3-12ua_qYcfAgpCAI_DLwUJ_q5q9LfkVyLij56UJvMvG0.jar"
role_urn: "beam:artifact:role:staging_to:v1"
role_payload: "\nIchecker-compat-qual-2.5.3-12ua_qYcfAgpCAI_DLwUJ_q5q9LfkVyLij56UJvMvG0.jar"
}
dependencies {
type_urn: "beam:artifact:type:file:v1"
type_payload: "\n\250\001/tmp/beam-artifact-staging/34a3bb8da4e320976e8a0abee8561e8e34e91005d2722d39e71ed4b320e5bb47/351-EMBEDDED-disruptor-3.4.2-9BLsuyNcJGC0XmNYQQlyPeqNlLgZx4yb_Dj1DLqFRsA.jar"
role_urn: "beam:artifact:role:staging_to:v1"
role_payload: "\n?disruptor-3.4.2-9BLsuyNcJGC0XmNYQQlyPeqNlLgZx4yb_Dj1DLqFRsA.jar"
}
dependencies {
type_urn: "beam:artifact:type:file:v1"
type_payload: "\n\254\001/tmp/beam-artifact-staging/34a3bb8da4e320976e8a0abee8561e8e34e91005d2722d39e71ed4b320e5bb47/352-EMBEDDED-annotations-4.1.1.4-unNOHoTAnWFa9qCdMwNLTwRC-Hct7BIO-zdthqVlrhU.jar"
role_urn: "beam:artifact:role:staging_to:v1"
role_payload: "\nCannotations-4.1.1.4-unNOHoTAnWFa9qCdMwNLTwRC-Hct7BIO-zdthqVlrhU.jar"
}
dependencies {
type_urn: "beam:artifact:type:file:v1"
type_payload: "\n\270\001/tmp/beam-artifact-staging/34a3bb8da4e320976e8a0abee8561e8e34e91005d2722d39e71ed4b320e5bb47/353-EMBEDDED-animal-sniffer-annotations-1.22-8lt6jhYLEwXqcfxhqD-XUEA90jrE3cbcsEkC8EqT8Qc.jar"
role_urn: "beam:artifact:role:staging_to:v1"
role_payload: "\nOanimal-sniffer-annotations-1.22-8lt6jhYLEwXqcfxhqD-XUEA90jrE3cbcsEkC8EqT8Qc.jar"
}
dependencies {
type_urn: "beam:artifact:type:file:v1"
type_payload: "\n\254\001/tmp/beam-artifact-staging/34a3bb8da4e320976e8a0abee8561e8e34e91005d2722d39e71ed4b320e5bb47/354-EMBEDDED-perfmark-api-0.26.0-t9I-k6NFN84zJwgmmg0UBHiKW14ZSegvVTX85Rs-qVs.jar"
role_urn: "beam:artifact:role:staging_to:v1"
role_payload: "\nCperfmark-api-0.26.0-t9I-k6NFN84zJwgmmg0UBHiKW14ZSegvVTX85Rs-qVs.jar"
}
dependencies {
type_urn: "beam:artifact:type:file:v1"
type_payload: "\n\251\001/tmp/beam-artifact-staging/34a3bb8da4e320976e8a0abee8561e8e34e91005d2722d39e71ed4b320e5bb47/355-EMBEDDED-threetenbp-1.6.5-slUWBMDWUWQo4wZSE7dEYSQDeKB2IiAaN60yY47LQXw.jar"
role_urn: "beam:artifact:role:staging_to:v1"
role_payload: "\n@threetenbp-1.6.5-slUWBMDWUWQo4wZSE7dEYSQDeKB2IiAaN60yY47LQXw.jar"
}
dependencies {
type_urn: "beam:artifact:type:file:v1"
type_payload: "\n\245\001/tmp/beam-artifact-staging/34a3bb8da4e320976e8a0abee8561e8e34e91005d2722d39e71ed4b320e5bb47/356-EMBEDDED-okhttp-2.7.5-iKyf0btR-CvMZkzB65wiXJDcQ4nWYCMbTMc3vr_n0Ko.jar"
role_urn: "beam:artifact:role:staging_to:v1"
role_payload: "\n<okhttp-2.7.5-iKyf0btR-CvMZkzB65wiXJDcQ4nWYCMbTMc3vr_n0Ko.jar"
}
dependencies {
type_urn: "beam:artifact:type:file:v1"
type_payload: "\n\265\001/tmp/beam-artifact-staging/34a3bb8da4e320976e8a0abee8561e8e34e91005d2722d39e71ed4b320e5bb47/357-EMBEDDED-aopalliance-repackaged-2.6.1-utd_knjXU0BjYK-eR0e9mzFhVU6pzT1iQRoK4fLBQf0.jar"
role_urn: "beam:artifact:role:staging_to:v1"
role_payload: "\nLaopalliance-repackaged-2.6.1-utd_knjXU0BjYK-eR0e9mzFhVU6pzT1iQRoK4fLBQf0.jar"
}
dependencies {
type_urn: "beam:artifact:type:file:v1"
type_payload: "\n\261\001/tmp/beam-artifact-staging/34a3bb8da4e320976e8a0abee8561e8e34e91005d2722d39e71ed4b320e5bb47/358-EMBEDDED-servlet-api-2.5-20081211-BodWCWmW_gD2BKw7ZnLW9mPcd36kqDBW4kDQRW535HI.jar"
role_urn: "beam:artifact:role:staging_to:v1"
role_payload: "\nHservlet-api-2.5-20081211-BodWCWmW_gD2BKw7ZnLW9mPcd36kqDBW4kDQRW535HI.jar"
}
dependencies {
type_urn: "beam:artifact:type:file:v1"
type_payload: "\n\263\001/tmp/beam-artifact-staging/34a3bb8da4e320976e8a0abee8561e8e34e91005d2722d39e71ed4b320e5bb47/359-EMBEDDED-jakarta.xml.bind-api-2.3.3-wEU59HLppt0MdoXqgtZ3KCJpq457rKLhRQDjgeDGzsU.jar"
role_urn: "beam:artifact:role:staging_to:v1"
role_payload: "\nJjakarta.xml.bind-api-2.3.3-wEU59HLppt0MdoXqgtZ3KCJpq457rKLhRQDjgeDGzsU.jar"
}
dependencies {
type_urn: "beam:artifact:type:file:v1"
type_payload: "\n\261\001/tmp/beam-artifact-staging/34a3bb8da4e320976e8a0abee8561e8e34e91005d2722d39e71ed4b320e5bb47/360-EMBEDDED-jakarta.activation-1.2.2-AhVnc-SunQSNFKVq011kS-6fEFKnkdBy3z3tPGVubho.jar"
role_urn: "beam:artifact:role:staging_to:v1"
role_payload: "\nHjakarta.activation-1.2.2-AhVnc-SunQSNFKVq011kS-6fEFKnkdBy3z3tPGVubho.jar"
}
dependencies {
type_urn: "beam:artifact:type:file:v1"
type_payload: "\n\257\001/tmp/beam-artifact-staging/34a3bb8da4e320976e8a0abee8561e8e34e91005d2722d39e71ed4b320e5bb47/361-EMBEDDED-jcip-annotations-1.0-1-T8z_g4Kq_FiZYsTtsmL2qlleNPHhHmEFfRxqluj8cyM.jar"
role_urn: "beam:artifact:role:staging_to:v1"
role_payload: "\nFjcip-annotations-1.0-1-T8z_g4Kq_FiZYsTtsmL2qlleNPHhHmEFfRxqluj8cyM.jar"
}
dependencies {
type_urn: "beam:artifact:type:file:v1"
type_payload: "\n\252\001/tmp/beam-artifact-staging/34a3bb8da4e320976e8a0abee8561e8e34e91005d2722d39e71ed4b320e5bb47/362-EMBEDDED-spring-jcl-5.3.18-V2mq4Oat3Y9fWcus0bBjXYGYUeZrrsT859bB-tH6344.jar"
role_urn: "beam:artifact:role:staging_to:v1"
role_payload: "\nAspring-jcl-5.3.18-V2mq4Oat3Y9fWcus0bBjXYGYUeZrrsT859bB-tH6344.jar"
}
dependencies {
type_urn: "beam:artifact:type:file:v1"
type_payload: "\n\270\001/tmp/beam-artifact-staging/34a3bb8da4e320976e8a0abee8561e8e34e91005d2722d39e71ed4b320e5bb47/363-EMBEDDED-org.abego.treelayout.core-1.0.3--l4xOVw5wufUasoPgfcgYJMWB7L6Qb02A46yy2-5MyY.jar"
role_urn: "beam:artifact:role:staging_to:v1"
role_payload: "\nOorg.abego.treelayout.core-1.0.3--l4xOVw5wufUasoPgfcgYJMWB7L6Qb02A46yy2-5MyY.jar"
}
dependencies {
type_urn: "beam:artifact:type:file:v1"
type_payload: "\n\251\001/tmp/beam-artifact-staging/34a3bb8da4e320976e8a0abee8561e8e34e91005d2722d39e71ed4b320e5bb47/364-EMBEDDED-javax.json-1.0.4-Dh3sQKHt6WWUElHtqWiu7gUsxPUDeLwxbMSOgVm9vrQ.jar"
role_urn: "beam:artifact:role:staging_to:v1"
role_payload: "\n@javax.json-1.0.4-Dh3sQKHt6WWUElHtqWiu7gUsxPUDeLwxbMSOgVm9vrQ.jar"
}
dependencies {
type_urn: "beam:artifact:type:file:v1"
type_payload: "\n\243\001/tmp/beam-artifact-staging/34a3bb8da4e320976e8a0abee8561e8e34e91005d2722d39e71ed4b320e5bb47/365-EMBEDDED-icu4j-58.2-lT4eg7K-fD6i-I2obBNhT0fp5x01eMhSHX8Yd1a2OWI.jar"
role_urn: "beam:artifact:role:staging_to:v1"
role_payload: "\n:icu4j-58.2-lT4eg7K-fD6i-I2obBNhT0fp5x01eMhSHX8Yd1a2OWI.jar"
}
dependencies {
type_urn: "beam:artifact:type:file:v1"
type_payload: "\n\252\001/tmp/beam-artifact-staging/34a3bb8da4e320976e8a0abee8561e8e34e91005d2722d39e71ed4b320e5bb47/366-EMBEDDED-auto-value-1.10.1-6ngBDYLv2y-Rmxb67Z5kJ_B9KZihXE9hnNxqYWTs0zY.jar"
role_urn: "beam:artifact:role:staging_to:v1"
role_payload: "\nAauto-value-1.10.1-6ngBDYLv2y-Rmxb67Z5kJ_B9KZihXE9hnNxqYWTs0zY.jar"
}
dependencies {
type_urn: "beam:artifact:type:file:v1"
type_payload: "\n\263\001/tmp/beam-artifact-staging/34a3bb8da4e320976e8a0abee8561e8e34e91005d2722d39e71ed4b320e5bb47/367-EMBEDDED-javax.annotation-api-1.3.2-4EulGVvNVV3JVlD3zGFNFR5LzVLSmhC4qiGX86uJq5s.jar"
role_urn: "beam:artifact:role:staging_to:v1"
role_payload: "\nJjavax.annotation-api-1.3.2-4EulGVvNVV3JVlD3zGFNFR5LzVLSmhC4qiGX86uJq5s.jar"
}
dependencies {
type_urn: "beam:artifact:type:file:v1"
type_payload: "\n\243\001/tmp/beam-artifact-staging/34a3bb8da4e320976e8a0abee8561e8e34e91005d2722d39e71ed4b320e5bb47/368-EMBEDDED-okio-1.6.0-EUvcH0czimi8vJWr8vXNxyvu7JGBLy_Ne1IcGTeHYmY.jar"
role_urn: "beam:artifact:role:staging_to:v1"
role_payload: "\n:okio-1.6.0-EUvcH0czimi8vJWr8vXNxyvu7JGBLy_Ne1IcGTeHYmY.jar"
}
dependencies {
type_urn: "beam:artifact:type:file:v1"
type_payload: "\n\247\001/tmp/beam-artifact-staging/34a3bb8da4e320976e8a0abee8561e8e34e91005d2722d39e71ed4b320e5bb47/369-EMBEDDED-stax-api-1.0-2-6McOvXb5gslYKoLvgs9s4Up9WKSk3KXLe3_JiMgAibc.jar"
role_urn: "beam:artifact:role:staging_to:v1"
role_payload: "\n>stax-api-1.0-2-6McOvXb5gslYKoLvgs9s4Up9WKSk3KXLe3_JiMgAibc.jar"
}
dependencies {
type_urn: "beam:artifact:type:file:v1"
type_payload: "\n\242\001/tmp/beam-artifact-staging/34a3bb8da4e320976e8a0abee8561e8e34e91005d2722d39e71ed4b320e5bb47/370-EMBEDDED-guice-3.0-GlnQQh_9NVzAtwtC3xwumvdEyKLQyS2jefX8ovB_HSI.jar"
role_urn: "beam:artifact:role:staging_to:v1"
role_payload: "\n9guice-3.0-GlnQQh_9NVzAtwtC3xwumvdEyKLQyS2jefX8ovB_HSI.jar"
}
dependencies {
type_urn: "beam:artifact:type:file:v1"
type_payload: "\n\275\001/tmp/beam-artifact-staging/34a3bb8da4e320976e8a0abee8561e8e34e91005d2722d39e71ed4b320e5bb47/371-EMBEDDED-geronimo-jcache_1.0_spec-1.0-alpha-1-AHChLlj0kblXGTkTJSmaYpRTDubDziXlC9yYsLcAlmw.jar"
role_urn: "beam:artifact:role:staging_to:v1"
role_payload: "\nTgeronimo-jcache_1.0_spec-1.0-alpha-1-AHChLlj0kblXGTkTJSmaYpRTDubDziXlC9yYsLcAlmw.jar"
}
dependencies {
type_urn: "beam:artifact:type:file:v1"
type_payload: "\n\256\001/tmp/beam-artifact-staging/34a3bb8da4e320976e8a0abee8561e8e34e91005d2722d39e71ed4b320e5bb47/372-EMBEDDED-mssql-jdbc-6.2.1.jre7-nPollFCuNHHS5uLD2K78ziNuPa74s3NNIdyTw6W76AY.jar"
role_urn: "beam:artifact:role:staging_to:v1"
role_payload: "\nEmssql-jdbc-6.2.1.jre7-nPollFCuNHHS5uLD2K78ziNuPa74s3NNIdyTw6W76AY.jar"
}
dependencies {
type_urn: "beam:artifact:type:file:v1"
type_payload: "\n\247\001/tmp/beam-artifact-staging/34a3bb8da4e320976e8a0abee8561e8e34e91005d2722d39e71ed4b320e5bb47/373-EMBEDDED-javax.inject-1-kcdwRKUMSBY2wy2Rb9ickRinIZU5BFLIEGUID5V95_8.jar"
role_urn: "beam:artifact:role:staging_to:v1"
role_payload: "\n>javax.inject-1-kcdwRKUMSBY2wy2Rb9ickRinIZU5BFLIEGUID5V95_8.jar"
}
dependencies {
type_urn: "beam:artifact:type:file:v1"
type_payload: "\n\250\001/tmp/beam-artifact-staging/34a3bb8da4e320976e8a0abee8561e8e34e91005d2722d39e71ed4b320e5bb47/374-EMBEDDED-aopalliance-1.0-Ct3sZw_tzT8RPFyAkdeDKA0j9146y4QbYanNsHk3agg.jar"
role_urn: "beam:artifact:role:staging_to:v1"
role_payload: "\n?aopalliance-1.0-Ct3sZw_tzT8RPFyAkdeDKA0j9146y4QbYanNsHk3agg.jar"
}
dependencies {
type_urn: "beam:artifact:type:file:v1"
type_payload: "\n\256\001/tmp/beam-artifact-staging/34a3bb8da4e320976e8a0abee8561e8e34e91005d2722d39e71ed4b320e5bb47/375-EMBEDDED-cglib-2.2.1-v20090111-QuHfsmvsvxpjPyW0fjn8xCK4XnfkwEaNmkT4hfX6C-I.jar"
role_urn: "beam:artifact:role:staging_to:v1"
role_payload: "\nEcglib-2.2.1-v20090111-QuHfsmvsvxpjPyW0fjn8xCK4XnfkwEaNmkT4hfX6C-I.jar"
}
[ScheduledExecutor-thread] WARN org.apache.beam.sdk.fn.data.BeamFnDataGrpcMultiplexer - Hanged up for unknown endpoint.
[grpc-default-executor-150] ERROR org.apache.beam.sdk.fn.data.BeamFnDataGrpcMultiplexer - Failed to handle for url: "InProcessServer_568"
org.apache.beam.vendor.grpc.v1p48p1.io.grpc.StatusRuntimeException: CANCELLED: Multiplexer hanging up
at org.apache.beam.vendor.grpc.v1p48p1.io.grpc.Status.asRuntimeException(Status.java:535)
at org.apache.beam.vendor.grpc.v1p48p1.io.grpc.stub.ClientCalls$StreamObserverToCallListenerAdapter.onClose(ClientCalls.java:487)
at org.apache.beam.vendor.grpc.v1p48p1.io.grpc.internal.ClientCallImpl.closeObserver(ClientCallImpl.java:562)
at org.apache.beam.vendor.grpc.v1p48p1.io.grpc.internal.ClientCallImpl.access$300(ClientCallImpl.java:70)
at org.apache.beam.vendor.grpc.v1p48p1.io.grpc.internal.ClientCallImpl$ClientStreamListenerImpl$1StreamClosed.runInternal(ClientCallImpl.java:743)
at org.apache.beam.vendor.grpc.v1p48p1.io.grpc.internal.ClientCallImpl$ClientStreamListenerImpl$1StreamClosed.runInContext(ClientCallImpl.java:722)
at org.apache.beam.vendor.grpc.v1p48p1.io.grpc.internal.ContextRunnable.run(ContextRunnable.java:37)
at org.apache.beam.vendor.grpc.v1p48p1.io.grpc.internal.SerializingExecutor.run(SerializingExecutor.java:133)
at java.util.concurrent.ThreadPoolExecutor.runWorker(ThreadPoolExecutor.java:1149)
at java.util.concurrent.ThreadPoolExecutor$Worker.run(ThreadPoolExecutor.java:624)
at java.lang.Thread.run(Thread.java:750)
229 tests completed, 1 failed, 1 skipped
> Task :runners:spark:3:job-server:validatesPortableRunnerBatch FAILED
> Task :runners:spark:3:job-server:validatesPortableRunnerDocker FROM-CACHE
FAILURE: Build completed with 2 failures.
1: Task failed with an exception.
-----------
* What went wrong:
Execution failed for task ':runners:spark:2:job-server:validatesPortableRunnerBatch'.
> There were failing tests. See the report at: file://<https://ci-beam.apache.org/job/beam_PostCommit_Java_PVR_Spark_Batch/ws/src/runners/spark/2/job-server/build/reports/tests/validatesPortableRunnerBatch/index.html>
* Try:
> Run with --stacktrace option to get the stack trace.
> Run with --info or --debug option to get more log output.
==============================================================================
2: Task failed with an exception.
-----------
* What went wrong:
Execution failed for task ':runners:spark:3:job-server:validatesPortableRunnerBatch'.
> There were failing tests. See the report at: file://<https://ci-beam.apache.org/job/beam_PostCommit_Java_PVR_Spark_Batch/ws/src/runners/spark/3/job-server/build/reports/tests/validatesPortableRunnerBatch/index.html>
* Try:
> Run with --stacktrace option to get the stack trace.
> Run with --info or --debug option to get more log output.
==============================================================================
* Get more help at https://help.gradle.org
Deprecated Gradle features were used in this build, making it incompatible with Gradle 8.0.
You can use '--warning-mode all' to show the individual deprecation warnings and determine if they come from your own scripts or plugins.
See https://docs.gradle.org/7.5.1/userguide/command_line_interface.html#sec:command_line_warnings
Execution optimizations have been disabled for 1 invalid unit(s) of work during this build to ensure correctness.
Please consult deprecation warnings for more details.
BUILD FAILED in 2h 10m 21s
119 actionable tasks: 77 executed, 38 from cache, 4 up-to-date
Publishing build scan...
https://gradle.com/s/giful5vjpigu2
Build step 'Invoke Gradle script' changed build result to FAILURE
Build step 'Invoke Gradle script' marked build as failure
---------------------------------------------------------------------
To unsubscribe, e-mail: builds-unsubscribe@beam.apache.org
For additional commands, e-mail: builds-help@beam.apache.org
Build failed in Jenkins: beam_PostCommit_Java_PVR_Spark_Batch #1622
Posted by Apache Jenkins Server <je...@builds.apache.org>.
See <https://ci-beam.apache.org/job/beam_PostCommit_Java_PVR_Spark_Batch/1622/display/redirect?page=changes>
Changes:
[noreply] Clarify llm download/loading instructions (#25145)
------------------------------------------
[...truncated 43.31 MB...]
at org.gradle.internal.event.BroadcastDispatch$CompositeDispatch.dispatch(BroadcastDispatch.java:346)
at org.gradle.internal.event.BroadcastDispatch$CompositeDispatch.dispatch(BroadcastDispatch.java:249)
at org.gradle.internal.event.ListenerBroadcast.dispatch(ListenerBroadcast.java:141)
at org.gradle.internal.event.ListenerBroadcast.dispatch(ListenerBroadcast.java:37)
at org.gradle.internal.dispatch.ProxyDispatchAdapter$DispatchingInvocationHandler.invoke(ProxyDispatchAdapter.java:94)
at com.sun.proxy.$Proxy107.onOutput(Unknown Source)
at org.gradle.api.internal.tasks.testing.results.TestListenerAdapter.output(TestListenerAdapter.java:56)
at sun.reflect.GeneratedMethodAccessor755.invoke(Unknown Source)
at sun.reflect.DelegatingMethodAccessorImpl.invoke(DelegatingMethodAccessorImpl.java:43)
at java.lang.reflect.Method.invoke(Method.java:498)
at org.gradle.internal.dispatch.ReflectionDispatch.dispatch(ReflectionDispatch.java:36)
at org.gradle.internal.dispatch.ReflectionDispatch.dispatch(ReflectionDispatch.java:24)
at org.gradle.internal.event.AbstractBroadcastDispatch.dispatch(AbstractBroadcastDispatch.java:43)
at org.gradle.internal.event.BroadcastDispatch$SingletonDispatch.dispatch(BroadcastDispatch.java:245)
at org.gradle.internal.event.BroadcastDispatch$SingletonDispatch.dispatch(BroadcastDispatch.java:157)
at org.gradle.internal.event.AbstractBroadcastDispatch.dispatch(AbstractBroadcastDispatch.java:61)
at org.gradle.internal.event.BroadcastDispatch$CompositeDispatch.dispatch(BroadcastDispatch.java:346)
at org.gradle.internal.event.BroadcastDispatch$CompositeDispatch.dispatch(BroadcastDispatch.java:249)
at org.gradle.internal.event.ListenerBroadcast.dispatch(ListenerBroadcast.java:141)
at org.gradle.internal.event.ListenerBroadcast.dispatch(ListenerBroadcast.java:37)
at org.gradle.internal.dispatch.ProxyDispatchAdapter$DispatchingInvocationHandler.invoke(ProxyDispatchAdapter.java:94)
at com.sun.proxy.$Proxy108.output(Unknown Source)
at org.gradle.api.internal.tasks.testing.results.StateTrackingTestResultProcessor.output(StateTrackingTestResultProcessor.java:112)
at org.gradle.api.internal.tasks.testing.results.AttachParentTestResultProcessor.output(AttachParentTestResultProcessor.java:48)
at sun.reflect.GeneratedMethodAccessor765.invoke(Unknown Source)
at sun.reflect.DelegatingMethodAccessorImpl.invoke(DelegatingMethodAccessorImpl.java:43)
at java.lang.reflect.Method.invoke(Method.java:498)
at org.gradle.internal.dispatch.ReflectionDispatch.dispatch(ReflectionDispatch.java:36)
at org.gradle.internal.dispatch.ReflectionDispatch.dispatch(ReflectionDispatch.java:24)
at org.gradle.internal.dispatch.FailureHandlingDispatch.dispatch(FailureHandlingDispatch.java:30)
at org.gradle.internal.dispatch.AsyncDispatch.dispatchMessages(AsyncDispatch.java:87)
at org.gradle.internal.dispatch.AsyncDispatch.access$000(AsyncDispatch.java:36)
at org.gradle.internal.dispatch.AsyncDispatch$1.run(AsyncDispatch.java:71)
at org.gradle.internal.concurrent.InterruptibleRunnable.run(InterruptibleRunnable.java:42)
at org.gradle.internal.operations.CurrentBuildOperationPreservingRunnable.run(CurrentBuildOperationPreservingRunnable.java:42)
at org.gradle.internal.concurrent.ExecutorPolicy$CatchAndRecordFailures.onExecute(ExecutorPolicy.java:64)
at org.gradle.internal.concurrent.ManagedExecutorImpl$1.run(ManagedExecutorImpl.java:48)
at java.util.concurrent.ThreadPoolExecutor.runWorker(ThreadPoolExecutor.java:1149)
at java.util.concurrent.ThreadPoolExecutor$Worker.run(ThreadPoolExecutor.java:624)
at java.lang.Thread.run(Thread.java:750)
Caused by: java.io.IOException: No space left on device
at java.io.FileOutputStream.writeBytes(Native Method)
at java.io.FileOutputStream.write(FileOutputStream.java:326)
at com.esotericsoftware.kryo.io.Output.flush(Output.java:163)
... 54 more
java.io.IOException: No space left on device
com.esotericsoftware.kryo.KryoException: java.io.IOException: No space left on device
at com.esotericsoftware.kryo.io.Output.flush(Output.java:165)
at com.esotericsoftware.kryo.io.Output.require(Output.java:142)
at com.esotericsoftware.kryo.io.Output.writeBoolean(Output.java:613)
at org.gradle.internal.serialize.kryo.KryoBackedEncoder.writeBoolean(KryoBackedEncoder.java:73)
at org.gradle.api.internal.tasks.testing.junit.result.TestOutputStore$Writer.onOutput(TestOutputStore.java:107)
at org.gradle.api.internal.tasks.testing.junit.result.TestReportDataCollector.onOutput(TestReportDataCollector.java:152)
at sun.reflect.GeneratedMethodAccessor763.invoke(Unknown Source)
at sun.reflect.DelegatingMethodAccessorImpl.invoke(DelegatingMethodAccessorImpl.java:43)
at java.lang.reflect.Method.invoke(Method.java:498)
at org.gradle.internal.dispatch.ReflectionDispatch.dispatch(ReflectionDispatch.java:36)
at org.gradle.internal.dispatch.ReflectionDispatch.dispatch(ReflectionDispatch.java:24)
at org.gradle.internal.event.AbstractBroadcastDispatch.dispatch(AbstractBroadcastDispatch.java:43)
at org.gradle.internal.event.BroadcastDispatch$SingletonDispatch.dispatch(BroadcastDispatch.java:245)
at org.gradle.internal.event.BroadcastDispatch$SingletonDispatch.dispatch(BroadcastDispatch.java:157)
at org.gradle.internal.event.AbstractBroadcastDispatch.dispatch(AbstractBroadcastDispatch.java:61)
at org.gradle.internal.event.BroadcastDispatch$CompositeDispatch.dispatch(BroadcastDispatch.java:346)
at org.gradle.internal.event.BroadcastDispatch$CompositeDispatch.dispatch(BroadcastDispatch.java:249)
at org.gradle.internal.event.ListenerBroadcast.dispatch(ListenerBroadcast.java:141)
at org.gradle.internal.event.ListenerBroadcast.dispatch(ListenerBroadcast.java:37)
at org.gradle.internal.dispatch.ProxyDispatchAdapter$DispatchingInvocationHandler.invoke(ProxyDispatchAdapter.java:94)
at com.sun.proxy.$Proxy107.onOutput(Unknown Source)
at org.gradle.api.internal.tasks.testing.results.TestListenerAdapter.output(TestListenerAdapter.java:56)
at sun.reflect.GeneratedMethodAccessor755.invoke(Unknown Source)
at sun.reflect.DelegatingMethodAccessorImpl.invoke(DelegatingMethodAccessorImpl.java:43)
at java.lang.reflect.Method.invoke(Method.java:498)
at org.gradle.internal.dispatch.ReflectionDispatch.dispatch(ReflectionDispatch.java:36)
at org.gradle.internal.dispatch.ReflectionDispatch.dispatch(ReflectionDispatch.java:24)
at org.gradle.internal.event.AbstractBroadcastDispatch.dispatch(AbstractBroadcastDispatch.java:43)
at org.gradle.internal.event.BroadcastDispatch$SingletonDispatch.dispatch(BroadcastDispatch.java:245)
at org.gradle.internal.event.BroadcastDispatch$SingletonDispatch.dispatch(BroadcastDispatch.java:157)
at org.gradle.internal.event.AbstractBroadcastDispatch.dispatch(AbstractBroadcastDispatch.java:61)
at org.gradle.internal.event.BroadcastDispatch$CompositeDispatch.dispatch(BroadcastDispatch.java:346)
at org.gradle.internal.event.BroadcastDispatch$CompositeDispatch.dispatch(BroadcastDispatch.java:249)
at org.gradle.internal.event.ListenerBroadcast.dispatch(ListenerBroadcast.java:141)
at org.gradle.internal.event.ListenerBroadcast.dispatch(ListenerBroadcast.java:37)
at org.gradle.internal.dispatch.ProxyDispatchAdapter$DispatchingInvocationHandler.invoke(ProxyDispatchAdapter.java:94)
at com.sun.proxy.$Proxy108.output(Unknown Source)
at org.gradle.api.internal.tasks.testing.results.StateTrackingTestResultProcessor.output(StateTrackingTestResultProcessor.java:112)
at org.gradle.api.internal.tasks.testing.results.AttachParentTestResultProcessor.output(AttachParentTestResultProcessor.java:48)
at sun.reflect.GeneratedMethodAccessor765.invoke(Unknown Source)
at sun.reflect.DelegatingMethodAccessorImpl.invoke(DelegatingMethodAccessorImpl.java:43)
at java.lang.reflect.Method.invoke(Method.java:498)
at org.gradle.internal.dispatch.ReflectionDispatch.dispatch(ReflectionDispatch.java:36)
at org.gradle.internal.dispatch.ReflectionDispatch.dispatch(ReflectionDispatch.java:24)
at org.gradle.internal.dispatch.FailureHandlingDispatch.dispatch(FailureHandlingDispatch.java:30)
at org.gradle.internal.dispatch.AsyncDispatch.dispatchMessages(AsyncDispatch.java:87)
at org.gradle.internal.dispatch.AsyncDispatch.access$000(AsyncDispatch.java:36)
at org.gradle.internal.dispatch.AsyncDispatch$1.run(AsyncDispatch.java:71)
at org.gradle.internal.concurrent.InterruptibleRunnable.run(InterruptibleRunnable.java:42)
at org.gradle.internal.operations.CurrentBuildOperationPreservingRunnable.run(CurrentBuildOperationPreservingRunnable.java:42)
at org.gradle.internal.concurrent.ExecutorPolicy$CatchAndRecordFailures.onExecute(ExecutorPolicy.java:64)
at org.gradle.internal.concurrent.ManagedExecutorImpl$1.run(ManagedExecutorImpl.java:48)
at java.util.concurrent.ThreadPoolExecutor.runWorker(ThreadPoolExecutor.java:1149)
at java.util.concurrent.ThreadPoolExecutor$Worker.run(ThreadPoolExecutor.java:624)
at java.lang.Thread.run(Thread.java:750)
Caused by: java.io.IOException: No space left on device
at java.io.FileOutputStream.writeBytes(Native Method)
at java.io.FileOutputStream.write(FileOutputStream.java:326)
at com.esotericsoftware.kryo.io.Output.flush(Output.java:163)
... 54 more
org.apache.beam.sdk.transforms.ViewTest > testSingletonSideInput FAILED
java.lang.RuntimeException at ViewTest.java:115
Caused by: java.util.concurrent.ExecutionException at ViewTest.java:115
Caused by: org.apache.beam.vendor.grpc.v1p48p1.io.grpc.StatusRuntimeException at Status.java:535
Could not stop org.gradle.internal.actor.internal.DefaultActorFactory$NonBlockingActor@73f97bd6.
org.gradle.internal.dispatch.DispatchException: Could not dispatch message [MethodInvocation method: output(4.136, org.gradle.api.internal.tasks.testing.DefaultTestOutputEvent@7d9e103e)].
at org.gradle.internal.dispatch.ExceptionTrackingFailureHandler.dispatchFailed(ExceptionTrackingFailureHandler.java:35)
at org.gradle.internal.dispatch.FailureHandlingDispatch.dispatch(FailureHandlingDispatch.java:32)
at org.gradle.internal.dispatch.AsyncDispatch.dispatchMessages(AsyncDispatch.java:87)
at org.gradle.internal.dispatch.AsyncDispatch.access$000(AsyncDispatch.java:36)
at org.gradle.internal.dispatch.AsyncDispatch$1.run(AsyncDispatch.java:71)
at org.gradle.internal.concurrent.InterruptibleRunnable.run(InterruptibleRunnable.java:42)
at org.gradle.internal.operations.CurrentBuildOperationPreservingRunnable.run(CurrentBuildOperationPreservingRunnable.java:42)
at org.gradle.internal.concurrent.ExecutorPolicy$CatchAndRecordFailures.onExecute(ExecutorPolicy.java:64)
at org.gradle.internal.concurrent.ManagedExecutorImpl$1.run(ManagedExecutorImpl.java:48)
at java.util.concurrent.ThreadPoolExecutor.runWorker(ThreadPoolExecutor.java:1149)
at java.util.concurrent.ThreadPoolExecutor$Worker.run(ThreadPoolExecutor.java:624)
at java.lang.Thread.run(Thread.java:750)
Caused by: com.esotericsoftware.kryo.KryoException: java.io.IOException: No space left on device
at com.esotericsoftware.kryo.io.Output.flush(Output.java:165)
at com.esotericsoftware.kryo.io.Output.require(Output.java:142)
at com.esotericsoftware.kryo.io.Output.writeBytes(Output.java:228)
at org.gradle.internal.serialize.kryo.KryoBackedEncoder.writeBytes(KryoBackedEncoder.java:48)
at org.gradle.api.internal.tasks.testing.junit.result.TestOutputStore$Writer.onOutput(TestOutputStore.java:118)
at org.gradle.api.internal.tasks.testing.junit.result.TestReportDataCollector.onOutput(TestReportDataCollector.java:152)
at sun.reflect.GeneratedMethodAccessor763.invoke(Unknown Source)
at sun.reflect.DelegatingMethodAccessorImpl.invoke(DelegatingMethodAccessorImpl.java:43)
at java.lang.reflect.Method.invoke(Method.java:498)
at org.gradle.internal.dispatch.ReflectionDispatch.dispatch(ReflectionDispatch.java:36)
at org.gradle.internal.dispatch.ReflectionDispatch.dispatch(ReflectionDispatch.java:24)
at org.gradle.internal.event.AbstractBroadcastDispatch.dispatch(AbstractBroadcastDispatch.java:43)
at org.gradle.internal.event.BroadcastDispatch$SingletonDispatch.dispatch(BroadcastDispatch.java:245)
at org.gradle.internal.event.BroadcastDispatch$SingletonDispatch.dispatch(BroadcastDispatch.java:157)
at org.gradle.internal.event.AbstractBroadcastDispatch.dispatch(AbstractBroadcastDispatch.java:61)
at org.gradle.internal.event.BroadcastDispatch$CompositeDispatch.dispatch(BroadcastDispatch.java:346)
at org.gradle.internal.event.BroadcastDispatch$CompositeDispatch.dispatch(BroadcastDispatch.java:249)
at org.gradle.internal.event.ListenerBroadcast.dispatch(ListenerBroadcast.java:141)
at org.gradle.internal.event.ListenerBroadcast.dispatch(ListenerBroadcast.java:37)
at org.gradle.internal.dispatch.ProxyDispatchAdapter$DispatchingInvocationHandler.invoke(ProxyDispatchAdapter.java:94)
at com.sun.proxy.$Proxy107.onOutput(Unknown Source)
at org.gradle.api.internal.tasks.testing.results.TestListenerAdapter.output(TestListenerAdapter.java:56)
at sun.reflect.GeneratedMethodAccessor755.invoke(Unknown Source)
at sun.reflect.DelegatingMethodAccessorImpl.invoke(DelegatingMethodAccessorImpl.java:43)
at java.lang.reflect.Method.invoke(Method.java:498)
at org.gradle.internal.dispatch.ReflectionDispatch.dispatch(ReflectionDispatch.java:36)
at org.gradle.internal.dispatch.ReflectionDispatch.dispatch(ReflectionDispatch.java:24)
at org.gradle.internal.event.AbstractBroadcastDispatch.dispatch(AbstractBroadcastDispatch.java:43)
at org.gradle.internal.event.BroadcastDispatch$SingletonDispatch.dispatch(BroadcastDispatch.java:245)
at org.gradle.internal.event.BroadcastDispatch$SingletonDispatch.dispatch(BroadcastDispatch.java:157)
at org.gradle.internal.event.AbstractBroadcastDispatch.dispatch(AbstractBroadcastDispatch.java:61)
at org.gradle.internal.event.BroadcastDispatch$CompositeDispatch.dispatch(BroadcastDispatch.java:346)
at org.gradle.internal.event.BroadcastDispatch$CompositeDispatch.dispatch(BroadcastDispatch.java:249)
at org.gradle.internal.event.ListenerBroadcast.dispatch(ListenerBroadcast.java:141)
at org.gradle.internal.event.ListenerBroadcast.dispatch(ListenerBroadcast.java:37)
at org.gradle.internal.dispatch.ProxyDispatchAdapter$DispatchingInvocationHandler.invoke(ProxyDispatchAdapter.java:94)
at com.sun.proxy.$Proxy108.output(Unknown Source)
at org.gradle.api.internal.tasks.testing.results.StateTrackingTestResultProcessor.output(StateTrackingTestResultProcessor.java:112)
at org.gradle.api.internal.tasks.testing.results.AttachParentTestResultProcessor.output(AttachParentTestResultProcessor.java:48)
at sun.reflect.GeneratedMethodAccessor765.invoke(Unknown Source)
at sun.reflect.DelegatingMethodAccessorImpl.invoke(DelegatingMethodAccessorImpl.java:43)
at java.lang.reflect.Method.invoke(Method.java:498)
at org.gradle.internal.dispatch.ReflectionDispatch.dispatch(ReflectionDispatch.java:36)
at org.gradle.internal.dispatch.ReflectionDispatch.dispatch(ReflectionDispatch.java:24)
at org.gradle.internal.dispatch.FailureHandlingDispatch.dispatch(FailureHandlingDispatch.java:30)
... 10 more
Caused by: java.io.IOException: No space left on device
at java.io.FileOutputStream.writeBytes(Native Method)
at java.io.FileOutputStream.write(FileOutputStream.java:326)
at com.esotericsoftware.kryo.io.Output.flush(Output.java:163)
... 54 more
228 tests completed, 20 failed, 2 skipped
> Task :runners:spark:3:job-server:validatesPortableRunnerBatch FAILED
> Task :runners:spark:3:job-server:validatesPortableRunnerDocker FROM-CACHE
> Task :runners:spark:2:job-server:validatesPortableRunnerBatch
[shutdown-hook-0] INFO org.apache.spark.util.ShutdownHookManager - Shutdown hook called
[shutdown-hook-0] INFO org.apache.spark.util.ShutdownHookManager - Deleting directory /tmp/spark-dbf322f6-ac42-41be-be47-20420192126b
229 tests completed, 17 failed, 1 skipped
> Task :runners:spark:2:job-server:validatesPortableRunnerBatch FAILED
> Task :runners:spark:2:job-server:validatesPortableRunnerDocker FROM-CACHE
FAILURE: Build completed with 2 failures.
1: Task failed with an exception.
-----------
* What went wrong:
Execution failed for task ':runners:spark:3:job-server:validatesPortableRunnerBatch'.
> Process 'Gradle Test Executor 4' finished with non-zero exit value 56
This problem might be caused by incorrect test process configuration.
Please refer to the test execution section in the User Manual at https://docs.gradle.org/7.5.1/userguide/java_testing.html#sec:test_execution
* Try:
> Run with --stacktrace option to get the stack trace.
> Run with --info or --debug option to get more log output.
==============================================================================
2: Task failed with an exception.
-----------
* What went wrong:
Execution failed for task ':runners:spark:2:job-server:validatesPortableRunnerBatch'.
> java.io.IOException: No space left on device
* Try:
> Run with --stacktrace option to get the stack trace.
> Run with --info or --debug option to get more log output.
==============================================================================
* Get more help at https://help.gradle.org
Deprecated Gradle features were used in this build, making it incompatible with Gradle 8.0.
You can use '--warning-mode all' to show the individual deprecation warnings and determine if they come from your own scripts or plugins.
See https://docs.gradle.org/7.5.1/userguide/command_line_interface.html#sec:command_line_warnings
Execution optimizations have been disabled for 1 invalid unit(s) of work during this build to ensure correctness.
Please consult deprecation warnings for more details.
BUILD FAILED in 1h 43m 8s
119 actionable tasks: 77 executed, 38 from cache, 4 up-to-date
A build scan cannot be produced as an error occurred spooling the build data.
Please report this problem via https://gradle.com/help/plugin and include the following via copy/paste:
----------
Gradle version: 7.5.1
Plugin version: 3.4.1
java.lang.IllegalStateException: Could not close the event spooler due to previous errors.
at com.gradle.scan.plugin.internal.f.c.c.a(SourceFile:128)
at com.gradle.scan.plugin.internal.q.a$a.a(SourceFile:31)
at com.gradle.scan.plugin.internal.q.a$a.a(SourceFile:20)
at com.gradle.scan.plugin.internal.q.a.c(SourceFile:67)
----------
Build step 'Invoke Gradle script' changed build result to FAILURE
Build step 'Invoke Gradle script' marked build as failure
---------------------------------------------------------------------
To unsubscribe, e-mail: builds-unsubscribe@beam.apache.org
For additional commands, e-mail: builds-help@beam.apache.org
Build failed in Jenkins: beam_PostCommit_Java_PVR_Spark_Batch #1621
Posted by Apache Jenkins Server <je...@builds.apache.org>.
See <https://ci-beam.apache.org/job/beam_PostCommit_Java_PVR_Spark_Batch/1621/display/redirect>
Changes:
------------------------------------------
[...truncated 35.47 MB...]
at com.esotericsoftware.kryo.io.Output.require(Output.java:142)
at com.esotericsoftware.kryo.io.Output.writeBoolean(Output.java:613)
at org.gradle.internal.serialize.kryo.KryoBackedEncoder.writeBoolean(KryoBackedEncoder.java:73)
at org.gradle.api.internal.tasks.testing.junit.result.TestOutputStore$Writer.onOutput(TestOutputStore.java:107)
at org.gradle.api.internal.tasks.testing.junit.result.TestReportDataCollector.onOutput(TestReportDataCollector.java:152)
at sun.reflect.GeneratedMethodAccessor753.invoke(Unknown Source)
at sun.reflect.DelegatingMethodAccessorImpl.invoke(DelegatingMethodAccessorImpl.java:43)
at java.lang.reflect.Method.invoke(Method.java:498)
at org.gradle.internal.dispatch.ReflectionDispatch.dispatch(ReflectionDispatch.java:36)
at org.gradle.internal.dispatch.ReflectionDispatch.dispatch(ReflectionDispatch.java:24)
at org.gradle.internal.event.AbstractBroadcastDispatch.dispatch(AbstractBroadcastDispatch.java:43)
at org.gradle.internal.event.BroadcastDispatch$SingletonDispatch.dispatch(BroadcastDispatch.java:245)
at org.gradle.internal.event.BroadcastDispatch$SingletonDispatch.dispatch(BroadcastDispatch.java:157)
at org.gradle.internal.event.AbstractBroadcastDispatch.dispatch(AbstractBroadcastDispatch.java:61)
at org.gradle.internal.event.BroadcastDispatch$CompositeDispatch.dispatch(BroadcastDispatch.java:346)
at org.gradle.internal.event.BroadcastDispatch$CompositeDispatch.dispatch(BroadcastDispatch.java:249)
at org.gradle.internal.event.ListenerBroadcast.dispatch(ListenerBroadcast.java:141)
at org.gradle.internal.event.ListenerBroadcast.dispatch(ListenerBroadcast.java:37)
at org.gradle.internal.dispatch.ProxyDispatchAdapter$DispatchingInvocationHandler.invoke(ProxyDispatchAdapter.java:94)
at com.sun.proxy.$Proxy107.onOutput(Unknown Source)
at org.gradle.api.internal.tasks.testing.results.TestListenerAdapter.output(TestListenerAdapter.java:56)
at sun.reflect.GeneratedMethodAccessor752.invoke(Unknown Source)
at sun.reflect.DelegatingMethodAccessorImpl.invoke(DelegatingMethodAccessorImpl.java:43)
at java.lang.reflect.Method.invoke(Method.java:498)
at org.gradle.internal.dispatch.ReflectionDispatch.dispatch(ReflectionDispatch.java:36)
at org.gradle.internal.dispatch.ReflectionDispatch.dispatch(ReflectionDispatch.java:24)
at org.gradle.internal.event.AbstractBroadcastDispatch.dispatch(AbstractBroadcastDispatch.java:43)
at org.gradle.internal.event.BroadcastDispatch$SingletonDispatch.dispatch(BroadcastDispatch.java:245)
at org.gradle.internal.event.BroadcastDispatch$SingletonDispatch.dispatch(BroadcastDispatch.java:157)
at org.gradle.internal.event.AbstractBroadcastDispatch.dispatch(AbstractBroadcastDispatch.java:61)
at org.gradle.internal.event.BroadcastDispatch$CompositeDispatch.dispatch(BroadcastDispatch.java:346)
at org.gradle.internal.event.BroadcastDispatch$CompositeDispatch.dispatch(BroadcastDispatch.java:249)
at org.gradle.internal.event.ListenerBroadcast.dispatch(ListenerBroadcast.java:141)
at org.gradle.internal.event.ListenerBroadcast.dispatch(ListenerBroadcast.java:37)
at org.gradle.internal.dispatch.ProxyDispatchAdapter$DispatchingInvocationHandler.invoke(ProxyDispatchAdapter.java:94)
at com.sun.proxy.$Proxy108.output(Unknown Source)
at org.gradle.api.internal.tasks.testing.results.StateTrackingTestResultProcessor.output(StateTrackingTestResultProcessor.java:112)
at org.gradle.api.internal.tasks.testing.results.AttachParentTestResultProcessor.output(AttachParentTestResultProcessor.java:48)
at sun.reflect.GeneratedMethodAccessor755.invoke(Unknown Source)
at sun.reflect.DelegatingMethodAccessorImpl.invoke(DelegatingMethodAccessorImpl.java:43)
at java.lang.reflect.Method.invoke(Method.java:498)
at org.gradle.internal.dispatch.ReflectionDispatch.dispatch(ReflectionDispatch.java:36)
at org.gradle.internal.dispatch.ReflectionDispatch.dispatch(ReflectionDispatch.java:24)
at org.gradle.internal.dispatch.FailureHandlingDispatch.dispatch(FailureHandlingDispatch.java:30)
at org.gradle.internal.dispatch.AsyncDispatch.dispatchMessages(AsyncDispatch.java:87)
at org.gradle.internal.dispatch.AsyncDispatch.access$000(AsyncDispatch.java:36)
at org.gradle.internal.dispatch.AsyncDispatch$1.run(AsyncDispatch.java:71)
at org.gradle.internal.concurrent.InterruptibleRunnable.run(InterruptibleRunnable.java:42)
at org.gradle.internal.operations.CurrentBuildOperationPreservingRunnable.run(CurrentBuildOperationPreservingRunnable.java:42)
at org.gradle.internal.concurrent.ExecutorPolicy$CatchAndRecordFailures.onExecute(ExecutorPolicy.java:64)
at org.gradle.internal.concurrent.ManagedExecutorImpl$1.run(ManagedExecutorImpl.java:48)
at java.util.concurrent.ThreadPoolExecutor.runWorker(ThreadPoolExecutor.java:1149)
at java.util.concurrent.ThreadPoolExecutor$Worker.run(ThreadPoolExecutor.java:624)
at java.lang.Thread.run(Thread.java:750)
Caused by: java.io.IOException: No space left on device
at java.io.FileOutputStream.writeBytes(Native Method)
at java.io.FileOutputStream.write(FileOutputStream.java:326)
at com.esotericsoftware.kryo.io.Output.flush(Output.java:163)
... 54 more
java.io.IOException: No space left on device
com.esotericsoftware.kryo.KryoException: java.io.IOException: No space left on device
at com.esotericsoftware.kryo.io.Output.flush(Output.java:165)
at com.esotericsoftware.kryo.io.Output.require(Output.java:142)
at com.esotericsoftware.kryo.io.Output.writeBoolean(Output.java:613)
at org.gradle.internal.serialize.kryo.KryoBackedEncoder.writeBoolean(KryoBackedEncoder.java:73)
at org.gradle.api.internal.tasks.testing.junit.result.TestOutputStore$Writer.onOutput(TestOutputStore.java:107)
at org.gradle.api.internal.tasks.testing.junit.result.TestReportDataCollector.onOutput(TestReportDataCollector.java:152)
at sun.reflect.GeneratedMethodAccessor753.invoke(Unknown Source)
at sun.reflect.DelegatingMethodAccessorImpl.invoke(DelegatingMethodAccessorImpl.java:43)
at java.lang.reflect.Method.invoke(Method.java:498)
at org.gradle.internal.dispatch.ReflectionDispatch.dispatch(ReflectionDispatch.java:36)
at org.gradle.internal.dispatch.ReflectionDispatch.dispatch(ReflectionDispatch.java:24)
at org.gradle.internal.event.AbstractBroadcastDispatch.dispatch(AbstractBroadcastDispatch.java:43)
at org.gradle.internal.event.BroadcastDispatch$SingletonDispatch.dispatch(BroadcastDispatch.java:245)
at org.gradle.internal.event.BroadcastDispatch$SingletonDispatch.dispatch(BroadcastDispatch.java:157)
at org.gradle.internal.event.AbstractBroadcastDispatch.dispatch(AbstractBroadcastDispatch.java:61)
at org.gradle.internal.event.BroadcastDispatch$CompositeDispatch.dispatch(BroadcastDispatch.java:346)
at org.gradle.internal.event.BroadcastDispatch$CompositeDispatch.dispatch(BroadcastDispatch.java:249)
at org.gradle.internal.event.ListenerBroadcast.dispatch(ListenerBroadcast.java:141)
at org.gradle.internal.event.ListenerBroadcast.dispatch(ListenerBroadcast.java:37)
at org.gradle.internal.dispatch.ProxyDispatchAdapter$DispatchingInvocationHandler.invoke(ProxyDispatchAdapter.java:94)
at com.sun.proxy.$Proxy107.onOutput(Unknown Source)
at org.gradle.api.internal.tasks.testing.results.TestListenerAdapter.output(TestListenerAdapter.java:56)
at sun.reflect.GeneratedMethodAccessor752.invoke(Unknown Source)
at sun.reflect.DelegatingMethodAccessorImpl.invoke(DelegatingMethodAccessorImpl.java:43)
at java.lang.reflect.Method.invoke(Method.java:498)
at org.gradle.internal.dispatch.ReflectionDispatch.dispatch(ReflectionDispatch.java:36)
at org.gradle.internal.dispatch.ReflectionDispatch.dispatch(ReflectionDispatch.java:24)
at org.gradle.internal.event.AbstractBroadcastDispatch.dispatch(AbstractBroadcastDispatch.java:43)
at org.gradle.internal.event.BroadcastDispatch$SingletonDispatch.dispatch(BroadcastDispatch.java:245)
at org.gradle.internal.event.BroadcastDispatch$SingletonDispatch.dispatch(BroadcastDispatch.java:157)
at org.gradle.internal.event.AbstractBroadcastDispatch.dispatch(AbstractBroadcastDispatch.java:61)
at org.gradle.internal.event.BroadcastDispatch$CompositeDispatch.dispatch(BroadcastDispatch.java:346)
at org.gradle.internal.event.BroadcastDispatch$CompositeDispatch.dispatch(BroadcastDispatch.java:249)
at org.gradle.internal.event.ListenerBroadcast.dispatch(ListenerBroadcast.java:141)
at org.gradle.internal.event.ListenerBroadcast.dispatch(ListenerBroadcast.java:37)
at org.gradle.internal.dispatch.ProxyDispatchAdapter$DispatchingInvocationHandler.invoke(ProxyDispatchAdapter.java:94)
at com.sun.proxy.$Proxy108.output(Unknown Source)
at org.gradle.api.internal.tasks.testing.results.StateTrackingTestResultProcessor.output(StateTrackingTestResultProcessor.java:112)
at org.gradle.api.internal.tasks.testing.results.AttachParentTestResultProcessor.output(AttachParentTestResultProcessor.java:48)
at sun.reflect.GeneratedMethodAccessor755.invoke(Unknown Source)
at sun.reflect.DelegatingMethodAccessorImpl.invoke(DelegatingMethodAccessorImpl.java:43)
at java.lang.reflect.Method.invoke(Method.java:498)
at org.gradle.internal.dispatch.ReflectionDispatch.dispatch(ReflectionDispatch.java:36)
at org.gradle.internal.dispatch.ReflectionDispatch.dispatch(ReflectionDispatch.java:24)
at org.gradle.internal.dispatch.FailureHandlingDispatch.dispatch(FailureHandlingDispatch.java:30)
at org.gradle.internal.dispatch.AsyncDispatch.dispatchMessages(AsyncDispatch.java:87)
at org.gradle.internal.dispatch.AsyncDispatch.access$000(AsyncDispatch.java:36)
at org.gradle.internal.dispatch.AsyncDispatch$1.run(AsyncDispatch.java:71)
at org.gradle.internal.concurrent.InterruptibleRunnable.run(InterruptibleRunnable.java:42)
at org.gradle.internal.operations.CurrentBuildOperationPreservingRunnable.run(CurrentBuildOperationPreservingRunnable.java:42)
at org.gradle.internal.concurrent.ExecutorPolicy$CatchAndRecordFailures.onExecute(ExecutorPolicy.java:64)
at org.gradle.internal.concurrent.ManagedExecutorImpl$1.run(ManagedExecutorImpl.java:48)
at java.util.concurrent.ThreadPoolExecutor.runWorker(ThreadPoolExecutor.java:1149)
at java.util.concurrent.ThreadPoolExecutor$Worker.run(ThreadPoolExecutor.java:624)
at java.lang.Thread.run(Thread.java:750)
Caused by: java.io.IOException: No space left on device
at java.io.FileOutputStream.writeBytes(Native Method)
at java.io.FileOutputStream.write(FileOutputStream.java:326)
at com.esotericsoftware.kryo.io.Output.flush(Output.java:163)
... 54 more
org.apache.beam.runners.core.metrics.MetricsPusherTest > pushesSystemMetrics FAILED
java.lang.RuntimeException at MetricsPusherTest.java:91
[shutdown-hook-0] ERROR org.apache.spark.util.Utils - Uncaught exception in thread shutdown-hook-0
java.lang.NullPointerException
at org.apache.spark.executor.Executor.$anonfun$stop$3(Executor.scala:332)
at scala.runtime.java8.JFunction0$mcV$sp.apply(JFunction0$mcV$sp.java:23)
at org.apache.spark.util.Utils$.withContextClassLoader(Utils.scala:222)
at org.apache.spark.executor.Executor.stop(Executor.scala:332)
at org.apache.spark.executor.Executor.$anonfun$new$2(Executor.scala:76)
at org.apache.spark.util.SparkShutdownHook.run(ShutdownHookManager.scala:214)
at org.apache.spark.util.SparkShutdownHookManager.$anonfun$runAll$2(ShutdownHookManager.scala:188)
at scala.runtime.java8.JFunction0$mcV$sp.apply(JFunction0$mcV$sp.java:23)
at org.apache.spark.util.Utils$.logUncaughtExceptions(Utils.scala:1996)
at org.apache.spark.util.SparkShutdownHookManager.$anonfun$runAll$1(ShutdownHookManager.scala:188)
at scala.runtime.java8.JFunction0$mcV$sp.apply(JFunction0$mcV$sp.java:23)
at scala.util.Try$.apply(Try.scala:213)
at org.apache.spark.util.SparkShutdownHookManager.runAll(ShutdownHookManager.scala:188)
at org.apache.spark.util.SparkShutdownHookManager$$anon$2.run(ShutdownHookManager.scala:178)
at java.util.concurrent.Executors$RunnableAdapter.call(Executors.java:511)
at java.util.concurrent.FutureTask.run(FutureTask.java:266)
at java.util.concurrent.ThreadPoolExecutor.runWorker(ThreadPoolExecutor.java:1149)
at java.util.concurrent.ThreadPoolExecutor$Worker.run(ThreadPoolExecutor.java:624)
at java.lang.Thread.run(Thread.java:750)
[shutdown-hook-0] ERROR org.apache.spark.util.Utils - Uncaught exception in thread shutdown-hook-0
java.lang.NullPointerException
at org.apache.spark.executor.Executor.$anonfun$stop$3(Executor.scala:332)
at scala.runtime.java8.JFunction0$mcV$sp.apply(JFunction0$mcV$sp.java:23)
at org.apache.spark.util.Utils$.withContextClassLoader(Utils.scala:222)
at org.apache.spark.executor.Executor.stop(Executor.scala:332)
at org.apache.spark.executor.Executor.$anonfun$new$2(Executor.scala:76)
at org.apache.spark.util.SparkShutdownHook.run(ShutdownHookManager.scala:214)
at org.apache.spark.util.SparkShutdownHookManager.$anonfun$runAll$2(ShutdownHookManager.scala:188)
at scala.runtime.java8.JFunction0$mcV$sp.apply(JFunction0$mcV$sp.java:23)
at org.apache.spark.util.Utils$.logUncaughtExceptions(Utils.scala:1996)
at org.apache.spark.util.SparkShutdownHookManager.$anonfun$runAll$1(ShutdownHookManager.scala:188)
at scala.runtime.java8.JFunction0$mcV$sp.apply(JFunction0$mcV$sp.java:23)
at scala.util.Try$.apply(Try.scala:213)
at org.apache.spark.util.SparkShutdownHookManager.runAll(ShutdownHookManager.scala:188)
at org.apache.spark.util.SparkShutdownHookManager$$anon$2.run(ShutdownHookManager.scala:178)
at java.util.concurrent.Executors$RunnableAdapter.call(Executors.java:511)
at java.util.concurrent.FutureTask.run(FutureTask.java:266)
at java.util.concurrent.ThreadPoolExecutor.runWorker(ThreadPoolExecutor.java:1149)
at java.util.concurrent.ThreadPoolExecutor$Worker.run(ThreadPoolExecutor.java:624)
at java.lang.Thread.run(Thread.java:750)
[shutdown-hook-0] ERROR org.apache.spark.util.Utils - Uncaught exception in thread shutdown-hook-0
java.lang.NullPointerException
at org.apache.spark.executor.Executor.$anonfun$stop$3(Executor.scala:332)
at scala.runtime.java8.JFunction0$mcV$sp.apply(JFunction0$mcV$sp.java:23)
at org.apache.spark.util.Utils$.withContextClassLoader(Utils.scala:222)
at org.apache.spark.executor.Executor.stop(Executor.scala:332)
at org.apache.spark.executor.Executor.$anonfun$new$2(Executor.scala:76)
at org.apache.spark.util.SparkShutdownHook.run(ShutdownHookManager.scala:214)
at org.apache.spark.util.SparkShutdownHookManager.$anonfun$runAll$2(ShutdownHookManager.scala:188)
at scala.runtime.java8.JFunction0$mcV$sp.apply(JFunction0$mcV$sp.java:23)
at org.apache.spark.util.Utils$.logUncaughtExceptions(Utils.scala:1996)
at org.apache.spark.util.SparkShutdownHookManager.$anonfun$runAll$1(ShutdownHookManager.scala:188)
at scala.runtime.java8.JFunction0$mcV$sp.apply(JFunction0$mcV$sp.java:23)
at scala.util.Try$.apply(Try.scala:213)
at org.apache.spark.util.SparkShutdownHookManager.runAll(ShutdownHookManager.scala:188)
at org.apache.spark.util.SparkShutdownHookManager$$anon$2.run(ShutdownHookManager.scala:178)
at java.util.concurrent.Executors$RunnableAdapter.call(Executors.java:511)
at java.util.concurrent.FutureTask.run(FutureTask.java:266)
at java.util.concurrent.ThreadPoolExecutor.runWorker(ThreadPoolExecutor.java:1149)
at java.util.concurrent.ThreadPoolExecutor$Worker.run(ThreadPoolExecutor.java:624)
at java.lang.Thread.run(Thread.java:750)
[shutdown-hook-0] INFO org.apache.spark.util.ShutdownHookManager - Shutdown hook called
[shutdown-hook-0] INFO org.apache.spark.util.ShutdownHookManager - Deleting directory /tmp/spark-31ee7d3c-1998-4fa5-a4db-d19b019439c3
229 tests completed, 6 failed, 1 skipped
> Task :runners:spark:3:job-server:validatesPortableRunnerBatch FAILED
> Task :runners:spark:3:job-server:validatesPortableRunnerDocker FROM-CACHE
FAILURE: Build completed with 2 failures.
1: Task failed with an exception.
-----------
* What went wrong:
Execution failed for task ':runners:spark:2:job-server:validatesPortableRunnerBatch'.
> java.io.IOException: No space left on device
* Try:
> Run with --stacktrace option to get the stack trace.
> Run with --info or --debug option to get more log output.
==============================================================================
2: Task failed with an exception.
-----------
* What went wrong:
Execution failed for task ':runners:spark:3:job-server:validatesPortableRunnerBatch'.
> java.io.IOException: No space left on device
* Try:
> Run with --stacktrace option to get the stack trace.
> Run with --info or --debug option to get more log output.
==============================================================================
* Get more help at https://help.gradle.org
Deprecated Gradle features were used in this build, making it incompatible with Gradle 8.0.
You can use '--warning-mode all' to show the individual deprecation warnings and determine if they come from your own scripts or plugins.
See https://docs.gradle.org/7.5.1/userguide/command_line_interface.html#sec:command_line_warnings
Execution optimizations have been disabled for 1 invalid unit(s) of work during this build to ensure correctness.
Please consult deprecation warnings for more details.
BUILD FAILED in 2h 14m 59s
119 actionable tasks: 77 executed, 38 from cache, 4 up-to-date
A build scan cannot be produced as an error occurred spooling the build data.
Please report this problem via https://gradle.com/help/plugin and include the following via copy/paste:
----------
Gradle version: 7.5.1
Plugin version: 3.4.1
java.lang.IllegalStateException: Could not close the event spooler due to previous errors.
at com.gradle.scan.plugin.internal.f.c.c.a(SourceFile:128)
at com.gradle.scan.plugin.internal.q.a$a.a(SourceFile:31)
at com.gradle.scan.plugin.internal.q.a$a.a(SourceFile:20)
at com.gradle.scan.plugin.internal.q.a.c(SourceFile:67)
----------
Build step 'Invoke Gradle script' changed build result to FAILURE
Build step 'Invoke Gradle script' marked build as failure
---------------------------------------------------------------------
To unsubscribe, e-mail: builds-unsubscribe@beam.apache.org
For additional commands, e-mail: builds-help@beam.apache.org
Build failed in Jenkins: beam_PostCommit_Java_PVR_Spark_Batch #1620
Posted by Apache Jenkins Server <je...@builds.apache.org>.
See <https://ci-beam.apache.org/job/beam_PostCommit_Java_PVR_Spark_Batch/1620/display/redirect>
Changes:
------------------------------------------
[...truncated 194.41 KB...]
type_payload: "\n\254\001/tmp/beam-artifact-staging/497da92a4ac5d09a1ec630dd147ff80eb9f700c8ee5f78647dd110382e8c727f/345-EMBEDDED-accessors-smart-1.2-DHwmXWL8AHEk3DK5EzbpxCcmUdYpvF-hpOTjvHWOsuQ.jar"
role_urn: "beam:artifact:role:staging_to:v1"
role_payload: "\nCaccessors-smart-1.2-DHwmXWL8AHEk3DK5EzbpxCcmUdYpvF-hpOTjvHWOsuQ.jar"
}
dependencies {
type_urn: "beam:artifact:type:file:v1"
type_payload: "\n\242\001/tmp/beam-artifact-staging/497da92a4ac5d09a1ec630dd147ff80eb9f700c8ee5f78647dd110382e8c727f/346-EMBEDDED-asm-5.0.4-iWYY7YrmJwJSGni8e-QrfEkaCOaSChX4mj7N7DHpoiA.jar"
role_urn: "beam:artifact:role:staging_to:v1"
role_payload: "\n9asm-5.0.4-iWYY7YrmJwJSGni8e-QrfEkaCOaSChX4mj7N7DHpoiA.jar"
}
dependencies {
type_urn: "beam:artifact:type:file:v1"
type_payload: "\n\242\001/tmp/beam-artifact-staging/497da92a4ac5d09a1ec630dd147ff80eb9f700c8ee5f78647dd110382e8c727f/347-EMBEDDED-ST4-4.0.8-WMqrxAyfdLC1mT_YaOD2SlDAdZCU5qJRqq-tmO38ejs.jar"
role_urn: "beam:artifact:role:staging_to:v1"
role_payload: "\n9ST4-4.0.8-WMqrxAyfdLC1mT_YaOD2SlDAdZCU5qJRqq-tmO38ejs.jar"
}
dependencies {
type_urn: "beam:artifact:type:file:v1"
type_payload: "\n\254\001/tmp/beam-artifact-staging/497da92a4ac5d09a1ec630dd147ff80eb9f700c8ee5f78647dd110382e8c727f/348-EMBEDDED-antlr-runtime-3.5.2-zj_I7LEPOemjzdy7LONQ0nLZzT0LHhjm_nPDuTichzQ.jar"
role_urn: "beam:artifact:role:staging_to:v1"
role_payload: "\nCantlr-runtime-3.5.2-zj_I7LEPOemjzdy7LONQ0nLZzT0LHhjm_nPDuTichzQ.jar"
}
dependencies {
type_urn: "beam:artifact:type:file:v1"
type_payload: "\n\257\001/tmp/beam-artifact-staging/497da92a4ac5d09a1ec630dd147ff80eb9f700c8ee5f78647dd110382e8c727f/349-EMBEDDED-hadoop-apache2-3.2.0-1-utOlhQMw_MZxskVG0O3_tp_lQEfNFCpS6pyHz3TPVKA.jar"
role_urn: "beam:artifact:role:staging_to:v1"
role_payload: "\nFhadoop-apache2-3.2.0-1-utOlhQMw_MZxskVG0O3_tp_lQEfNFCpS6pyHz3TPVKA.jar"
}
dependencies {
type_urn: "beam:artifact:type:file:v1"
type_payload: "\n\262\001/tmp/beam-artifact-staging/497da92a4ac5d09a1ec630dd147ff80eb9f700c8ee5f78647dd110382e8c727f/350-EMBEDDED-checker-compat-qual-2.5.3-12ua_qYcfAgpCAI_DLwUJ_q5q9LfkVyLij56UJvMvG0.jar"
role_urn: "beam:artifact:role:staging_to:v1"
role_payload: "\nIchecker-compat-qual-2.5.3-12ua_qYcfAgpCAI_DLwUJ_q5q9LfkVyLij56UJvMvG0.jar"
}
dependencies {
type_urn: "beam:artifact:type:file:v1"
type_payload: "\n\250\001/tmp/beam-artifact-staging/497da92a4ac5d09a1ec630dd147ff80eb9f700c8ee5f78647dd110382e8c727f/351-EMBEDDED-disruptor-3.4.2-9BLsuyNcJGC0XmNYQQlyPeqNlLgZx4yb_Dj1DLqFRsA.jar"
role_urn: "beam:artifact:role:staging_to:v1"
role_payload: "\n?disruptor-3.4.2-9BLsuyNcJGC0XmNYQQlyPeqNlLgZx4yb_Dj1DLqFRsA.jar"
}
dependencies {
type_urn: "beam:artifact:type:file:v1"
type_payload: "\n\254\001/tmp/beam-artifact-staging/497da92a4ac5d09a1ec630dd147ff80eb9f700c8ee5f78647dd110382e8c727f/352-EMBEDDED-annotations-4.1.1.4-unNOHoTAnWFa9qCdMwNLTwRC-Hct7BIO-zdthqVlrhU.jar"
role_urn: "beam:artifact:role:staging_to:v1"
role_payload: "\nCannotations-4.1.1.4-unNOHoTAnWFa9qCdMwNLTwRC-Hct7BIO-zdthqVlrhU.jar"
}
dependencies {
type_urn: "beam:artifact:type:file:v1"
type_payload: "\n\270\001/tmp/beam-artifact-staging/497da92a4ac5d09a1ec630dd147ff80eb9f700c8ee5f78647dd110382e8c727f/353-EMBEDDED-animal-sniffer-annotations-1.22-8lt6jhYLEwXqcfxhqD-XUEA90jrE3cbcsEkC8EqT8Qc.jar"
role_urn: "beam:artifact:role:staging_to:v1"
role_payload: "\nOanimal-sniffer-annotations-1.22-8lt6jhYLEwXqcfxhqD-XUEA90jrE3cbcsEkC8EqT8Qc.jar"
}
dependencies {
type_urn: "beam:artifact:type:file:v1"
type_payload: "\n\254\001/tmp/beam-artifact-staging/497da92a4ac5d09a1ec630dd147ff80eb9f700c8ee5f78647dd110382e8c727f/354-EMBEDDED-perfmark-api-0.26.0-t9I-k6NFN84zJwgmmg0UBHiKW14ZSegvVTX85Rs-qVs.jar"
role_urn: "beam:artifact:role:staging_to:v1"
role_payload: "\nCperfmark-api-0.26.0-t9I-k6NFN84zJwgmmg0UBHiKW14ZSegvVTX85Rs-qVs.jar"
}
dependencies {
type_urn: "beam:artifact:type:file:v1"
type_payload: "\n\251\001/tmp/beam-artifact-staging/497da92a4ac5d09a1ec630dd147ff80eb9f700c8ee5f78647dd110382e8c727f/355-EMBEDDED-threetenbp-1.6.5-slUWBMDWUWQo4wZSE7dEYSQDeKB2IiAaN60yY47LQXw.jar"
role_urn: "beam:artifact:role:staging_to:v1"
role_payload: "\n@threetenbp-1.6.5-slUWBMDWUWQo4wZSE7dEYSQDeKB2IiAaN60yY47LQXw.jar"
}
dependencies {
type_urn: "beam:artifact:type:file:v1"
type_payload: "\n\245\001/tmp/beam-artifact-staging/497da92a4ac5d09a1ec630dd147ff80eb9f700c8ee5f78647dd110382e8c727f/356-EMBEDDED-okhttp-2.7.5-iKyf0btR-CvMZkzB65wiXJDcQ4nWYCMbTMc3vr_n0Ko.jar"
role_urn: "beam:artifact:role:staging_to:v1"
role_payload: "\n<okhttp-2.7.5-iKyf0btR-CvMZkzB65wiXJDcQ4nWYCMbTMc3vr_n0Ko.jar"
}
dependencies {
type_urn: "beam:artifact:type:file:v1"
type_payload: "\n\265\001/tmp/beam-artifact-staging/497da92a4ac5d09a1ec630dd147ff80eb9f700c8ee5f78647dd110382e8c727f/357-EMBEDDED-aopalliance-repackaged-2.6.1-utd_knjXU0BjYK-eR0e9mzFhVU6pzT1iQRoK4fLBQf0.jar"
role_urn: "beam:artifact:role:staging_to:v1"
role_payload: "\nLaopalliance-repackaged-2.6.1-utd_knjXU0BjYK-eR0e9mzFhVU6pzT1iQRoK4fLBQf0.jar"
}
dependencies {
type_urn: "beam:artifact:type:file:v1"
type_payload: "\n\261\001/tmp/beam-artifact-staging/497da92a4ac5d09a1ec630dd147ff80eb9f700c8ee5f78647dd110382e8c727f/358-EMBEDDED-servlet-api-2.5-20081211-BodWCWmW_gD2BKw7ZnLW9mPcd36kqDBW4kDQRW535HI.jar"
role_urn: "beam:artifact:role:staging_to:v1"
role_payload: "\nHservlet-api-2.5-20081211-BodWCWmW_gD2BKw7ZnLW9mPcd36kqDBW4kDQRW535HI.jar"
}
dependencies {
type_urn: "beam:artifact:type:file:v1"
type_payload: "\n\263\001/tmp/beam-artifact-staging/497da92a4ac5d09a1ec630dd147ff80eb9f700c8ee5f78647dd110382e8c727f/359-EMBEDDED-jakarta.xml.bind-api-2.3.3-wEU59HLppt0MdoXqgtZ3KCJpq457rKLhRQDjgeDGzsU.jar"
role_urn: "beam:artifact:role:staging_to:v1"
role_payload: "\nJjakarta.xml.bind-api-2.3.3-wEU59HLppt0MdoXqgtZ3KCJpq457rKLhRQDjgeDGzsU.jar"
}
dependencies {
type_urn: "beam:artifact:type:file:v1"
type_payload: "\n\261\001/tmp/beam-artifact-staging/497da92a4ac5d09a1ec630dd147ff80eb9f700c8ee5f78647dd110382e8c727f/360-EMBEDDED-jakarta.activation-1.2.2-AhVnc-SunQSNFKVq011kS-6fEFKnkdBy3z3tPGVubho.jar"
role_urn: "beam:artifact:role:staging_to:v1"
role_payload: "\nHjakarta.activation-1.2.2-AhVnc-SunQSNFKVq011kS-6fEFKnkdBy3z3tPGVubho.jar"
}
dependencies {
type_urn: "beam:artifact:type:file:v1"
type_payload: "\n\257\001/tmp/beam-artifact-staging/497da92a4ac5d09a1ec630dd147ff80eb9f700c8ee5f78647dd110382e8c727f/361-EMBEDDED-jcip-annotations-1.0-1-T8z_g4Kq_FiZYsTtsmL2qlleNPHhHmEFfRxqluj8cyM.jar"
role_urn: "beam:artifact:role:staging_to:v1"
role_payload: "\nFjcip-annotations-1.0-1-T8z_g4Kq_FiZYsTtsmL2qlleNPHhHmEFfRxqluj8cyM.jar"
}
dependencies {
type_urn: "beam:artifact:type:file:v1"
type_payload: "\n\252\001/tmp/beam-artifact-staging/497da92a4ac5d09a1ec630dd147ff80eb9f700c8ee5f78647dd110382e8c727f/362-EMBEDDED-spring-jcl-5.3.18-V2mq4Oat3Y9fWcus0bBjXYGYUeZrrsT859bB-tH6344.jar"
role_urn: "beam:artifact:role:staging_to:v1"
role_payload: "\nAspring-jcl-5.3.18-V2mq4Oat3Y9fWcus0bBjXYGYUeZrrsT859bB-tH6344.jar"
}
dependencies {
type_urn: "beam:artifact:type:file:v1"
type_payload: "\n\270\001/tmp/beam-artifact-staging/497da92a4ac5d09a1ec630dd147ff80eb9f700c8ee5f78647dd110382e8c727f/363-EMBEDDED-org.abego.treelayout.core-1.0.3--l4xOVw5wufUasoPgfcgYJMWB7L6Qb02A46yy2-5MyY.jar"
role_urn: "beam:artifact:role:staging_to:v1"
role_payload: "\nOorg.abego.treelayout.core-1.0.3--l4xOVw5wufUasoPgfcgYJMWB7L6Qb02A46yy2-5MyY.jar"
}
dependencies {
type_urn: "beam:artifact:type:file:v1"
type_payload: "\n\251\001/tmp/beam-artifact-staging/497da92a4ac5d09a1ec630dd147ff80eb9f700c8ee5f78647dd110382e8c727f/364-EMBEDDED-javax.json-1.0.4-Dh3sQKHt6WWUElHtqWiu7gUsxPUDeLwxbMSOgVm9vrQ.jar"
role_urn: "beam:artifact:role:staging_to:v1"
role_payload: "\n@javax.json-1.0.4-Dh3sQKHt6WWUElHtqWiu7gUsxPUDeLwxbMSOgVm9vrQ.jar"
}
dependencies {
type_urn: "beam:artifact:type:file:v1"
type_payload: "\n\243\001/tmp/beam-artifact-staging/497da92a4ac5d09a1ec630dd147ff80eb9f700c8ee5f78647dd110382e8c727f/365-EMBEDDED-icu4j-58.2-lT4eg7K-fD6i-I2obBNhT0fp5x01eMhSHX8Yd1a2OWI.jar"
role_urn: "beam:artifact:role:staging_to:v1"
role_payload: "\n:icu4j-58.2-lT4eg7K-fD6i-I2obBNhT0fp5x01eMhSHX8Yd1a2OWI.jar"
}
dependencies {
type_urn: "beam:artifact:type:file:v1"
type_payload: "\n\252\001/tmp/beam-artifact-staging/497da92a4ac5d09a1ec630dd147ff80eb9f700c8ee5f78647dd110382e8c727f/366-EMBEDDED-auto-value-1.10.1-6ngBDYLv2y-Rmxb67Z5kJ_B9KZihXE9hnNxqYWTs0zY.jar"
role_urn: "beam:artifact:role:staging_to:v1"
role_payload: "\nAauto-value-1.10.1-6ngBDYLv2y-Rmxb67Z5kJ_B9KZihXE9hnNxqYWTs0zY.jar"
}
dependencies {
type_urn: "beam:artifact:type:file:v1"
type_payload: "\n\263\001/tmp/beam-artifact-staging/497da92a4ac5d09a1ec630dd147ff80eb9f700c8ee5f78647dd110382e8c727f/367-EMBEDDED-javax.annotation-api-1.3.2-4EulGVvNVV3JVlD3zGFNFR5LzVLSmhC4qiGX86uJq5s.jar"
role_urn: "beam:artifact:role:staging_to:v1"
role_payload: "\nJjavax.annotation-api-1.3.2-4EulGVvNVV3JVlD3zGFNFR5LzVLSmhC4qiGX86uJq5s.jar"
}
dependencies {
type_urn: "beam:artifact:type:file:v1"
type_payload: "\n\243\001/tmp/beam-artifact-staging/497da92a4ac5d09a1ec630dd147ff80eb9f700c8ee5f78647dd110382e8c727f/368-EMBEDDED-okio-1.6.0-EUvcH0czimi8vJWr8vXNxyvu7JGBLy_Ne1IcGTeHYmY.jar"
role_urn: "beam:artifact:role:staging_to:v1"
role_payload: "\n:okio-1.6.0-EUvcH0czimi8vJWr8vXNxyvu7JGBLy_Ne1IcGTeHYmY.jar"
}
dependencies {
type_urn: "beam:artifact:type:file:v1"
type_payload: "\n\247\001/tmp/beam-artifact-staging/497da92a4ac5d09a1ec630dd147ff80eb9f700c8ee5f78647dd110382e8c727f/369-EMBEDDED-stax-api-1.0-2-6McOvXb5gslYKoLvgs9s4Up9WKSk3KXLe3_JiMgAibc.jar"
role_urn: "beam:artifact:role:staging_to:v1"
role_payload: "\n>stax-api-1.0-2-6McOvXb5gslYKoLvgs9s4Up9WKSk3KXLe3_JiMgAibc.jar"
}
dependencies {
type_urn: "beam:artifact:type:file:v1"
type_payload: "\n\242\001/tmp/beam-artifact-staging/497da92a4ac5d09a1ec630dd147ff80eb9f700c8ee5f78647dd110382e8c727f/370-EMBEDDED-guice-3.0-GlnQQh_9NVzAtwtC3xwumvdEyKLQyS2jefX8ovB_HSI.jar"
role_urn: "beam:artifact:role:staging_to:v1"
role_payload: "\n9guice-3.0-GlnQQh_9NVzAtwtC3xwumvdEyKLQyS2jefX8ovB_HSI.jar"
}
dependencies {
type_urn: "beam:artifact:type:file:v1"
type_payload: "\n\275\001/tmp/beam-artifact-staging/497da92a4ac5d09a1ec630dd147ff80eb9f700c8ee5f78647dd110382e8c727f/371-EMBEDDED-geronimo-jcache_1.0_spec-1.0-alpha-1-AHChLlj0kblXGTkTJSmaYpRTDubDziXlC9yYsLcAlmw.jar"
role_urn: "beam:artifact:role:staging_to:v1"
role_payload: "\nTgeronimo-jcache_1.0_spec-1.0-alpha-1-AHChLlj0kblXGTkTJSmaYpRTDubDziXlC9yYsLcAlmw.jar"
}
dependencies {
type_urn: "beam:artifact:type:file:v1"
type_payload: "\n\256\001/tmp/beam-artifact-staging/497da92a4ac5d09a1ec630dd147ff80eb9f700c8ee5f78647dd110382e8c727f/372-EMBEDDED-mssql-jdbc-6.2.1.jre7-nPollFCuNHHS5uLD2K78ziNuPa74s3NNIdyTw6W76AY.jar"
role_urn: "beam:artifact:role:staging_to:v1"
role_payload: "\nEmssql-jdbc-6.2.1.jre7-nPollFCuNHHS5uLD2K78ziNuPa74s3NNIdyTw6W76AY.jar"
}
dependencies {
type_urn: "beam:artifact:type:file:v1"
type_payload: "\n\247\001/tmp/beam-artifact-staging/497da92a4ac5d09a1ec630dd147ff80eb9f700c8ee5f78647dd110382e8c727f/373-EMBEDDED-javax.inject-1-kcdwRKUMSBY2wy2Rb9ickRinIZU5BFLIEGUID5V95_8.jar"
role_urn: "beam:artifact:role:staging_to:v1"
role_payload: "\n>javax.inject-1-kcdwRKUMSBY2wy2Rb9ickRinIZU5BFLIEGUID5V95_8.jar"
}
dependencies {
type_urn: "beam:artifact:type:file:v1"
type_payload: "\n\250\001/tmp/beam-artifact-staging/497da92a4ac5d09a1ec630dd147ff80eb9f700c8ee5f78647dd110382e8c727f/374-EMBEDDED-aopalliance-1.0-Ct3sZw_tzT8RPFyAkdeDKA0j9146y4QbYanNsHk3agg.jar"
role_urn: "beam:artifact:role:staging_to:v1"
role_payload: "\n?aopalliance-1.0-Ct3sZw_tzT8RPFyAkdeDKA0j9146y4QbYanNsHk3agg.jar"
}
dependencies {
type_urn: "beam:artifact:type:file:v1"
type_payload: "\n\256\001/tmp/beam-artifact-staging/497da92a4ac5d09a1ec630dd147ff80eb9f700c8ee5f78647dd110382e8c727f/375-EMBEDDED-cglib-2.2.1-v20090111-QuHfsmvsvxpjPyW0fjn8xCK4XnfkwEaNmkT4hfX6C-I.jar"
role_urn: "beam:artifact:role:staging_to:v1"
role_payload: "\nEcglib-2.2.1-v20090111-QuHfsmvsvxpjPyW0fjn8xCK4XnfkwEaNmkT4hfX6C-I.jar"
}
[ScheduledExecutor-thread] WARN org.apache.beam.sdk.fn.data.BeamFnDataGrpcMultiplexer - Hanged up for unknown endpoint.
[grpc-default-executor-147] ERROR org.apache.beam.sdk.fn.data.BeamFnDataGrpcMultiplexer - Failed to handle for url: "InProcessServer_568"
org.apache.beam.vendor.grpc.v1p48p1.io.grpc.StatusRuntimeException: CANCELLED: Multiplexer hanging up
at org.apache.beam.vendor.grpc.v1p48p1.io.grpc.Status.asRuntimeException(Status.java:535)
at org.apache.beam.vendor.grpc.v1p48p1.io.grpc.stub.ClientCalls$StreamObserverToCallListenerAdapter.onClose(ClientCalls.java:487)
at org.apache.beam.vendor.grpc.v1p48p1.io.grpc.internal.ClientCallImpl.closeObserver(ClientCallImpl.java:562)
at org.apache.beam.vendor.grpc.v1p48p1.io.grpc.internal.ClientCallImpl.access$300(ClientCallImpl.java:70)
at org.apache.beam.vendor.grpc.v1p48p1.io.grpc.internal.ClientCallImpl$ClientStreamListenerImpl$1StreamClosed.runInternal(ClientCallImpl.java:743)
at org.apache.beam.vendor.grpc.v1p48p1.io.grpc.internal.ClientCallImpl$ClientStreamListenerImpl$1StreamClosed.runInContext(ClientCallImpl.java:722)
at org.apache.beam.vendor.grpc.v1p48p1.io.grpc.internal.ContextRunnable.run(ContextRunnable.java:37)
at org.apache.beam.vendor.grpc.v1p48p1.io.grpc.internal.SerializingExecutor.run(SerializingExecutor.java:133)
at java.util.concurrent.ThreadPoolExecutor.runWorker(ThreadPoolExecutor.java:1149)
at java.util.concurrent.ThreadPoolExecutor$Worker.run(ThreadPoolExecutor.java:624)
at java.lang.Thread.run(Thread.java:750)
229 tests completed, 1 failed, 1 skipped
> Task :runners:spark:3:job-server:validatesPortableRunnerBatch FAILED
> Task :runners:spark:3:job-server:validatesPortableRunnerDocker FROM-CACHE
FAILURE: Build completed with 2 failures.
1: Task failed with an exception.
-----------
* What went wrong:
Execution failed for task ':runners:spark:2:job-server:validatesPortableRunnerBatch'.
> There were failing tests. See the report at: file://<https://ci-beam.apache.org/job/beam_PostCommit_Java_PVR_Spark_Batch/ws/src/runners/spark/2/job-server/build/reports/tests/validatesPortableRunnerBatch/index.html>
* Try:
> Run with --stacktrace option to get the stack trace.
> Run with --info or --debug option to get more log output.
==============================================================================
2: Task failed with an exception.
-----------
* What went wrong:
Execution failed for task ':runners:spark:3:job-server:validatesPortableRunnerBatch'.
> There were failing tests. See the report at: file://<https://ci-beam.apache.org/job/beam_PostCommit_Java_PVR_Spark_Batch/ws/src/runners/spark/3/job-server/build/reports/tests/validatesPortableRunnerBatch/index.html>
* Try:
> Run with --stacktrace option to get the stack trace.
> Run with --info or --debug option to get more log output.
==============================================================================
* Get more help at https://help.gradle.org
Deprecated Gradle features were used in this build, making it incompatible with Gradle 8.0.
You can use '--warning-mode all' to show the individual deprecation warnings and determine if they come from your own scripts or plugins.
See https://docs.gradle.org/7.5.1/userguide/command_line_interface.html#sec:command_line_warnings
Execution optimizations have been disabled for 1 invalid unit(s) of work during this build to ensure correctness.
Please consult deprecation warnings for more details.
BUILD FAILED in 2h 26m 3s
119 actionable tasks: 77 executed, 38 from cache, 4 up-to-date
Publishing build scan...
https://gradle.com/s/7p4idpyj7kvpy
Build step 'Invoke Gradle script' changed build result to FAILURE
Build step 'Invoke Gradle script' marked build as failure
---------------------------------------------------------------------
To unsubscribe, e-mail: builds-unsubscribe@beam.apache.org
For additional commands, e-mail: builds-help@beam.apache.org
Build failed in Jenkins: beam_PostCommit_Java_PVR_Spark_Batch #1619
Posted by Apache Jenkins Server <je...@builds.apache.org>.
See <https://ci-beam.apache.org/job/beam_PostCommit_Java_PVR_Spark_Batch/1619/display/redirect>
Changes:
------------------------------------------
[...truncated 123.30 KB...]
type_payload: "\n\251\001/tmp/beam-artifact-staging/f49f057fd35082a73e11bedea581df63111731a5a7178d4d00cb0a57205b0726/166-EMBEDDED-chill-java-0.9.5-KuGmbv9-rS2ZJvpfa-miT1ZGraGR1JNZTSZAAwoko1s.jar"
role_urn: "beam:artifact:role:staging_to:v1"
role_payload: "\n@chill-java-0.9.5-KuGmbv9-rS2ZJvpfa-miT1ZGraGR1JNZTSZAAwoko1s.jar"
}
dependencies {
type_urn: "beam:artifact:type:file:v1"
type_payload: "\n\252\001/tmp/beam-artifact-staging/f49f057fd35082a73e11bedea581df63111731a5a7178d4d00cb0a57205b0726/167-EMBEDDED-kryo-shaded-4.0.2-pImfV_70VrnsZvcw57ST7LPcSUzFdYch7ZwYQW_S07Y.jar"
role_urn: "beam:artifact:role:staging_to:v1"
role_payload: "\nAkryo-shaded-4.0.2-pImfV_70VrnsZvcw57ST7LPcSUzFdYch7ZwYQW_S07Y.jar"
}
dependencies {
type_urn: "beam:artifact:type:file:v1"
type_payload: "\n\265\001/tmp/beam-artifact-staging/f49f057fd35082a73e11bedea581df63111731a5a7178d4d00cb0a57205b0726/168-EMBEDDED-json4s-jackson_2.12-3.7.0-M5-z4anLKPchMP5zFLcX_HuVwfXhXIXFAlMkeGDFxq1XCM.jar"
role_urn: "beam:artifact:role:staging_to:v1"
role_payload: "\nLjson4s-jackson_2.12-3.7.0-M5-z4anLKPchMP5zFLcX_HuVwfXhXIXFAlMkeGDFxq1XCM.jar"
}
dependencies {
type_urn: "beam:artifact:type:file:v1"
type_payload: "\n\262\001/tmp/beam-artifact-staging/f49f057fd35082a73e11bedea581df63111731a5a7178d4d00cb0a57205b0726/169-EMBEDDED-json4s-core_2.12-3.7.0-M5-_cfW0pA_DLAuqXC0UH2pVc6vBBUKK_-oJB5FKxnUiI8.jar"
role_urn: "beam:artifact:role:staging_to:v1"
role_payload: "\nIjson4s-core_2.12-3.7.0-M5-_cfW0pA_DLAuqXC0UH2pVc6vBBUKK_-oJB5FKxnUiI8.jar"
}
dependencies {
type_urn: "beam:artifact:type:file:v1"
type_payload: "\n\246\001/tmp/beam-artifact-staging/f49f057fd35082a73e11bedea581df63111731a5a7178d4d00cb0a57205b0726/170-EMBEDDED-paranamer-2.8-aIyxGKYCHYGROOhVIIyVYDFoi-S0eiS7YVvsxjrO3wc.jar"
role_urn: "beam:artifact:role:staging_to:v1"
role_payload: "\n=paranamer-2.8-aIyxGKYCHYGROOhVIIyVYDFoi-S0eiS7YVvsxjrO3wc.jar"
}
dependencies {
type_urn: "beam:artifact:type:file:v1"
type_payload: "\n\255\001/tmp/beam-artifact-staging/f49f057fd35082a73e11bedea581df63111731a5a7178d4d00cb0a57205b0726/171-EMBEDDED-mockito-inline-4.5.1-7lLhwpmmMhhPuidKk3CZPgkUBCn15RbmxVcP1ldLKX8.jar"
role_urn: "beam:artifact:role:staging_to:v1"
role_payload: "\nDmockito-inline-4.5.1-7lLhwpmmMhhPuidKk3CZPgkUBCn15RbmxVcP1ldLKX8.jar"
}
dependencies {
type_urn: "beam:artifact:type:file:v1"
type_payload: "\n\253\001/tmp/beam-artifact-staging/f49f057fd35082a73e11bedea581df63111731a5a7178d4d00cb0a57205b0726/172-EMBEDDED-mockito-core-3.7.7-6dG9IxcdjZMXsBOmplY9rqbVMTnC3CGBb2-vJSvEZkE.jar"
role_urn: "beam:artifact:role:staging_to:v1"
role_payload: "\nBmockito-core-3.7.7-6dG9IxcdjZMXsBOmplY9rqbVMTnC3CGBb2-vJSvEZkE.jar"
}
dependencies {
type_urn: "beam:artifact:type:file:v1"
type_payload: "\n\254\001/tmp/beam-artifact-staging/f49f057fd35082a73e11bedea581df63111731a5a7178d4d00cb0a57205b0726/173-EMBEDDED-assertj-core-3.11.1-LuK9PoH8gY1CPUQrZY8orPk42QeNa6AWpks2L913eeg.jar"
role_urn: "beam:artifact:role:staging_to:v1"
role_payload: "\nCassertj-core-3.11.1-LuK9PoH8gY1CPUQrZY8orPk42QeNa6AWpks2L913eeg.jar"
}
dependencies {
type_urn: "beam:artifact:type:file:v1"
type_payload: "\n\253\001/tmp/beam-artifact-staging/f49f057fd35082a73e11bedea581df63111731a5a7178d4d00cb0a57205b0726/174-EMBEDDED-byte-buddy-1.12.14-ahof_fV49UwDPzsTmzaL4-t1FGuvzVjuJ8KsCQ8ogAE.jar"
role_urn: "beam:artifact:role:staging_to:v1"
role_payload: "\nBbyte-buddy-1.12.14-ahof_fV49UwDPzsTmzaL4-t1FGuvzVjuJ8KsCQ8ogAE.jar"
}
dependencies {
type_urn: "beam:artifact:type:file:v1"
type_payload: "\n\245\001/tmp/beam-artifact-staging/f49f057fd35082a73e11bedea581df63111731a5a7178d4d00cb0a57205b0726/175-EMBEDDED-jsr305-3.0.2-dmrSoHg_JoeWLIrXTO7MOKKLn3Ki0IXuQ4t4E-ko0Mc.jar"
role_urn: "beam:artifact:role:staging_to:v1"
role_payload: "\n<jsr305-3.0.2-dmrSoHg_JoeWLIrXTO7MOKKLn3Ki0IXuQ4t4E-ko0Mc.jar"
}
dependencies {
type_urn: "beam:artifact:type:file:v1"
type_payload: "\n\267\001/tmp/beam-artifact-staging/f49f057fd35082a73e11bedea581df63111731a5a7178d4d00cb0a57205b0726/176-EMBEDDED-error_prone_annotations-2.10.0-oknU0l37htQebIL8M131gBifDJ_uq9xTIz_B5QYHJKE.jar"
role_urn: "beam:artifact:role:staging_to:v1"
role_payload: "\nNerror_prone_annotations-2.10.0-oknU0l37htQebIL8M131gBifDJ_uq9xTIz_B5QYHJKE.jar"
}
dependencies {
type_urn: "beam:artifact:type:file:v1"
type_payload: "\n\254\001/tmp/beam-artifact-staging/f49f057fd35082a73e11bedea581df63111731a5a7178d4d00cb0a57205b0726/177-EMBEDDED-snappy-java-1.1.8.4-JMTR_B6J4HgzGrj0AamcrWhZm95KLkUWBCy1SMUbHD4.jar"
role_urn: "beam:artifact:role:staging_to:v1"
role_payload: "\nCsnappy-java-1.1.8.4-JMTR_B6J4HgzGrj0AamcrWhZm95KLkUWBCy1SMUbHD4.jar"
}
dependencies {
type_urn: "beam:artifact:type:file:v1"
type_payload: "\n\242\001/tmp/beam-artifact-staging/f49f057fd35082a73e11bedea581df63111731a5a7178d4d00cb0a57205b0726/178-EMBEDDED-kryo-2.21-FOpU7J_yu1GgWDwdDX69Iux4pdrUfN0gXcpUcGtHR0M.jar"
role_urn: "beam:artifact:role:staging_to:v1"
role_payload: "\n9kryo-2.21-FOpU7J_yu1GgWDwdDX69Iux4pdrUfN0gXcpUcGtHR0M.jar"
}
dependencies {
type_urn: "beam:artifact:type:file:v1"
type_payload: "\n\251\001/tmp/beam-artifact-staging/f49f057fd35082a73e11bedea581df63111731a5a7178d4d00cb0a57205b0726/179-EMBEDDED-zstd-jni-1.5.2-5-D45k_qoGi4oC3kXpND-bL8QBI1uB5_4_gLKuugAWkbI.jar"
role_urn: "beam:artifact:role:staging_to:v1"
role_payload: "\n@zstd-jni-1.5.2-5-D45k_qoGi4oC3kXpND-bL8QBI1uB5_4_gLKuugAWkbI.jar"
}
dependencies {
type_urn: "beam:artifact:type:file:v1"
type_payload: "\n\245\001/tmp/beam-artifact-staging/f49f057fd35082a73e11bedea581df63111731a5a7178d4d00cb0a57205b0726/180-EMBEDDED-jets3t-0.9.0-6JiT_HVLJSr3F9fRSszalG99_PweKT_T4EclFj1mG9c.jar"
role_urn: "beam:artifact:role:staging_to:v1"
role_payload: "\n<jets3t-0.9.0-6JiT_HVLJSr3F9fRSszalG99_PweKT_T4EclFj1mG9c.jar"
}
dependencies {
type_urn: "beam:artifact:type:file:v1"
type_payload: "\n\252\001/tmp/beam-artifact-staging/f49f057fd35082a73e11bedea581df63111731a5a7178d4d00cb0a57205b0726/181-EMBEDDED-httpclient-4.5.13-b-kCalZsalABYIzz_DIZZkH2weXhmG0QN8zb1fMe90M.jar"
role_urn: "beam:artifact:role:staging_to:v1"
role_payload: "\nAhttpclient-4.5.13-b-kCalZsalABYIzz_DIZZkH2weXhmG0QN8zb1fMe90M.jar"
}
dependencies {
type_urn: "beam:artifact:type:file:v1"
type_payload: "\n\262\001/tmp/beam-artifact-staging/f49f057fd35082a73e11bedea581df63111731a5a7178d4d00cb0a57205b0726/182-EMBEDDED-commons-configuration-1.6-RrcbllYVT2oW6ksdyEAmtSqTBfjv8EaitGVfoXOOXu4.jar"
role_urn: "beam:artifact:role:staging_to:v1"
role_payload: "\nIcommons-configuration-1.6-RrcbllYVT2oW6ksdyEAmtSqTBfjv8EaitGVfoXOOXu4.jar"
}
dependencies {
type_urn: "beam:artifact:type:file:v1"
type_payload: "\n\260\001/tmp/beam-artifact-staging/f49f057fd35082a73e11bedea581df63111731a5a7178d4d00cb0a57205b0726/183-EMBEDDED-commons-beanutils-1.9.4-fZOMgXiQKARcCMBl6UvnX8KAUnYg1b1itRnVg4UyNoo.jar"
role_urn: "beam:artifact:role:staging_to:v1"
role_payload: "\nGcommons-beanutils-1.9.4-fZOMgXiQKARcCMBl6UvnX8KAUnYg1b1itRnVg4UyNoo.jar"
}
dependencies {
type_urn: "beam:artifact:type:file:v1"
type_payload: "\n\256\001/tmp/beam-artifact-staging/f49f057fd35082a73e11bedea581df63111731a5a7178d4d00cb0a57205b0726/184-EMBEDDED-commons-validator-1.7-TXT0zk-2iyYX7a0Ibfbe_fkzhGfSN30sYuaQOOHE8C8.jar"
role_urn: "beam:artifact:role:staging_to:v1"
role_payload: "\nEcommons-validator-1.7-TXT0zk-2iyYX7a0Ibfbe_fkzhGfSN30sYuaQOOHE8C8.jar"
}
dependencies {
type_urn: "beam:artifact:type:file:v1"
type_payload: "\n\255\001/tmp/beam-artifact-staging/f49f057fd35082a73e11bedea581df63111731a5a7178d4d00cb0a57205b0726/185-EMBEDDED-commons-digester-2.1-4LK5gKhPxlM8XOKR8ZF7MsUH9ivK1kGY__RDaMIZaj0.jar"
role_urn: "beam:artifact:role:staging_to:v1"
role_payload: "\nDcommons-digester-2.1-4LK5gKhPxlM8XOKR8ZF7MsUH9ivK1kGY__RDaMIZaj0.jar"
}
dependencies {
type_urn: "beam:artifact:type:file:v1"
type_payload: "\n\254\001/tmp/beam-artifact-staging/f49f057fd35082a73e11bedea581df63111731a5a7178d4d00cb0a57205b0726/186-EMBEDDED-commons-logging-1.2-2t3qHqC-D1aXirMAa4rJKDSv7vvZt-TmMW_KV98PpjY.jar"
role_urn: "beam:artifact:role:staging_to:v1"
role_payload: "\nCcommons-logging-1.2-2t3qHqC-D1aXirMAa4rJKDSv7vvZt-TmMW_KV98PpjY.jar"
}
dependencies {
type_urn: "beam:artifact:type:file:v1"
type_payload: "\n\245\001/tmp/beam-artifact-staging/f49f057fd35082a73e11bedea581df63111731a5a7178d4d00cb0a57205b0726/187-EMBEDDED-log4j-1.2.17-HTFpZEVpdyBScJF1Q2kIKmZRvUl4G2AF3rlOVnU0Bvk.jar"
role_urn: "beam:artifact:role:staging_to:v1"
role_payload: "\n<log4j-1.2.17-HTFpZEVpdyBScJF1Q2kIKmZRvUl4G2AF3rlOVnU0Bvk.jar"
}
dependencies {
type_urn: "beam:artifact:type:file:v1"
type_payload: "\n\251\001/tmp/beam-artifact-staging/f49f057fd35082a73e11bedea581df63111731a5a7178d4d00cb0a57205b0726/188-EMBEDDED-log4j-api-2.17.2-CTUbWgOCjzac3P929O055qb8IPJPBGk10LKO9RUvjOQ.jar"
role_urn: "beam:artifact:role:staging_to:v1"
role_payload: "\n@log4j-api-2.17.2-CTUbWgOCjzac3P929O055qb8IPJPBGk10LKO9RUvjOQ.jar"
}
dependencies {
type_urn: "beam:artifact:type:file:v1"
type_payload: "\n\243\001/tmp/beam-artifact-staging/f49f057fd35082a73e11bedea581df63111731a5a7178d4d00cb0a57205b0726/189-EMBEDDED-jamm-0.4.1-66wBV3Kin8gLmaalQCUWCirKG77Pzqtp5GQkGlomqY0.jar"
role_urn: "beam:artifact:role:staging_to:v1"
role_payload: "\n:jamm-0.4.1-66wBV3Kin8gLmaalQCUWCirKG77Pzqtp5GQkGlomqY0.jar"
}
dependencies {
type_urn: "beam:artifact:type:file:v1"
type_payload: "\n\265\001/tmp/beam-artifact-staging/f49f057fd35082a73e11bedea581df63111731a5a7178d4d00cb0a57205b0726/190-EMBEDDED-conscrypt-openjdk-uber-2.5.2-6vU32Y4DPQ8EUc0bjMdOAte1XsiC2mPIgGDYBrqJw0g.jar"
role_urn: "beam:artifact:role:staging_to:v1"
role_payload: "\nLconscrypt-openjdk-uber-2.5.2-6vU32Y4DPQ8EUc0bjMdOAte1XsiC2mPIgGDYBrqJw0g.jar"
}
dependencies {
type_urn: "beam:artifact:type:file:v1"
type_payload: "\n\253\001/tmp/beam-artifact-staging/f49f057fd35082a73e11bedea581df63111731a5a7178d4d00cb0a57205b0726/191-EMBEDDED-classgraph-4.8.104-ePvfM6WdiJMBzk05ytbzmopew--T1rqGqw_PYcvi6h0.jar"
role_urn: "beam:artifact:role:staging_to:v1"
role_payload: "\nBclassgraph-4.8.104-ePvfM6WdiJMBzk05ytbzmopew--T1rqGqw_PYcvi6h0.jar"
}
dependencies {
type_urn: "beam:artifact:type:file:v1"
type_payload: "\n\256\001/tmp/beam-artifact-staging/f49f057fd35082a73e11bedea581df63111731a5a7178d4d00cb0a57205b0726/192-EMBEDDED-commons-compress-1.21-auz9VFlyillWAc-gcljRMZcv_Dm0kutIvdWWV3ovJEo.jar"
role_urn: "beam:artifact:role:staging_to:v1"
role_payload: "\nEcommons-compress-1.21-auz9VFlyillWAc-gcljRMZcv_Dm0kutIvdWWV3ovJEo.jar"
}
dependencies {
type_urn: "beam:artifact:type:file:v1"
type_payload: "\n\277\001/tmp/beam-artifact-staging/f49f057fd35082a73e11bedea581df63111731a5a7178d4d00cb0a57205b0726/193-EMBEDDED-google-auth-library-credentials-1.14.0-d1Fjgvalt1urV297FJElDeOtYz5eLBXdcJqMpx-QE98.jar"
role_urn: "beam:artifact:role:staging_to:v1"
role_payload: "\nVgoogle-auth-library-credentials-1.14.0-d1Fjgvalt1urV297FJElDeOtYz5eLBXdcJqMpx-QE98.jar"
}
dependencies {
type_urn: "beam:artifact:type:file:v1"
type_payload: "\n\250\001/tmp/beam-artifact-staging/f49f057fd35082a73e11bedea581df63111731a5a7178d4d00cb0a57205b0726/194-EMBEDDED-httpcore-4.4.14--VYgnkUMsdDFF3bfvSPlPp3Y25oSmO1itwvwlEumOyg.jar"
role_urn: "beam:artifact:role:staging_to:v1"
role_payload: "\n?httpcore-4.4.14--VYgnkUMsdDFF3bfvSPlPp3Y25oSmO1itwvwlEumOyg.jar"
}
dependencies {
type_urn: "beam:artifact:type:file:v1"
type_payload: "\n\257\001/tmp/beam-artifact-staging/f49f057fd35082a73e11bedea581df63111731a5a7178d4d00cb0a57205b0726/195-EMBEDDED-xbean-asm7-shaded-4.15-SIlFObqa1eOt3mjFicPqbz5yz0gMxd7QBEfgqdw8vDc.jar"
role_urn: "beam:artifact:role:staging_to:v1"
role_payload: "\nFxbean-asm7-shaded-4.15-SIlFObqa1eOt3mjFicPqbz5yz0gMxd7QBEfgqdw8vDc.jar"
}
dependencies {
type_urn: "beam:artifact:type:file:v1"
type_payload: "\n\262\001/tmp/beam-artifact-staging/f49f057fd35082a73e11bedea581df63111731a5a7178d4d00cb0a57205b0726/196-EMBEDDED-spark-launcher_2.12-3.1.2-RSwBMByoHo4hjO5OFoj8K98McDsOSx-6CBRhnp0Daes.jar"
role_urn: "beam:artifact:role:staging_to:v1"
role_payload: "\nIspark-launcher_2.12-3.1.2-RSwBMByoHo4hjO5OFoj8K98McDsOSx-6CBRhnp0Daes.jar"
}
dependencies {
type_urn: "beam:artifact:type:file:v1"
type_payload: "\n\247\001/tmp/beam-artifact-staging/f49f057fd35082a73e11bedea581df63111731a5a7178d4d00cb0a57205b0726/197-EMBEDDED-jaxb-api-2.2.2-MCM99iFfuYLYeE3pHTB1lnSM6pjW1QIpPHw-hcFpcTc.jar"
role_urn: "beam:artifact:role:staging_to:v1"
role_payload: "\n>jaxb-api-2.2.2-MCM99iFfuYLYeE3pHTB1lnSM6pjW1QIpPHw-hcFpcTc.jar"
}
dependencies {
type_urn: "beam:artifact:type:file:v1"
type_payload: "\n\251\001/tmp/beam-artifact-staging/f49f057fd35082a73e11bedea581df63111731a5a7178d4d00cb0a57205b0726/198-EMBEDDED-activation-1.1.1-rkdRIOn82ZtLALODKb1hzcXrdU7uA_5mwB9Q4TdyT5k.jar"
role_urn: "beam:artifact:role:staging_to:v1"
role_payload: "\n@activation-1.1.1-rkdRIOn82ZtLALODKb1hzcXrdU7uA_5mwB9Q4TdyT5k.jar"
}
dependencies {
type_urn: "beam:artifact:type:file:v1"
type_payload: "\n\262\001/tmp/beam-artifact-staging/f49f057fd35082a73e11bedea581df63111731a5a7178d4d00cb0a57205b0726/199-EMBEDDED-jakarta.servlet-api-4.0.3-bZMBDKkzATg8XKlg1VYRpckXmNoe-w8f6TVvJ4Mb9Jk.jar"
role_urn: "beam:artifact:role:staging_to:v1"
role_payload: "\nIjakarta.servlet-api-4.0.
229 tests completed, 1 failed, 1 skipped
> Task :runners:spark:3:job-server:validatesPortableRunnerBatch FAILED
> Task :runners:spark:3:job-server:validatesPortableRunnerDocker FROM-CACHE
FAILURE: Build completed with 2 failures.
1: Task failed with an exception.
-----------
* What went wrong:
Execution failed for task ':runners:spark:2:job-server:validatesPortableRunnerBatch'.
> There were failing tests. See the report at: file://<https://ci-beam.apache.org/job/beam_PostCommit_Java_PVR_Spark_Batch/ws/src/runners/spark/2/job-server/build/reports/tests/validatesPortableRunnerBatch/index.html>
* Try:
> Run with --stacktrace option to get the stack trace.
> Run with --info or --debug option to get more log output.
==============================================================================
2: Task failed with an exception.
-----------
* What went wrong:
Execution failed for task ':runners:spark:3:job-server:validatesPortableRunnerBatch'.
> There were failing tests. See the report at: file://<https://ci-beam.apache.org/job/beam_PostCommit_Java_PVR_Spark_Batch/ws/src/runners/spark/3/job-server/build/reports/tests/validatesPortableRunnerBatch/index.html>
* Try:
> Run with --stacktrace option to get the stack trace.
> Run with --info or --debug option to get more log output.
==============================================================================
* Get more help at https://help.gradle.org
Deprecated Gradle features were used in this build, making it incompatible with Gradle 8.0.
You can use '--warning-mode all' to show the individual deprecation warnings and determine if they come from your own scripts or plugins.
See https://docs.gradle.org/7.5.1/userguide/command_line_interface.html#sec:command_line_warnings
Execution optimizations have been disabled for 1 invalid unit(s) of work during this build to ensure correctness.
Please consult deprecation warnings for more details.
BUILD FAILED in 2h 26m 52s
119 actionable tasks: 77 executed, 38 from cache, 4 up-to-date
Publishing build scan...
https://gradle.com/s/w7yo5c33iyk22
Build step 'Invoke Gradle script' changed build result to FAILURE
Build step 'Invoke Gradle script' marked build as failure
---------------------------------------------------------------------
To unsubscribe, e-mail: builds-unsubscribe@beam.apache.org
For additional commands, e-mail: builds-help@beam.apache.org
Build failed in Jenkins: beam_PostCommit_Java_PVR_Spark_Batch #1618
Posted by Apache Jenkins Server <je...@builds.apache.org>.
See <https://ci-beam.apache.org/job/beam_PostCommit_Java_PVR_Spark_Batch/1618/display/redirect?page=changes>
Changes:
[noreply] Basic SchemaTransform implementation for SQLTransform. (#25177)
[noreply] issue24170 google colab link added (#24820)
------------------------------------------
[...truncated 27.64 KB...]
> Task :sdks:java:container:generateLicenseReport
> Task :sdks:java:fn-execution:compileJava FROM-CACHE
> Task :sdks:java:fn-execution:classes UP-TO-DATE
> Task :sdks:java:core:jar
> Task :sdks:java:fn-execution:jar
> Task :runners:core-construction-java:compileJava FROM-CACHE
> Task :runners:core-construction-java:classes UP-TO-DATE
> Task :runners:core-construction-java:jar
> Task :runners:core-java:compileJava FROM-CACHE
> Task :runners:core-java:classes UP-TO-DATE
> Task :runners:core-java:jar
> Task :sdks:java:extensions:google-cloud-platform-core:compileJava FROM-CACHE
> Task :sdks:java:extensions:google-cloud-platform-core:classes UP-TO-DATE
> Task :sdks:java:harness:compileJava FROM-CACHE
> Task :sdks:java:harness:classes UP-TO-DATE
> Task :sdks:java:extensions:google-cloud-platform-core:jar
> Task :sdks:java:harness:jar
> Task :runners:java-fn-execution:compileJava FROM-CACHE
> Task :runners:java-fn-execution:classes UP-TO-DATE
> Task :runners:java-fn-execution:jar
> Task :sdks:java:expansion-service:compileJava FROM-CACHE
> Task :sdks:java:expansion-service:classes UP-TO-DATE
> Task :sdks:java:expansion-service:jar
> Task :runners:java-job-service:compileJava FROM-CACHE
> Task :runners:java-job-service:classes UP-TO-DATE
> Task :runners:java-job-service:jar
> Task :sdks:java:io:kafka:compileJava FROM-CACHE
> Task :sdks:java:io:kafka:classes UP-TO-DATE
> Task :sdks:java:harness:shadowJar FROM-CACHE
> Task :sdks:java:io:kafka:jar
> Task :sdks:java:container:java8:copyDockerfileDependencies
> Task :sdks:java:core:compileTestJava FROM-CACHE
> Task :sdks:java:core:testClasses
> Task :sdks:java:core:shadowTestJar FROM-CACHE
> Task :runners:portability:java:compileJava FROM-CACHE
> Task :runners:portability:java:classes UP-TO-DATE
> Task :runners:portability:java:jar
> Task :sdks:java:container:pullLicenses
Copying already-fetched licenses from <https://ci-beam.apache.org/job/beam_PostCommit_Java_PVR_Spark_Batch/ws/src/sdks/java/container/build/reports/dependency-license> to <https://ci-beam.apache.org/job/beam_PostCommit_Java_PVR_Spark_Batch/ws/src/sdks/java/container/build/target/java_third_party_licenses>
> Task :runners:spark:2:compileJava FROM-CACHE
> Task :runners:spark:2:classes
> Task :runners:spark:3:compileJava FROM-CACHE
> Task :runners:spark:3:classes
> Task :runners:spark:2:jar
> Task :runners:spark:3:jar
> Task :runners:core-java:compileTestJava FROM-CACHE
> Task :runners:core-java:testClasses UP-TO-DATE
> Task :runners:core-java:testJar
> Task :runners:core-construction-java:compileTestJava FROM-CACHE
> Task :runners:core-construction-java:testClasses UP-TO-DATE
> Task :runners:core-construction-java:testJar
> Task :runners:portability:java:compileTestJava FROM-CACHE
> Task :runners:portability:java:testClasses UP-TO-DATE
> Task :runners:portability:java:testJar
> Task :runners:spark:3:compileTestJava FROM-CACHE
> Task :runners:spark:2:compileTestJava FROM-CACHE
> Task :runners:spark:3:testClasses
> Task :runners:spark:2:testClasses
> Task :runners:spark:2:testJar
> Task :runners:spark:3:testJar
> Task :sdks:java:container:java8:dockerClean UP-TO-DATE
> Task :release:go-licenses:java:dockerClean UP-TO-DATE
> Task :release:go-licenses:java:dockerPrepare
> Task :release:go-licenses:java:docker
> Task :sdks:java:container:pullLicenses
Collecting pip
Using cached pip-23.0-py3-none-any.whl (2.1 MB)
Collecting setuptools
Using cached setuptools-67.1.0-py3-none-any.whl (1.1 MB)
Collecting wheel
Using cached wheel-0.38.4-py3-none-any.whl (36 kB)
Installing collected packages: pip, setuptools, wheel
Attempting uninstall: pip
Found existing installation: pip 20.0.2
Uninstalling pip-20.0.2:
Successfully uninstalled pip-20.0.2
Attempting uninstall: setuptools
Found existing installation: setuptools 44.0.0
Uninstalling setuptools-44.0.0:
Successfully uninstalled setuptools-44.0.0
Successfully installed pip-23.0 setuptools-67.1.0 wheel-0.38.4
Collecting beautifulsoup4<5.0,>=4.9.0
Using cached beautifulsoup4-4.11.2-py3-none-any.whl (129 kB)
Collecting pyyaml<6.0.0,>=3.12
Using cached PyYAML-5.4.1-cp38-cp38-manylinux1_x86_64.whl (662 kB)
Collecting tenacity<6.0,>=5.0.2
Using cached tenacity-5.1.5-py2.py3-none-any.whl (34 kB)
Collecting soupsieve>1.2
Using cached soupsieve-2.3.2.post1-py3-none-any.whl (37 kB)
Collecting six>=1.9.0
Using cached six-1.16.0-py2.py3-none-any.whl (11 kB)
Installing collected packages: soupsieve, six, pyyaml, tenacity, beautifulsoup4
Successfully installed beautifulsoup4-4.11.2 pyyaml-5.4.1 six-1.16.0 soupsieve-2.3.2.post1 tenacity-5.1.5
Executing python <https://ci-beam.apache.org/job/beam_PostCommit_Java_PVR_Spark_Batch/ws/src/sdks/java/container/license_scripts/pull_licenses_java.py> --license_index=<https://ci-beam.apache.org/job/beam_PostCommit_Java_PVR_Spark_Batch/ws/src/sdks/java/container/build/reports/dependency-license/index.json> --output_dir=<https://ci-beam.apache.org/job/beam_PostCommit_Java_PVR_Spark_Batch/ws/src/sdks/java/container/build/target/java_third_party_licenses> --dep_url_yaml=<https://ci-beam.apache.org/job/beam_PostCommit_Java_PVR_Spark_Batch/ws/src/sdks/java/container/license_scripts/dep_urls_java.yaml> --manual_license_path=<https://ci-beam.apache.org/job/beam_PostCommit_Java_PVR_Spark_Batch/ws/src/sdks/java/container/license_scripts/manual_licenses>
INFO:root:Pulling license for 124 dependencies using 16 threads.
INFO:root:Replaced local file URL with file://<https://ci-beam.apache.org/job/beam_PostCommit_Java_PVR_Spark_Batch/ws/src/sdks/java/container/license_scripts/manual_licenses/xz/COPYING> for xz-1.5
INFO:root:pull_licenses_java.py succeed. It took 1.172603 seconds with 16 threads.
Copying licenses from <https://ci-beam.apache.org/job/beam_PostCommit_Java_PVR_Spark_Batch/ws/src/sdks/java/container/build/target/java_third_party_licenses> to <https://ci-beam.apache.org/job/beam_PostCommit_Java_PVR_Spark_Batch/ws/src/sdks/java/container/build/target/third_party_licenses.>
Finished license_scripts.sh
> Task :release:go-licenses:java:dockerRun
+ rm -rf '/output/*'
+ go get github.com/apache/beam/sdks/v2/java/container
go: downloading github.com/apache/beam/sdks/v2 v2.44.0
go: downloading github.com/apache/beam v2.44.0+incompatible
go: downloading github.com/golang/protobuf v1.5.2
go: downloading google.golang.org/grpc v1.51.0
go: downloading google.golang.org/protobuf v1.28.1
go: downloading golang.org/x/sys v0.2.0
> Task :sdks:java:container:java8:copyJavaThirdPartyLicenses
> Task :release:go-licenses:java:dockerRun
go: downloading google.golang.org/genproto v0.0.0-20221118155620-16455021b5e6
go: downloading golang.org/x/net v0.2.0
go: downloading golang.org/x/text v0.4.0
go: added github.com/apache/beam/sdks/v2 v2.44.0
go: added github.com/golang/protobuf v1.5.2
go: added golang.org/x/net v0.2.0
go: added golang.org/x/sys v0.2.0
go: added golang.org/x/text v0.4.0
go: added google.golang.org/genproto v0.0.0-20221118155620-16455021b5e6
go: added google.golang.org/grpc v1.51.0
go: added google.golang.org/protobuf v1.28.1
+ go-licenses save github.com/apache/beam/sdks/v2/java/container --save_path=/output/licenses
W0204 22:21:14.647569 36 library.go:101] "golang.org/x/sys/unix" contains non-Go code that can't be inspected for further dependencies:
/go/pkg/mod/golang.org/x/sys@v0.2.0/unix/asm_linux_amd64.s
+ tee /output/licenses/list.csv
+ go-licenses csv github.com/apache/beam/sdks/v2/java/container
W0204 22:21:22.238772 80 library.go:101] "golang.org/x/sys/unix" contains non-Go code that can't be inspected for further dependencies:
/go/pkg/mod/golang.org/x/sys@v0.2.0/unix/asm_linux_amd64.s
github.com/apache/beam/sdks/v2/go/pkg/beam,https://github.com/apache/beam/blob/sdks/v2.44.0/sdks/go/README.md,Apache-2.0
github.com/apache/beam/sdks/v2/java/container,https://github.com/apache/beam/blob/sdks/v2.44.0/sdks/LICENSE,Apache-2.0
github.com/golang/protobuf,https://github.com/golang/protobuf/blob/v1.5.2/LICENSE,BSD-3-Clause
golang.org/x/net,https://cs.opensource.google/go/x/net/+/v0.2.0:LICENSE,BSD-3-Clause
golang.org/x/sys/unix,https://cs.opensource.google/go/x/sys/+/v0.2.0:LICENSE,BSD-3-Clause
golang.org/x/text,https://cs.opensource.google/go/x/text/+/v0.4.0:LICENSE,BSD-3-Clause
google.golang.org/genproto/googleapis/rpc/status,https://github.com/googleapis/go-genproto/blob/16455021b5e6/LICENSE,Apache-2.0
google.golang.org/grpc,https://github.com/grpc/grpc-go/blob/v1.51.0/LICENSE,Apache-2.0
google.golang.org/protobuf,https://github.com/protocolbuffers/protobuf-go/blob/v1.28.1/LICENSE,BSD-3-Clause
+ chmod -R a+w /output/licenses
> Task :runners:spark:2:job-server:validatesPortableRunnerBatch
> Task :runners:spark:3:job-server:validatesPortableRunnerBatch
> Task :release:go-licenses:java:createLicenses
> Task :sdks:java:container:java8:copyGolangLicenses
> Task :sdks:java:container:java8:dockerPrepare
> Task :sdks:java:container:java8:docker
> Task :runners:spark:3:job-server:validatesPortableRunnerBatch
[shutdown-hook-0] INFO org.apache.spark.util.ShutdownHookManager - Shutdown hook called
[shutdown-hook-0] INFO org.apache.spark.util.ShutdownHookManager - Deleting directory /tmp/spark-64388af2-0497-44dc-8554-63a29ed24eeb
> Task :runners:spark:2:job-server:validatesPortableRunnerBatch
[grpc-default-executor-11] INFO org.apache.beam.runners.fnexecution.logging.GrpcLoggingService - Logging client hanged up.
[shutdown-hook-0] INFO org.apache.spark.util.ShutdownHookManager - Shutdown hook called
[shutdown-hook-0] INFO org.apache.spark.util.ShutdownHookManager - Deleting directory /tmp/spark-883c27b8-e01b-4c9c-8196-d29a39931a88
org.apache.beam.sdk.transforms.ParDoTest$TimestampTests > testParDoTaggedOutputWithTimestamp FAILED
java.lang.RuntimeException at ParDoTest.java:2026
> Task :runners:spark:3:job-server:validatesPortableRunnerBatch
org.apache.beam.sdk.transforms.ParDoTest$TimestampTests > testParDoTaggedOutputWithTimestamp FAILED
java.lang.RuntimeException at ParDoTest.java:2026
> Task :runners:spark:2:job-server:validatesPortableRunnerBatch
[shutdown-hook-0] INFO org.apache.spark.util.ShutdownHookManager - Shutdown hook called
[shutdown-hook-0] INFO org.apache.spark.util.ShutdownHookManager - Deleting directory /tmp/spark-aba29c42-60ab-4704-b984-2b6d20298bc4
> Task :runners:spark:3:job-server:validatesPortableRunnerBatch
[grpc-default-executor-43] INFO org.apache.beam.runners.fnexecution.logging.GrpcLoggingService - Logging client hanged up.
[shutdown-hook-0] INFO org.apache.spark.util.ShutdownHookManager - Shutdown hook called
[shutdown-hook-0] INFO org.apache.spark.util.ShutdownHookManager - Deleting directory /tmp/spark-5b509940-4a6d-4e22-8e3e-120dd7e5ed25
> Task :runners:spark:2:job-server:validatesPortableRunnerBatch
[shutdown-hook-0] INFO org.apache.spark.util.ShutdownHookManager - Shutdown hook called
[shutdown-hook-0] INFO org.apache.spark.util.ShutdownHookManager - Deleting directory /tmp/spark-90fe4ee3-e0d1-4fb2-8048-8ec0f18c3425
> Task :runners:spark:3:job-server:validatesPortableRunnerBatch
[shutdown-hook-0] INFO org.apache.spark.util.ShutdownHookManager - Shutdown hook called
[shutdown-hook-0] INFO org.apache.spark.util.ShutdownHookManager - Deleting directory /tmp/spark-f148e2ef-38fa-45d6-90db-950e92930018
> Task :runners:spark:2:job-server:validatesPortableRunnerBatch
[grpc-default-executor-143] INFO org.apache.beam.runners.fnexecution.logging.GrpcLoggingService - Logging client hanged up.
[shutdown-hook-0] INFO org.apache.spark.util.ShutdownHookManager - Shutdown hook called
[shutdown-hook-0] INFO org.apache.spark.util.ShutdownHookManager - Deleting directory /tmp/spark-07297b65-c8cc-4412-ba3b-b71c8acd2b9f
229 tests completed, 1 failed, 1 skipped
> Task :runners:spark:2:job-server:validatesPortableRunnerBatch FAILED
> Task :runners:spark:2:job-server:validatesPortableRunnerDocker FROM-CACHE
> Task :runners:spark:3:job-server:validatesPortableRunnerBatch
[grpc-default-executor-142] INFO org.apache.beam.runners.fnexecution.logging.GrpcLoggingService - Logging client hanged up.
[shutdown-hook-0] INFO org.apache.spark.util.ShutdownHookManager - Shutdown hook called
[shutdown-hook-0] INFO org.apache.spark.util.ShutdownHookManager - Deleting directory /tmp/spark-3e5cbb7c-fcba-46d6-915f-580423daca45
229 tests completed, 1 failed, 1 skipped
> Task :runners:spark:3:job-server:validatesPortableRunnerBatch FAILED
> Task :runners:spark:3:job-server:validatesPortableRunnerDocker FROM-CACHE
FAILURE: Build completed with 2 failures.
1: Task failed with an exception.
-----------
* What went wrong:
Execution failed for task ':runners:spark:2:job-server:validatesPortableRunnerBatch'.
> There were failing tests. See the report at: file://<https://ci-beam.apache.org/job/beam_PostCommit_Java_PVR_Spark_Batch/ws/src/runners/spark/2/job-server/build/reports/tests/validatesPortableRunnerBatch/index.html>
* Try:
> Run with --stacktrace option to get the stack trace.
> Run with --info or --debug option to get more log output.
==============================================================================
2: Task failed with an exception.
-----------
* What went wrong:
Execution failed for task ':runners:spark:3:job-server:validatesPortableRunnerBatch'.
> There were failing tests. See the report at: file://<https://ci-beam.apache.org/job/beam_PostCommit_Java_PVR_Spark_Batch/ws/src/runners/spark/3/job-server/build/reports/tests/validatesPortableRunnerBatch/index.html>
* Try:
> Run with --stacktrace option to get the stack trace.
> Run with --info or --debug option to get more log output.
==============================================================================
* Get more help at https://help.gradle.org
Deprecated Gradle features were used in this build, making it incompatible with Gradle 8.0.
You can use '--warning-mode all' to show the individual deprecation warnings and determine if they come from your own scripts or plugins.
See https://docs.gradle.org/7.5.1/userguide/command_line_interface.html#sec:command_line_warnings
Execution optimizations have been disabled for 1 invalid unit(s) of work during this build to ensure correctness.
Please consult deprecation warnings for more details.
BUILD FAILED in 2h 18m 2s
119 actionable tasks: 77 executed, 38 from cache, 4 up-to-date
Publishing build scan...
https://gradle.com/s/fpf45bldsohp2
Build step 'Invoke Gradle script' changed build result to FAILURE
Build step 'Invoke Gradle script' marked build as failure
---------------------------------------------------------------------
To unsubscribe, e-mail: builds-unsubscribe@beam.apache.org
For additional commands, e-mail: builds-help@beam.apache.org
Build failed in Jenkins: beam_PostCommit_Java_PVR_Spark_Batch #1617
Posted by Apache Jenkins Server <je...@builds.apache.org>.
See <https://ci-beam.apache.org/job/beam_PostCommit_Java_PVR_Spark_Batch/1617/display/redirect>
Changes:
------------------------------------------
[...truncated 28.67 KB...]
> Task :sdks:java:fn-execution:jar
> Task :runners:core-construction-java:compileJava FROM-CACHE
> Task :runners:core-construction-java:classes UP-TO-DATE
> Task :runners:core-construction-java:jar
> Task :runners:core-java:compileJava FROM-CACHE
> Task :runners:core-java:classes UP-TO-DATE
> Task :runners:core-java:jar
> Task :sdks:java:extensions:google-cloud-platform-core:compileJava FROM-CACHE
> Task :sdks:java:harness:compileJava FROM-CACHE
> Task :sdks:java:extensions:google-cloud-platform-core:classes UP-TO-DATE
> Task :sdks:java:harness:classes UP-TO-DATE
> Task :sdks:java:extensions:google-cloud-platform-core:jar
> Task :sdks:java:harness:jar
> Task :runners:java-fn-execution:compileJava FROM-CACHE
> Task :runners:java-fn-execution:classes UP-TO-DATE
> Task :runners:java-fn-execution:jar
> Task :sdks:java:expansion-service:compileJava FROM-CACHE
> Task :sdks:java:expansion-service:classes UP-TO-DATE
> Task :sdks:java:expansion-service:jar
> Task :runners:java-job-service:compileJava FROM-CACHE
> Task :runners:java-job-service:classes UP-TO-DATE
> Task :runners:java-job-service:jar
> Task :sdks:java:io:kafka:compileJava FROM-CACHE
> Task :sdks:java:io:kafka:classes UP-TO-DATE
> Task :sdks:java:harness:shadowJar FROM-CACHE
> Task :sdks:java:io:kafka:jar
> Task :sdks:java:container:java8:copyDockerfileDependencies
> Task :sdks:java:core:compileTestJava FROM-CACHE
> Task :sdks:java:core:testClasses
> Task :sdks:java:container:pullLicenses
Copying already-fetched licenses from <https://ci-beam.apache.org/job/beam_PostCommit_Java_PVR_Spark_Batch/ws/src/sdks/java/container/build/reports/dependency-license> to <https://ci-beam.apache.org/job/beam_PostCommit_Java_PVR_Spark_Batch/ws/src/sdks/java/container/build/target/java_third_party_licenses>
> Task :sdks:java:core:shadowTestJar FROM-CACHE
> Task :runners:portability:java:compileJava FROM-CACHE
> Task :runners:portability:java:classes UP-TO-DATE
> Task :runners:spark:2:compileJava FROM-CACHE
> Task :runners:spark:2:classes
> Task :runners:spark:3:compileJava FROM-CACHE
> Task :runners:spark:3:classes
> Task :runners:portability:java:jar
> Task :runners:spark:2:jar
> Task :runners:spark:3:jar
> Task :runners:core-java:compileTestJava FROM-CACHE
> Task :runners:core-java:testClasses UP-TO-DATE
> Task :runners:core-java:testJar
> Task :runners:core-construction-java:compileTestJava FROM-CACHE
> Task :runners:core-construction-java:testClasses UP-TO-DATE
> Task :runners:core-construction-java:testJar
> Task :runners:spark:2:compileTestJava FROM-CACHE
> Task :runners:spark:2:testClasses
> Task :runners:spark:3:compileTestJava FROM-CACHE
> Task :runners:spark:3:testClasses
> Task :runners:portability:java:compileTestJava FROM-CACHE
> Task :runners:portability:java:testClasses UP-TO-DATE
> Task :runners:portability:java:testJar
> Task :runners:spark:2:testJar
> Task :runners:spark:3:testJar
> Task :release:go-licenses:java:dockerClean UP-TO-DATE
> Task :sdks:java:container:java8:dockerClean UP-TO-DATE
> Task :release:go-licenses:java:dockerPrepare
> Task :release:go-licenses:java:docker
> Task :sdks:java:container:pullLicenses
Collecting pip
Using cached pip-23.0-py3-none-any.whl (2.1 MB)
Collecting setuptools
Using cached setuptools-67.1.0-py3-none-any.whl (1.1 MB)
Collecting wheel
Using cached wheel-0.38.4-py3-none-any.whl (36 kB)
Installing collected packages: pip, setuptools, wheel
Attempting uninstall: pip
Found existing installation: pip 20.0.2
Uninstalling pip-20.0.2:
Successfully uninstalled pip-20.0.2
Attempting uninstall: setuptools
Found existing installation: setuptools 44.0.0
Uninstalling setuptools-44.0.0:
Successfully uninstalled setuptools-44.0.0
Successfully installed pip-23.0 setuptools-67.1.0 wheel-0.38.4
Collecting beautifulsoup4<5.0,>=4.9.0
Using cached beautifulsoup4-4.11.2-py3-none-any.whl (129 kB)
Collecting pyyaml<6.0.0,>=3.12
Using cached PyYAML-5.4.1-cp38-cp38-manylinux1_x86_64.whl (662 kB)
Collecting tenacity<6.0,>=5.0.2
Using cached tenacity-5.1.5-py2.py3-none-any.whl (34 kB)
Collecting soupsieve>1.2
Using cached soupsieve-2.3.2.post1-py3-none-any.whl (37 kB)
Collecting six>=1.9.0
Using cached six-1.16.0-py2.py3-none-any.whl (11 kB)
Installing collected packages: soupsieve, six, pyyaml, tenacity, beautifulsoup4
Successfully installed beautifulsoup4-4.11.2 pyyaml-5.4.1 six-1.16.0 soupsieve-2.3.2.post1 tenacity-5.1.5
Executing python <https://ci-beam.apache.org/job/beam_PostCommit_Java_PVR_Spark_Batch/ws/src/sdks/java/container/license_scripts/pull_licenses_java.py> --license_index=<https://ci-beam.apache.org/job/beam_PostCommit_Java_PVR_Spark_Batch/ws/src/sdks/java/container/build/reports/dependency-license/index.json> --output_dir=<https://ci-beam.apache.org/job/beam_PostCommit_Java_PVR_Spark_Batch/ws/src/sdks/java/container/build/target/java_third_party_licenses> --dep_url_yaml=<https://ci-beam.apache.org/job/beam_PostCommit_Java_PVR_Spark_Batch/ws/src/sdks/java/container/license_scripts/dep_urls_java.yaml> --manual_license_path=<https://ci-beam.apache.org/job/beam_PostCommit_Java_PVR_Spark_Batch/ws/src/sdks/java/container/license_scripts/manual_licenses>
INFO:root:Pulling license for 124 dependencies using 16 threads.
INFO:root:Replaced local file URL with file://<https://ci-beam.apache.org/job/beam_PostCommit_Java_PVR_Spark_Batch/ws/src/sdks/java/container/license_scripts/manual_licenses/xz/COPYING> for xz-1.5
INFO:root:pull_licenses_java.py succeed. It took 1.374375 seconds with 16 threads.
Copying licenses from <https://ci-beam.apache.org/job/beam_PostCommit_Java_PVR_Spark_Batch/ws/src/sdks/java/container/build/target/java_third_party_licenses> to <https://ci-beam.apache.org/job/beam_PostCommit_Java_PVR_Spark_Batch/ws/src/sdks/java/container/build/target/third_party_licenses.>
Finished license_scripts.sh
> Task :release:go-licenses:java:dockerRun
+ rm -rf '/output/*'
+ go get github.com/apache/beam/sdks/v2/java/container
go: downloading github.com/apache/beam/sdks/v2 v2.44.0
go: downloading github.com/apache/beam v2.44.0+incompatible
go: downloading github.com/golang/protobuf v1.5.2
go: downloading golang.org/x/sys v0.2.0
go: downloading google.golang.org/grpc v1.51.0
go: downloading google.golang.org/protobuf v1.28.1
go: downloading golang.org/x/net v0.2.0
go: downloading google.golang.org/genproto v0.0.0-20221118155620-16455021b5e6
go: downloading golang.org/x/text v0.4.0
> Task :sdks:java:container:java8:copyJavaThirdPartyLicenses
> Task :release:go-licenses:java:dockerRun
go: added github.com/apache/beam/sdks/v2 v2.44.0
go: added github.com/golang/protobuf v1.5.2
go: added golang.org/x/net v0.2.0
go: added golang.org/x/sys v0.2.0
go: added golang.org/x/text v0.4.0
go: added google.golang.org/genproto v0.0.0-20221118155620-16455021b5e6
go: added google.golang.org/grpc v1.51.0
go: added google.golang.org/protobuf v1.28.1
+ go-licenses save github.com/apache/beam/sdks/v2/java/container --save_path=/output/licenses
W0204 16:21:34.944475 31 library.go:101] "golang.org/x/sys/unix" contains non-Go code that can't be inspected for further dependencies:
/go/pkg/mod/golang.org/x/sys@v0.2.0/unix/asm_linux_amd64.s
+ tee /output/licenses/list.csv
+ go-licenses csv github.com/apache/beam/sdks/v2/java/container
W0204 16:21:45.351533 65 library.go:101] "golang.org/x/sys/unix" contains non-Go code that can't be inspected for further dependencies:
/go/pkg/mod/golang.org/x/sys@v0.2.0/unix/asm_linux_amd64.s
> Task :runners:spark:2:job-server:validatesPortableRunnerBatch
> Task :runners:spark:3:job-server:validatesPortableRunnerBatch
> Task :release:go-licenses:java:dockerRun
github.com/apache/beam/sdks/v2/go/pkg/beam,https://github.com/apache/beam/blob/sdks/v2.44.0/sdks/go/README.md,Apache-2.0
github.com/apache/beam/sdks/v2/java/container,https://github.com/apache/beam/blob/sdks/v2.44.0/sdks/LICENSE,Apache-2.0
github.com/golang/protobuf,https://github.com/golang/protobuf/blob/v1.5.2/LICENSE,BSD-3-Clause
golang.org/x/net,https://cs.opensource.google/go/x/net/+/v0.2.0:LICENSE,BSD-3-Clause
golang.org/x/sys/unix,https://cs.opensource.google/go/x/sys/+/v0.2.0:LICENSE,BSD-3-Clause
golang.org/x/text,https://cs.opensource.google/go/x/text/+/v0.4.0:LICENSE,BSD-3-Clause
google.golang.org/genproto/googleapis/rpc/status,https://github.com/googleapis/go-genproto/blob/16455021b5e6/LICENSE,Apache-2.0
google.golang.org/grpc,https://github.com/grpc/grpc-go/blob/v1.51.0/LICENSE,Apache-2.0
google.golang.org/protobuf,https://github.com/protocolbuffers/protobuf-go/blob/v1.28.1/LICENSE,BSD-3-Clause
+ chmod -R a+w /output/licenses
> Task :release:go-licenses:java:createLicenses
> Task :sdks:java:container:java8:copyGolangLicenses
> Task :sdks:java:container:java8:dockerPrepare
> Task :sdks:java:container:java8:docker
> Task :runners:spark:2:job-server:validatesPortableRunnerBatch
[shutdown-hook-0] INFO org.apache.spark.util.ShutdownHookManager - Shutdown hook called
[shutdown-hook-0] INFO org.apache.spark.util.ShutdownHookManager - Deleting directory /tmp/spark-7723a585-6d08-4ddd-a5e0-7ca2a4876beb
> Task :runners:spark:3:job-server:validatesPortableRunnerBatch
[shutdown-hook-0] INFO org.apache.spark.util.ShutdownHookManager - Shutdown hook called
[shutdown-hook-0] INFO org.apache.spark.util.ShutdownHookManager - Deleting directory /tmp/spark-58a724aa-34a3-4b6f-89fd-9a785a1074f8
> Task :runners:spark:2:job-server:validatesPortableRunnerBatch
org.apache.beam.sdk.transforms.ParDoTest$TimestampTests > testParDoTaggedOutputWithTimestamp FAILED
java.lang.RuntimeException at ParDoTest.java:2026
> Task :runners:spark:3:job-server:validatesPortableRunnerBatch
org.apache.beam.sdk.transforms.ParDoTest$TimestampTests > testParDoTaggedOutputWithTimestamp FAILED
java.lang.RuntimeException at ParDoTest.java:2026
> Task :runners:spark:2:job-server:validatesPortableRunnerBatch
[grpc-default-executor-44] INFO org.apache.beam.runners.fnexecution.logging.GrpcLoggingService - Logging client hanged up.
[shutdown-hook-0] INFO org.apache.spark.util.ShutdownHookManager - Shutdown hook called
[shutdown-hook-0] INFO org.apache.spark.util.ShutdownHookManager - Deleting directory /tmp/spark-c69f7192-11c5-4aeb-be86-81139333dc86
> Task :runners:spark:3:job-server:validatesPortableRunnerBatch
[grpc-default-executor-45] INFO org.apache.beam.runners.fnexecution.logging.GrpcLoggingService - Logging client hanged up.
[shutdown-hook-0] INFO org.apache.spark.util.ShutdownHookManager - Shutdown hook called
[shutdown-hook-0] INFO org.apache.spark.util.ShutdownHookManager - Deleting directory /tmp/spark-49264a9a-a5ea-4af4-b13a-224a4b72a065
> Task :runners:spark:2:job-server:validatesPortableRunnerBatch
[shutdown-hook-0] INFO org.apache.spark.util.ShutdownHookManager - Shutdown hook called
[shutdown-hook-0] INFO org.apache.spark.util.ShutdownHookManager - Deleting directory /tmp/spark-acf26aec-fe1b-4d0f-ae6e-295ea040365d
> Task :runners:spark:3:job-server:validatesPortableRunnerBatch
[shutdown-hook-0] INFO org.apache.spark.util.ShutdownHookManager - Shutdown hook called
[shutdown-hook-0] INFO org.apache.spark.util.ShutdownHookManager - Deleting directory /tmp/spark-4920c1fd-a22f-4a66-b715-8c3f3253d301
> Task :runners:spark:2:job-server:validatesPortableRunnerBatch
[grpc-default-executor-154] INFO org.apache.beam.runners.fnexecution.logging.GrpcLoggingService - Logging client hanged up.
[shutdown-hook-0] INFO org.apache.spark.util.ShutdownHookManager - Shutdown hook called
[shutdown-hook-0] INFO org.apache.spark.util.ShutdownHookManager - Deleting directory /tmp/spark-4e055ae5-07d3-43a4-b30b-b7a013f88c84
229 tests completed, 1 failed, 1 skipped
> Task :runners:spark:2:job-server:validatesPortableRunnerBatch FAILED
> Task :runners:spark:2:job-server:validatesPortableRunnerDocker FROM-CACHE
> Task :runners:spark:3:job-server:validatesPortableRunnerBatch
[shutdown-hook-0] INFO org.apache.spark.util.ShutdownHookManager - Shutdown hook called
[shutdown-hook-0] INFO org.apache.spark.util.ShutdownHookManager - Deleting directory /tmp/spark-2e6a3595-40a4-4d35-bba9-741ea2ce5432
229 tests completed, 1 failed, 1 skipped
> Task :runners:spark:3:job-server:validatesPortableRunnerBatch FAILED
> Task :runners:spark:3:job-server:validatesPortableRunnerDocker FROM-CACHE
FAILURE: Build completed with 2 failures.
1: Task failed with an exception.
-----------
* What went wrong:
Execution failed for task ':runners:spark:2:job-server:validatesPortableRunnerBatch'.
> There were failing tests. See the report at: file://<https://ci-beam.apache.org/job/beam_PostCommit_Java_PVR_Spark_Batch/ws/src/runners/spark/2/job-server/build/reports/tests/validatesPortableRunnerBatch/index.html>
* Try:
> Run with --stacktrace option to get the stack trace.
> Run with --info or --debug option to get more log output.
==============================================================================
2: Task failed with an exception.
-----------
* What went wrong:
Execution failed for task ':runners:spark:3:job-server:validatesPortableRunnerBatch'.
> There were failing tests. See the report at: file://<https://ci-beam.apache.org/job/beam_PostCommit_Java_PVR_Spark_Batch/ws/src/runners/spark/3/job-server/build/reports/tests/validatesPortableRunnerBatch/index.html>
* Try:
> Run with --stacktrace option to get the stack trace.
> Run with --info or --debug option to get more log output.
==============================================================================
* Get more help at https://help.gradle.org
Deprecated Gradle features were used in this build, making it incompatible with Gradle 8.0.
You can use '--warning-mode all' to show the individual deprecation warnings and determine if they come from your own scripts or plugins.
See https://docs.gradle.org/7.5.1/userguide/command_line_interface.html#sec:command_line_warnings
Execution optimizations have been disabled for 1 invalid unit(s) of work during this build to ensure correctness.
Please consult deprecation warnings for more details.
BUILD FAILED in 2h 20m 44s
119 actionable tasks: 77 executed, 38 from cache, 4 up-to-date
Publishing build scan...
https://gradle.com/s/ttgrhpywlvudg
Build step 'Invoke Gradle script' changed build result to FAILURE
Build step 'Invoke Gradle script' marked build as failure
---------------------------------------------------------------------
To unsubscribe, e-mail: builds-unsubscribe@beam.apache.org
For additional commands, e-mail: builds-help@beam.apache.org
Build failed in Jenkins: beam_PostCommit_Java_PVR_Spark_Batch #1616
Posted by Apache Jenkins Server <je...@builds.apache.org>.
See <https://ci-beam.apache.org/job/beam_PostCommit_Java_PVR_Spark_Batch/1616/display/redirect>
Changes:
------------------------------------------
[...truncated 193.62 KB...]
role_payload: "\nCaccessors-smart-1.2-DHwmXWL8AHEk3DK5EzbpxCcmUdYpvF-hpOTjvHWOsuQ.jar"
}
dependencies {
type_urn: "beam:artifact:type:file:v1"
type_payload: "\n\242\001/tmp/beam-artifact-staging/40a8cb9cf1ba769853abd46e826c258986cc4b071310ac3d632905f05db5262a/346-EMBEDDED-asm-5.0.4-iWYY7YrmJwJSGni8e-QrfEkaCOaSChX4mj7N7DHpoiA.jar"
role_urn: "beam:artifact:role:staging_to:v1"
role_payload: "\n9asm-5.0.4-iWYY7YrmJwJSGni8e-QrfEkaCOaSChX4mj7N7DHpoiA.jar"
}
dependencies {
type_urn: "beam:artifact:type:file:v1"
type_payload: "\n\242\001/tmp/beam-artifact-staging/40a8cb9cf1ba769853abd46e826c258986cc4b071310ac3d632905f05db5262a/347-EMBEDDED-ST4-4.0.8-WMqrxAyfdLC1mT_YaOD2SlDAdZCU5qJRqq-tmO38ejs.jar"
role_urn: "beam:artifact:role:staging_to:v1"
role_payload: "\n9ST4-4.0.8-WMqrxAyfdLC1mT_YaOD2SlDAdZCU5qJRqq-tmO38ejs.jar"
}
dependencies {
type_urn: "beam:artifact:type:file:v1"
type_payload: "\n\254\001/tmp/beam-artifact-staging/40a8cb9cf1ba769853abd46e826c258986cc4b071310ac3d632905f05db5262a/348-EMBEDDED-antlr-runtime-3.5.2-zj_I7LEPOemjzdy7LONQ0nLZzT0LHhjm_nPDuTichzQ.jar"
role_urn: "beam:artifact:role:staging_to:v1"
role_payload: "\nCantlr-runtime-3.5.2-zj_I7LEPOemjzdy7LONQ0nLZzT0LHhjm_nPDuTichzQ.jar"
}
dependencies {
type_urn: "beam:artifact:type:file:v1"
type_payload: "\n\257\001/tmp/beam-artifact-staging/40a8cb9cf1ba769853abd46e826c258986cc4b071310ac3d632905f05db5262a/349-EMBEDDED-hadoop-apache2-3.2.0-1-utOlhQMw_MZxskVG0O3_tp_lQEfNFCpS6pyHz3TPVKA.jar"
role_urn: "beam:artifact:role:staging_to:v1"
role_payload: "\nFhadoop-apache2-3.2.0-1-utOlhQMw_MZxskVG0O3_tp_lQEfNFCpS6pyHz3TPVKA.jar"
}
dependencies {
type_urn: "beam:artifact:type:file:v1"
type_payload: "\n\262\001/tmp/beam-artifact-staging/40a8cb9cf1ba769853abd46e826c258986cc4b071310ac3d632905f05db5262a/350-EMBEDDED-checker-compat-qual-2.5.3-12ua_qYcfAgpCAI_DLwUJ_q5q9LfkVyLij56UJvMvG0.jar"
role_urn: "beam:artifact:role:staging_to:v1"
role_payload: "\nIchecker-compat-qual-2.5.3-12ua_qYcfAgpCAI_DLwUJ_q5q9LfkVyLij56UJvMvG0.jar"
}
dependencies {
type_urn: "beam:artifact:type:file:v1"
type_payload: "\n\250\001/tmp/beam-artifact-staging/40a8cb9cf1ba769853abd46e826c258986cc4b071310ac3d632905f05db5262a/351-EMBEDDED-disruptor-3.4.2-9BLsuyNcJGC0XmNYQQlyPeqNlLgZx4yb_Dj1DLqFRsA.jar"
role_urn: "beam:artifact:role:staging_to:v1"
role_payload: "\n?disruptor-3.4.2-9BLsuyNcJGC0XmNYQQlyPeqNlLgZx4yb_Dj1DLqFRsA.jar"
}
dependencies {
type_urn: "beam:artifact:type:file:v1"
type_payload: "\n\254\001/tmp/beam-artifact-staging/40a8cb9cf1ba769853abd46e826c258986cc4b071310ac3d632905f05db5262a/352-EMBEDDED-annotations-4.1.1.4-unNOHoTAnWFa9qCdMwNLTwRC-Hct7BIO-zdthqVlrhU.jar"
role_urn: "beam:artifact:role:staging_to:v1"
role_payload: "\nCannotations-4.1.1.4-unNOHoTAnWFa9qCdMwNLTwRC-Hct7BIO-zdthqVlrhU.jar"
}
dependencies {
type_urn: "beam:artifact:type:file:v1"
type_payload: "\n\270\001/tmp/beam-artifact-staging/40a8cb9cf1ba769853abd46e826c258986cc4b071310ac3d632905f05db5262a/353-EMBEDDED-animal-sniffer-annotations-1.22-8lt6jhYLEwXqcfxhqD-XUEA90jrE3cbcsEkC8EqT8Qc.jar"
role_urn: "beam:artifact:role:staging_to:v1"
role_payload: "\nOanimal-sniffer-annotations-1.22-8lt6jhYLEwXqcfxhqD-XUEA90jrE3cbcsEkC8EqT8Qc.jar"
}
dependencies {
type_urn: "beam:artifact:type:file:v1"
type_payload: "\n\254\001/tmp/beam-artifact-staging/40a8cb9cf1ba769853abd46e826c258986cc4b071310ac3d632905f05db5262a/354-EMBEDDED-perfmark-api-0.26.0-t9I-k6NFN84zJwgmmg0UBHiKW14ZSegvVTX85Rs-qVs.jar"
role_urn: "beam:artifact:role:staging_to:v1"
role_payload: "\nCperfmark-api-0.26.0-t9I-k6NFN84zJwgmmg0UBHiKW14ZSegvVTX85Rs-qVs.jar"
}
dependencies {
type_urn: "beam:artifact:type:file:v1"
type_payload: "\n\251\001/tmp/beam-artifact-staging/40a8cb9cf1ba769853abd46e826c258986cc4b071310ac3d632905f05db5262a/355-EMBEDDED-threetenbp-1.6.5-slUWBMDWUWQo4wZSE7dEYSQDeKB2IiAaN60yY47LQXw.jar"
role_urn: "beam:artifact:role:staging_to:v1"
role_payload: "\n@threetenbp-1.6.5-slUWBMDWUWQo4wZSE7dEYSQDeKB2IiAaN60yY47LQXw.jar"
}
dependencies {
type_urn: "beam:artifact:type:file:v1"
type_payload: "\n\245\001/tmp/beam-artifact-staging/40a8cb9cf1ba769853abd46e826c258986cc4b071310ac3d632905f05db5262a/356-EMBEDDED-okhttp-2.7.5-iKyf0btR-CvMZkzB65wiXJDcQ4nWYCMbTMc3vr_n0Ko.jar"
role_urn: "beam:artifact:role:staging_to:v1"
role_payload: "\n<okhttp-2.7.5-iKyf0btR-CvMZkzB65wiXJDcQ4nWYCMbTMc3vr_n0Ko.jar"
}
dependencies {
type_urn: "beam:artifact:type:file:v1"
type_payload: "\n\265\001/tmp/beam-artifact-staging/40a8cb9cf1ba769853abd46e826c258986cc4b071310ac3d632905f05db5262a/357-EMBEDDED-aopalliance-repackaged-2.6.1-utd_knjXU0BjYK-eR0e9mzFhVU6pzT1iQRoK4fLBQf0.jar"
role_urn: "beam:artifact:role:staging_to:v1"
role_payload: "\nLaopalliance-repackaged-2.6.1-utd_knjXU0BjYK-eR0e9mzFhVU6pzT1iQRoK4fLBQf0.jar"
}
dependencies {
type_urn: "beam:artifact:type:file:v1"
type_payload: "\n\261\001/tmp/beam-artifact-staging/40a8cb9cf1ba769853abd46e826c258986cc4b071310ac3d632905f05db5262a/358-EMBEDDED-servlet-api-2.5-20081211-BodWCWmW_gD2BKw7ZnLW9mPcd36kqDBW4kDQRW535HI.jar"
role_urn: "beam:artifact:role:staging_to:v1"
role_payload: "\nHservlet-api-2.5-20081211-BodWCWmW_gD2BKw7ZnLW9mPcd36kqDBW4kDQRW535HI.jar"
}
dependencies {
type_urn: "beam:artifact:type:file:v1"
type_payload: "\n\263\001/tmp/beam-artifact-staging/40a8cb9cf1ba769853abd46e826c258986cc4b071310ac3d632905f05db5262a/359-EMBEDDED-jakarta.xml.bind-api-2.3.3-wEU59HLppt0MdoXqgtZ3KCJpq457rKLhRQDjgeDGzsU.jar"
role_urn: "beam:artifact:role:staging_to:v1"
role_payload: "\nJjakarta.xml.bind-api-2.3.3-wEU59HLppt0MdoXqgtZ3KCJpq457rKLhRQDjgeDGzsU.jar"
}
dependencies {
type_urn: "beam:artifact:type:file:v1"
type_payload: "\n\261\001/tmp/beam-artifact-staging/40a8cb9cf1ba769853abd46e826c258986cc4b071310ac3d632905f05db5262a/360-EMBEDDED-jakarta.activation-1.2.2-AhVnc-SunQSNFKVq011kS-6fEFKnkdBy3z3tPGVubho.jar"
role_urn: "beam:artifact:role:staging_to:v1"
role_payload: "\nHjakarta.activation-1.2.2-AhVnc-SunQSNFKVq011kS-6fEFKnkdBy3z3tPGVubho.jar"
}
dependencies {
type_urn: "beam:artifact:type:file:v1"
type_payload: "\n\257\001/tmp/beam-artifact-staging/40a8cb9cf1ba769853abd46e826c258986cc4b071310ac3d632905f05db5262a/361-EMBEDDED-jcip-annotations-1.0-1-T8z_g4Kq_FiZYsTtsmL2qlleNPHhHmEFfRxqluj8cyM.jar"
role_urn: "beam:artifact:role:staging_to:v1"
role_payload: "\nFjcip-annotations-1.0-1-T8z_g4Kq_FiZYsTtsmL2qlleNPHhHmEFfRxqluj8cyM.jar"
}
dependencies {
type_urn: "beam:artifact:type:file:v1"
type_payload: "\n\252\001/tmp/beam-artifact-staging/40a8cb9cf1ba769853abd46e826c258986cc4b071310ac3d632905f05db5262a/362-EMBEDDED-spring-jcl-5.3.18-V2mq4Oat3Y9fWcus0bBjXYGYUeZrrsT859bB-tH6344.jar"
role_urn: "beam:artifact:role:staging_to:v1"
role_payload: "\nAspring-jcl-5.3.18-V2mq4Oat3Y9fWcus0bBjXYGYUeZrrsT859bB-tH6344.jar"
}
dependencies {
type_urn: "beam:artifact:type:file:v1"
type_payload: "\n\270\001/tmp/beam-artifact-staging/40a8cb9cf1ba769853abd46e826c258986cc4b071310ac3d632905f05db5262a/363-EMBEDDED-org.abego.treelayout.core-1.0.3--l4xOVw5wufUasoPgfcgYJMWB7L6Qb02A46yy2-5MyY.jar"
role_urn: "beam:artifact:role:staging_to:v1"
role_payload: "\nOorg.abego.treelayout.core-1.0.3--l4xOVw5wufUasoPgfcgYJMWB7L6Qb02A46yy2-5MyY.jar"
}
dependencies {
type_urn: "beam:artifact:type:file:v1"
type_payload: "\n\251\001/tmp/beam-artifact-staging/40a8cb9cf1ba769853abd46e826c258986cc4b071310ac3d632905f05db5262a/364-EMBEDDED-javax.json-1.0.4-Dh3sQKHt6WWUElHtqWiu7gUsxPUDeLwxbMSOgVm9vrQ.jar"
role_urn: "beam:artifact:role:staging_to:v1"
role_payload: "\n@javax.json-1.0.4-Dh3sQKHt6WWUElHtqWiu7gUsxPUDeLwxbMSOgVm9vrQ.jar"
}
dependencies {
type_urn: "beam:artifact:type:file:v1"
type_payload: "\n\243\001/tmp/beam-artifact-staging/40a8cb9cf1ba769853abd46e826c258986cc4b071310ac3d632905f05db5262a/365-EMBEDDED-icu4j-58.2-lT4eg7K-fD6i-I2obBNhT0fp5x01eMhSHX8Yd1a2OWI.jar"
role_urn: "beam:artifact:role:staging_to:v1"
role_payload: "\n:icu4j-58.2-lT4eg7K-fD6i-I2obBNhT0fp5x01eMhSHX8Yd1a2OWI.jar"
}
dependencies {
type_urn: "beam:artifact:type:file:v1"
type_payload: "\n\252\001/tmp/beam-artifact-staging/40a8cb9cf1ba769853abd46e826c258986cc4b071310ac3d632905f05db5262a/366-EMBEDDED-auto-value-1.10.1-6ngBDYLv2y-Rmxb67Z5kJ_B9KZihXE9hnNxqYWTs0zY.jar"
role_urn: "beam:artifact:role:staging_to:v1"
role_payload: "\nAauto-value-1.10.1-6ngBDYLv2y-Rmxb67Z5kJ_B9KZihXE9hnNxqYWTs0zY.jar"
}
dependencies {
type_urn: "beam:artifact:type:file:v1"
type_payload: "\n\263\001/tmp/beam-artifact-staging/40a8cb9cf1ba769853abd46e826c258986cc4b071310ac3d632905f05db5262a/367-EMBEDDED-javax.annotation-api-1.3.2-4EulGVvNVV3JVlD3zGFNFR5LzVLSmhC4qiGX86uJq5s.jar"
role_urn: "beam:artifact:role:staging_to:v1"
role_payload: "\nJjavax.annotation-api-1.3.2-4EulGVvNVV3JVlD3zGFNFR5LzVLSmhC4qiGX86uJq5s.jar"
}
dependencies {
type_urn: "beam:artifact:type:file:v1"
type_payload: "\n\243\001/tmp/beam-artifact-staging/40a8cb9cf1ba769853abd46e826c258986cc4b071310ac3d632905f05db5262a/368-EMBEDDED-okio-1.6.0-EUvcH0czimi8vJWr8vXNxyvu7JGBLy_Ne1IcGTeHYmY.jar"
role_urn: "beam:artifact:role:staging_to:v1"
role_payload: "\n:okio-1.6.0-EUvcH0czimi8vJWr8vXNxyvu7JGBLy_Ne1IcGTeHYmY.jar"
}
dependencies {
type_urn: "beam:artifact:type:file:v1"
type_payload: "\n\247\001/tmp/beam-artifact-staging/40a8cb9cf1ba769853abd46e826c258986cc4b071310ac3d632905f05db5262a/369-EMBEDDED-stax-api-1.0-2-6McOvXb5gslYKoLvgs9s4Up9WKSk3KXLe3_JiMgAibc.jar"
role_urn: "beam:artifact:role:staging_to:v1"
role_payload: "\n>stax-api-1.0-2-6McOvXb5gslYKoLvgs9s4Up9WKSk3KXLe3_JiMgAibc.jar"
}
dependencies {
type_urn: "beam:artifact:type:file:v1"
type_payload: "\n\242\001/tmp/beam-artifact-staging/40a8cb9cf1ba769853abd46e826c258986cc4b071310ac3d632905f05db5262a/370-EMBEDDED-guice-3.0-GlnQQh_9NVzAtwtC3xwumvdEyKLQyS2jefX8ovB_HSI.jar"
role_urn: "beam:artifact:role:staging_to:v1"
role_payload: "\n9guice-3.0-GlnQQh_9NVzAtwtC3xwumvdEyKLQyS2jefX8ovB_HSI.jar"
}
dependencies {
type_urn: "beam:artifact:type:file:v1"
type_payload: "\n\275\001/tmp/beam-artifact-staging/40a8cb9cf1ba769853abd46e826c258986cc4b071310ac3d632905f05db5262a/371-EMBEDDED-geronimo-jcache_1.0_spec-1.0-alpha-1-AHChLlj0kblXGTkTJSmaYpRTDubDziXlC9yYsLcAlmw.jar"
role_urn: "beam:artifact:role:staging_to:v1"
role_payload: "\nTgeronimo-jcache_1.0_spec-1.0-alpha-1-AHChLlj0kblXGTkTJSmaYpRTDubDziXlC9yYsLcAlmw.jar"
}
dependencies {
type_urn: "beam:artifact:type:file:v1"
type_payload: "\n\256\001/tmp/beam-artifact-staging/40a8cb9cf1ba769853abd46e826c258986cc4b071310ac3d632905f05db5262a/372-EMBEDDED-mssql-jdbc-6.2.1.jre7-nPollFCuNHHS5uLD2K78ziNuPa74s3NNIdyTw6W76AY.jar"
role_urn: "beam:artifact:role:staging_to:v1"
role_payload: "\nEmssql-jdbc-6.2.1.jre7-nPollFCuNHHS5uLD2K78ziNuPa74s3NNIdyTw6W76AY.jar"
}
dependencies {
type_urn: "beam:artifact:type:file:v1"
type_payload: "\n\247\001/tmp/beam-artifact-staging/40a8cb9cf1ba769853abd46e826c258986cc4b071310ac3d632905f05db5262a/373-EMBEDDED-javax.inject-1-kcdwRKUMSBY2wy2Rb9ickRinIZU5BFLIEGUID5V95_8.jar"
role_urn: "beam:artifact:role:staging_to:v1"
role_payload: "\n>javax.inject-1-kcdwRKUMSBY2wy2Rb9ickRinIZU5BFLIEGUID5V95_8.jar"
}
dependencies {
type_urn: "beam:artifact:type:file:v1"
type_payload: "\n\250\001/tmp/beam-artifact-staging/40a8cb9cf1ba769853abd46e826c258986cc4b071310ac3d632905f05db5262a/374-EMBEDDED-aopalliance-1.0-Ct3sZw_tzT8RPFyAkdeDKA0j9146y4QbYanNsHk3agg.jar"
role_urn: "beam:artifact:role:staging_to:v1"
role_payload: "\n?aopalliance-1.0-Ct3sZw_tzT8RPFyAkdeDKA0j9146y4QbYanNsHk3agg.jar"
}
dependencies {
type_urn: "beam:artifact:type:file:v1"
type_payload: "\n\256\001/tmp/beam-artifact-staging/40a8cb9cf1ba769853abd46e826c258986cc4b071310ac3d632905f05db5262a/375-EMBEDDED-cglib-2.2.1-v20090111-QuHfsmvsvxpjPyW0fjn8xCK4XnfkwEaNmkT4hfX6C-I.jar"
role_urn: "beam:artifact:role:staging_to:v1"
role_payload: "\nEcglib-2.2.1-v20090111-QuHfsmvsvxpjPyW0fjn8xCK4XnfkwEaNmkT4hfX6C-I.jar"
}
[ScheduledExecutor-thread] WARN org.apache.beam.sdk.fn.data.BeamFnDataGrpcMultiplexer - Hanged up for unknown endpoint.
[grpc-default-executor-142] ERROR org.apache.beam.sdk.fn.data.BeamFnDataGrpcMultiplexer - Failed to handle for url: "InProcessServer_568"
org.apache.beam.vendor.grpc.v1p48p1.io.grpc.StatusRuntimeException: CANCELLED: Multiplexer hanging up
at org.apache.beam.vendor.grpc.v1p48p1.io.grpc.Status.asRuntimeException(Status.java:535)
at org.apache.beam.vendor.grpc.v1p48p1.io.grpc.stub.ClientCalls$StreamObserverToCallListenerAdapter.onClose(ClientCalls.java:487)
at org.apache.beam.vendor.grpc.v1p48p1.io.grpc.internal.ClientCallImpl.closeObserver(ClientCallImpl.java:562)
at org.apache.beam.vendor.grpc.v1p48p1.io.grpc.internal.ClientCallImpl.access$300(ClientCallImpl.java:70)
at org.apache.beam.vendor.grpc.v1p48p1.io.grpc.internal.ClientCallImpl$ClientStreamListenerImpl$1StreamClosed.runInternal(ClientCallImpl.java:743)
at org.apache.beam.vendor.grpc.v1p48p1.io.grpc.internal.ClientCallImpl$ClientStreamListenerImpl$1StreamClosed.runInContext(ClientCallImpl.java:722)
at org.apache.beam.vendor.grpc.v1p48p1.io.grpc.internal.ContextRunnable.run(ContextRunnable.java:37)
at org.apache.beam.vendor.grpc.v1p48p1.io.grpc.internal.SerializingExecutor.run(SerializingExecutor.java:133)
at java.util.concurrent.ThreadPoolExecutor.runWorker(ThreadPoolExecutor.java:1149)
at java.util.concurrent.ThreadPoolExecutor$Worker.run(ThreadPoolExecutor.java:624)
at java.lang.Thread.run(Thread.java:750)
229 tests completed, 1 failed, 1 skipped
> Task :runners:spark:3:job-server:validatesPortableRunnerBatch FAILED
> Task :runners:spark:3:job-server:validatesPortableRunnerDocker
[shutdown-hook-0] INFO org.apache.spark.util.ShutdownHookManager - Shutdown hook called
[shutdown-hook-0] INFO org.apache.spark.util.ShutdownHookManager - Deleting directory /tmp/spark-acf46e56-3c9e-43aa-af24-761d8879f546
FAILURE: Build completed with 2 failures.
1: Task failed with an exception.
-----------
* What went wrong:
Execution failed for task ':runners:spark:2:job-server:validatesPortableRunnerBatch'.
> There were failing tests. See the report at: file://<https://ci-beam.apache.org/job/beam_PostCommit_Java_PVR_Spark_Batch/ws/src/runners/spark/2/job-server/build/reports/tests/validatesPortableRunnerBatch/index.html>
* Try:
> Run with --stacktrace option to get the stack trace.
> Run with --info or --debug option to get more log output.
==============================================================================
2: Task failed with an exception.
-----------
* What went wrong:
Execution failed for task ':runners:spark:3:job-server:validatesPortableRunnerBatch'.
> There were failing tests. See the report at: file://<https://ci-beam.apache.org/job/beam_PostCommit_Java_PVR_Spark_Batch/ws/src/runners/spark/3/job-server/build/reports/tests/validatesPortableRunnerBatch/index.html>
* Try:
> Run with --stacktrace option to get the stack trace.
> Run with --info or --debug option to get more log output.
==============================================================================
* Get more help at https://help.gradle.org
Deprecated Gradle features were used in this build, making it incompatible with Gradle 8.0.
You can use '--warning-mode all' to show the individual deprecation warnings and determine if they come from your own scripts or plugins.
See https://docs.gradle.org/7.5.1/userguide/command_line_interface.html#sec:command_line_warnings
Execution optimizations have been disabled for 1 invalid unit(s) of work during this build to ensure correctness.
Please consult deprecation warnings for more details.
BUILD FAILED in 2h 14m 26s
119 actionable tasks: 79 executed, 36 from cache, 4 up-to-date
Publishing build scan...
https://gradle.com/s/hjafi6hsz7qa6
Build step 'Invoke Gradle script' changed build result to FAILURE
Build step 'Invoke Gradle script' marked build as failure
---------------------------------------------------------------------
To unsubscribe, e-mail: builds-unsubscribe@beam.apache.org
For additional commands, e-mail: builds-help@beam.apache.org