You are viewing a plain text version of this content. The canonical link for it is here.
Posted to dev@lucene.apache.org by Policeman Jenkins Server <je...@thetaphi.de> on 2016/04/08 06:39:22 UTC

[JENKINS-EA] Lucene-Solr-master-Linux (32bit/jdk-9-ea+112-patched) - Build # 16454 - Failure!

Build: http://jenkins.thetaphi.de/job/Lucene-Solr-master-Linux/16454/
Java: 32bit/jdk-9-ea+112-patched -client -XX:+UseConcMarkSweepGC -XX:-CompactStrings

1 tests failed.
FAILED:  org.apache.lucene.spatial3d.TestGeo3DPoint.testShapeQueryToString

Error Message:
expected:<...at=0.772208221547936[6], lon=0.135607475210...> but was:<...at=0.772208221547936[7], lon=0.135607475210...>

Stack Trace:
org.junit.ComparisonFailure: expected:<...at=0.772208221547936[6], lon=0.135607475210...> but was:<...at=0.772208221547936[7], lon=0.135607475210...>
	at __randomizedtesting.SeedInfo.seed([53C51195ABB393AB:7A53CE6389410B27]:0)
	at org.junit.Assert.assertEquals(Assert.java:125)
	at org.junit.Assert.assertEquals(Assert.java:147)
	at org.apache.lucene.spatial3d.TestGeo3DPoint.testShapeQueryToString(TestGeo3DPoint.java:735)
	at sun.reflect.NativeMethodAccessorImpl.invoke0(java.base@9-ea/Native Method)
	at sun.reflect.NativeMethodAccessorImpl.invoke(java.base@9-ea/NativeMethodAccessorImpl.java:62)
	at sun.reflect.DelegatingMethodAccessorImpl.invoke(java.base@9-ea/DelegatingMethodAccessorImpl.java:43)
	at java.lang.reflect.Method.invoke(java.base@9-ea/Method.java:531)
	at com.carrotsearch.randomizedtesting.RandomizedRunner.invoke(RandomizedRunner.java:1764)
	at com.carrotsearch.randomizedtesting.RandomizedRunner$8.evaluate(RandomizedRunner.java:871)
	at com.carrotsearch.randomizedtesting.RandomizedRunner$9.evaluate(RandomizedRunner.java:907)
	at com.carrotsearch.randomizedtesting.RandomizedRunner$10.evaluate(RandomizedRunner.java:921)
	at org.apache.lucene.util.TestRuleSetupTeardownChained$1.evaluate(TestRuleSetupTeardownChained.java:49)
	at org.apache.lucene.util.AbstractBeforeAfterRule$1.evaluate(AbstractBeforeAfterRule.java:45)
	at org.apache.lucene.util.TestRuleThreadAndTestName$1.evaluate(TestRuleThreadAndTestName.java:48)
	at org.apache.lucene.util.TestRuleIgnoreAfterMaxFailures$1.evaluate(TestRuleIgnoreAfterMaxFailures.java:64)
	at org.apache.lucene.util.TestRuleMarkFailure$1.evaluate(TestRuleMarkFailure.java:47)
	at com.carrotsearch.randomizedtesting.rules.StatementAdapter.evaluate(StatementAdapter.java:36)
	at com.carrotsearch.randomizedtesting.ThreadLeakControl$StatementRunner.run(ThreadLeakControl.java:367)
	at com.carrotsearch.randomizedtesting.ThreadLeakControl.forkTimeoutingTask(ThreadLeakControl.java:809)
	at com.carrotsearch.randomizedtesting.ThreadLeakControl$3.evaluate(ThreadLeakControl.java:460)
	at com.carrotsearch.randomizedtesting.RandomizedRunner.runSingleTest(RandomizedRunner.java:880)
	at com.carrotsearch.randomizedtesting.RandomizedRunner$5.evaluate(RandomizedRunner.java:781)
	at com.carrotsearch.randomizedtesting.RandomizedRunner$6.evaluate(RandomizedRunner.java:816)
	at com.carrotsearch.randomizedtesting.RandomizedRunner$7.evaluate(RandomizedRunner.java:827)
	at org.apache.lucene.util.AbstractBeforeAfterRule$1.evaluate(AbstractBeforeAfterRule.java:45)
	at com.carrotsearch.randomizedtesting.rules.StatementAdapter.evaluate(StatementAdapter.java:36)
	at org.apache.lucene.util.TestRuleStoreClassName$1.evaluate(TestRuleStoreClassName.java:41)
	at com.carrotsearch.randomizedtesting.rules.NoShadowingOrOverridesOnMethodsRule$1.evaluate(NoShadowingOrOverridesOnMethodsRule.java:40)
	at com.carrotsearch.randomizedtesting.rules.NoShadowingOrOverridesOnMethodsRule$1.evaluate(NoShadowingOrOverridesOnMethodsRule.java:40)
	at com.carrotsearch.randomizedtesting.rules.StatementAdapter.evaluate(StatementAdapter.java:36)
	at com.carrotsearch.randomizedtesting.rules.StatementAdapter.evaluate(StatementAdapter.java:36)
	at com.carrotsearch.randomizedtesting.rules.StatementAdapter.evaluate(StatementAdapter.java:36)
	at org.apache.lucene.util.TestRuleAssertionsRequired$1.evaluate(TestRuleAssertionsRequired.java:53)
	at org.apache.lucene.util.TestRuleMarkFailure$1.evaluate(TestRuleMarkFailure.java:47)
	at org.apache.lucene.util.TestRuleIgnoreAfterMaxFailures$1.evaluate(TestRuleIgnoreAfterMaxFailures.java:64)
	at org.apache.lucene.util.TestRuleIgnoreTestSuites$1.evaluate(TestRuleIgnoreTestSuites.java:54)
	at com.carrotsearch.randomizedtesting.rules.StatementAdapter.evaluate(StatementAdapter.java:36)
	at com.carrotsearch.randomizedtesting.ThreadLeakControl$StatementRunner.run(ThreadLeakControl.java:367)
	at java.lang.Thread.run(java.base@9-ea/Thread.java:804)




Build Log:
[...truncated 9003 lines...]
   [junit4] Suite: org.apache.lucene.spatial3d.TestGeo3DPoint
   [junit4] IGNOR/A 0.00s J0 | TestGeo3DPoint.testRandomBig
   [junit4]    > Assumption #1: 'nightly' test group is disabled (@Nightly())
   [junit4]   2> NOTE: reproduce with: ant test  -Dtestcase=TestGeo3DPoint -Dtests.method=testShapeQueryToString -Dtests.seed=53C51195ABB393AB -Dtests.multiplier=3 -Dtests.slow=true -Dtests.locale=en-SD -Dtests.timezone=America/Dawson -Dtests.asserts=true -Dtests.file.encoding=US-ASCII
   [junit4] FAILURE 0.00s J0 | TestGeo3DPoint.testShapeQueryToString <<<
   [junit4]    > Throwable #1: org.junit.ComparisonFailure: expected:<...at=0.772208221547936[6], lon=0.135607475210...> but was:<...at=0.772208221547936[7], lon=0.135607475210...>
   [junit4]    > 	at __randomizedtesting.SeedInfo.seed([53C51195ABB393AB:7A53CE6389410B27]:0)
   [junit4]    > 	at org.apache.lucene.spatial3d.TestGeo3DPoint.testShapeQueryToString(TestGeo3DPoint.java:735)
   [junit4]    > 	at java.lang.Thread.run(java.base@9-ea/Thread.java:804)
   [junit4]   2> NOTE: leaving temporary files on disk at: /home/jenkins/workspace/Lucene-Solr-master-Linux/lucene/build/spatial3d/test/J0/temp/lucene.spatial3d.TestGeo3DPoint_53C51195ABB393AB-001
   [junit4]   2> NOTE: test params are: codec=Asserting(Lucene60): {id=PostingsFormat(name=LuceneFixedGap)}, docValues:{id=DocValuesFormat(name=Lucene54)}, maxPointsInLeafNode=970, maxMBSortInHeap=5.647299047073666, sim=ClassicSimilarity, locale=en-SD, timezone=America/Dawson
   [junit4]   2> NOTE: Linux 4.2.0-34-generic i386/Oracle Corporation 9-ea (32-bit)/cpus=12,threads=1,free=11322144,total=31457280
   [junit4]   2> NOTE: All tests run in this JVM: [XYZSolidTest, TestGeo3DPoint]
   [junit4] Completed [10/10 (1!)] on J0 in 43.83s, 12 tests, 1 failure, 1 skipped <<< FAILURES!

[...truncated 11 lines...]
BUILD FAILED
/home/jenkins/workspace/Lucene-Solr-master-Linux/build.xml:740: The following error occurred while executing this line:
/home/jenkins/workspace/Lucene-Solr-master-Linux/build.xml:684: The following error occurred while executing this line:
/home/jenkins/workspace/Lucene-Solr-master-Linux/build.xml:59: The following error occurred while executing this line:
/home/jenkins/workspace/Lucene-Solr-master-Linux/lucene/build.xml:476: The following error occurred while executing this line:
/home/jenkins/workspace/Lucene-Solr-master-Linux/lucene/common-build.xml:2187: The following error occurred while executing this line:
/home/jenkins/workspace/Lucene-Solr-master-Linux/lucene/module-build.xml:58: The following error occurred while executing this line:
/home/jenkins/workspace/Lucene-Solr-master-Linux/lucene/common-build.xml:1457: The following error occurred while executing this line:
/home/jenkins/workspace/Lucene-Solr-master-Linux/lucene/common-build.xml:1014: There were test failures: 10 suites, 44 tests, 1 failure, 1 ignored (1 assumption) [seed: 53C51195ABB393AB]

Total time: 32 minutes 2 seconds
Build step 'Invoke Ant' marked build as failure
Archiving artifacts
[WARNINGS] Skipping publisher since build result is FAILURE
Recording test results
Email was triggered for: Failure - Any
Sending email for trigger: Failure - Any



Re: [JENKINS-EA] Lucene-Solr-master-Linux (32bit/jdk-9-ea+112-patched) - Build # 16456 - Still Failing!

Posted by Robert Muir <rc...@gmail.com>.
The test fails because Math.toRadians(44.244272) previously returned
0.7722082215479366 but now returns 0.7722082215479367 in java 9.

See https://issues.apache.org/jira/browse/LUCENE-7194

On Fri, Apr 8, 2016 at 5:09 AM, Policeman Jenkins Server
<je...@thetaphi.de> wrote:
> Build: http://jenkins.thetaphi.de/job/Lucene-Solr-master-Linux/16456/
> Java: 32bit/jdk-9-ea+112-patched -client -XX:+UseG1GC -XX:-CompactStrings
>
> 1 tests failed.
> FAILED:  org.apache.lucene.spatial3d.TestGeo3DPoint.testShapeQueryToString
>
> Error Message:
> expected:<...at=0.772208221547936[6], lon=0.135607475210...> but was:<...at=0.772208221547936[7], lon=0.135607475210...>
>
> Stack Trace:
> org.junit.ComparisonFailure: expected:<...at=0.772208221547936[6], lon=0.135607475210...> but was:<...at=0.772208221547936[7], lon=0.135607475210...>
>         at __randomizedtesting.SeedInfo.seed([2BADA078073D9BC7:23B7F8E25CF034B]:0)
>         at org.junit.Assert.assertEquals(Assert.java:125)
>         at org.junit.Assert.assertEquals(Assert.java:147)
>         at org.apache.lucene.spatial3d.TestGeo3DPoint.testShapeQueryToString(TestGeo3DPoint.java:735)
>         at sun.reflect.NativeMethodAccessorImpl.invoke0(java.base@9-ea/Native Method)
>         at sun.reflect.NativeMethodAccessorImpl.invoke(java.base@9-ea/NativeMethodAccessorImpl.java:62)
>         at sun.reflect.DelegatingMethodAccessorImpl.invoke(java.base@9-ea/DelegatingMethodAccessorImpl.java:43)
>         at java.lang.reflect.Method.invoke(java.base@9-ea/Method.java:531)
>         at com.carrotsearch.randomizedtesting.RandomizedRunner.invoke(RandomizedRunner.java:1764)
>         at com.carrotsearch.randomizedtesting.RandomizedRunner$8.evaluate(RandomizedRunner.java:871)
>         at com.carrotsearch.randomizedtesting.RandomizedRunner$9.evaluate(RandomizedRunner.java:907)
>         at com.carrotsearch.randomizedtesting.RandomizedRunner$10.evaluate(RandomizedRunner.java:921)
>         at org.apache.lucene.util.TestRuleSetupTeardownChained$1.evaluate(TestRuleSetupTeardownChained.java:49)
>         at org.apache.lucene.util.AbstractBeforeAfterRule$1.evaluate(AbstractBeforeAfterRule.java:45)
>         at org.apache.lucene.util.TestRuleThreadAndTestName$1.evaluate(TestRuleThreadAndTestName.java:48)
>         at org.apache.lucene.util.TestRuleIgnoreAfterMaxFailures$1.evaluate(TestRuleIgnoreAfterMaxFailures.java:64)
>         at org.apache.lucene.util.TestRuleMarkFailure$1.evaluate(TestRuleMarkFailure.java:47)
>         at com.carrotsearch.randomizedtesting.rules.StatementAdapter.evaluate(StatementAdapter.java:36)
>         at com.carrotsearch.randomizedtesting.ThreadLeakControl$StatementRunner.run(ThreadLeakControl.java:367)
>         at com.carrotsearch.randomizedtesting.ThreadLeakControl.forkTimeoutingTask(ThreadLeakControl.java:809)
>         at com.carrotsearch.randomizedtesting.ThreadLeakControl$3.evaluate(ThreadLeakControl.java:460)
>         at com.carrotsearch.randomizedtesting.RandomizedRunner.runSingleTest(RandomizedRunner.java:880)
>         at com.carrotsearch.randomizedtesting.RandomizedRunner$5.evaluate(RandomizedRunner.java:781)
>         at com.carrotsearch.randomizedtesting.RandomizedRunner$6.evaluate(RandomizedRunner.java:816)
>         at com.carrotsearch.randomizedtesting.RandomizedRunner$7.evaluate(RandomizedRunner.java:827)
>         at org.apache.lucene.util.AbstractBeforeAfterRule$1.evaluate(AbstractBeforeAfterRule.java:45)
>         at com.carrotsearch.randomizedtesting.rules.StatementAdapter.evaluate(StatementAdapter.java:36)
>         at org.apache.lucene.util.TestRuleStoreClassName$1.evaluate(TestRuleStoreClassName.java:41)
>         at com.carrotsearch.randomizedtesting.rules.NoShadowingOrOverridesOnMethodsRule$1.evaluate(NoShadowingOrOverridesOnMethodsRule.java:40)
>         at com.carrotsearch.randomizedtesting.rules.NoShadowingOrOverridesOnMethodsRule$1.evaluate(NoShadowingOrOverridesOnMethodsRule.java:40)
>         at com.carrotsearch.randomizedtesting.rules.StatementAdapter.evaluate(StatementAdapter.java:36)
>         at com.carrotsearch.randomizedtesting.rules.StatementAdapter.evaluate(StatementAdapter.java:36)
>         at com.carrotsearch.randomizedtesting.rules.StatementAdapter.evaluate(StatementAdapter.java:36)
>         at org.apache.lucene.util.TestRuleAssertionsRequired$1.evaluate(TestRuleAssertionsRequired.java:53)
>         at org.apache.lucene.util.TestRuleMarkFailure$1.evaluate(TestRuleMarkFailure.java:47)
>         at org.apache.lucene.util.TestRuleIgnoreAfterMaxFailures$1.evaluate(TestRuleIgnoreAfterMaxFailures.java:64)
>         at org.apache.lucene.util.TestRuleIgnoreTestSuites$1.evaluate(TestRuleIgnoreTestSuites.java:54)
>         at com.carrotsearch.randomizedtesting.rules.StatementAdapter.evaluate(StatementAdapter.java:36)
>         at com.carrotsearch.randomizedtesting.ThreadLeakControl$StatementRunner.run(ThreadLeakControl.java:367)
>         at java.lang.Thread.run(java.base@9-ea/Thread.java:804)
>
>
>
>
> Build Log:
> [...truncated 9004 lines...]
>    [junit4] Suite: org.apache.lucene.spatial3d.TestGeo3DPoint
>    [junit4]   2> NOTE: reproduce with: ant test  -Dtestcase=TestGeo3DPoint -Dtests.method=testShapeQueryToString -Dtests.seed=2BADA078073D9BC7 -Dtests.multiplier=3 -Dtests.slow=true -Dtests.locale=nyn -Dtests.timezone=GMT0 -Dtests.asserts=true -Dtests.file.encoding=UTF-8
>    [junit4] FAILURE 0.01s J0 | TestGeo3DPoint.testShapeQueryToString <<<
>    [junit4]    > Throwable #1: org.junit.ComparisonFailure: expected:<...at=0.772208221547936[6], lon=0.135607475210...> but was:<...at=0.772208221547936[7], lon=0.135607475210...>
>    [junit4]    >        at __randomizedtesting.SeedInfo.seed([2BADA078073D9BC7:23B7F8E25CF034B]:0)
>    [junit4]    >        at org.apache.lucene.spatial3d.TestGeo3DPoint.testShapeQueryToString(TestGeo3DPoint.java:735)
>    [junit4]    >        at java.lang.Thread.run(java.base@9-ea/Thread.java:804)
>    [junit4] IGNOR/A 0.00s J0 | TestGeo3DPoint.testRandomBig
>    [junit4]    > Assumption #1: 'nightly' test group is disabled (@Nightly())
>    [junit4]   2> NOTE: test params are: codec=DummyCompressingStoredFields(storedFieldsFormat=CompressingStoredFieldsFormat(compressionMode=DUMMY, chunkSize=4520, maxDocsPerChunk=7, blockSize=1), termVectorsFormat=CompressingTermVectorsFormat(compressionMode=DUMMY, chunkSize=4520, blockSize=1)), sim=RandomSimilarity(queryNorm=false,coord=no): {}, locale=nyn, timezone=GMT0
>    [junit4]   2> NOTE: Linux 4.2.0-34-generic i386/Oracle Corporation 9-ea (32-bit)/cpus=12,threads=1,free=28827056,total=75497472
>    [junit4]   2> NOTE: All tests run in this JVM: [XYZSolidTest, TestGeo3DPoint]
>    [junit4] Completed [10/10 (1!)] on J0 in 42.70s, 12 tests, 1 failure, 1 skipped <<< FAILURES!
>
> [...truncated 11 lines...]
> BUILD FAILED
> /home/jenkins/workspace/Lucene-Solr-master-Linux/build.xml:740: The following error occurred while executing this line:
> /home/jenkins/workspace/Lucene-Solr-master-Linux/build.xml:684: The following error occurred while executing this line:
> /home/jenkins/workspace/Lucene-Solr-master-Linux/build.xml:59: The following error occurred while executing this line:
> /home/jenkins/workspace/Lucene-Solr-master-Linux/lucene/build.xml:476: The following error occurred while executing this line:
> /home/jenkins/workspace/Lucene-Solr-master-Linux/lucene/common-build.xml:2187: The following error occurred while executing this line:
> /home/jenkins/workspace/Lucene-Solr-master-Linux/lucene/module-build.xml:58: The following error occurred while executing this line:
> /home/jenkins/workspace/Lucene-Solr-master-Linux/lucene/common-build.xml:1457: The following error occurred while executing this line:
> /home/jenkins/workspace/Lucene-Solr-master-Linux/lucene/common-build.xml:1014: There were test failures: 10 suites, 44 tests, 1 failure, 1 ignored (1 assumption) [seed: 2BADA078073D9BC7]
>
> Total time: 38 minutes 2 seconds
> Build step 'Invoke Ant' marked build as failure
> Archiving artifacts
> [WARNINGS] Skipping publisher since build result is FAILURE
> Recording test results
> Email was triggered for: Failure - Any
> Sending email for trigger: Failure - Any
>
>
>
>
> ---------------------------------------------------------------------
> To unsubscribe, e-mail: dev-unsubscribe@lucene.apache.org
> For additional commands, e-mail: dev-help@lucene.apache.org

---------------------------------------------------------------------
To unsubscribe, e-mail: dev-unsubscribe@lucene.apache.org
For additional commands, e-mail: dev-help@lucene.apache.org


[JENKINS-EA] Lucene-Solr-master-Linux (32bit/jdk-9-ea+112-patched) - Build # 16456 - Still Failing!

Posted by Policeman Jenkins Server <je...@thetaphi.de>.
Build: http://jenkins.thetaphi.de/job/Lucene-Solr-master-Linux/16456/
Java: 32bit/jdk-9-ea+112-patched -client -XX:+UseG1GC -XX:-CompactStrings

1 tests failed.
FAILED:  org.apache.lucene.spatial3d.TestGeo3DPoint.testShapeQueryToString

Error Message:
expected:<...at=0.772208221547936[6], lon=0.135607475210...> but was:<...at=0.772208221547936[7], lon=0.135607475210...>

Stack Trace:
org.junit.ComparisonFailure: expected:<...at=0.772208221547936[6], lon=0.135607475210...> but was:<...at=0.772208221547936[7], lon=0.135607475210...>
	at __randomizedtesting.SeedInfo.seed([2BADA078073D9BC7:23B7F8E25CF034B]:0)
	at org.junit.Assert.assertEquals(Assert.java:125)
	at org.junit.Assert.assertEquals(Assert.java:147)
	at org.apache.lucene.spatial3d.TestGeo3DPoint.testShapeQueryToString(TestGeo3DPoint.java:735)
	at sun.reflect.NativeMethodAccessorImpl.invoke0(java.base@9-ea/Native Method)
	at sun.reflect.NativeMethodAccessorImpl.invoke(java.base@9-ea/NativeMethodAccessorImpl.java:62)
	at sun.reflect.DelegatingMethodAccessorImpl.invoke(java.base@9-ea/DelegatingMethodAccessorImpl.java:43)
	at java.lang.reflect.Method.invoke(java.base@9-ea/Method.java:531)
	at com.carrotsearch.randomizedtesting.RandomizedRunner.invoke(RandomizedRunner.java:1764)
	at com.carrotsearch.randomizedtesting.RandomizedRunner$8.evaluate(RandomizedRunner.java:871)
	at com.carrotsearch.randomizedtesting.RandomizedRunner$9.evaluate(RandomizedRunner.java:907)
	at com.carrotsearch.randomizedtesting.RandomizedRunner$10.evaluate(RandomizedRunner.java:921)
	at org.apache.lucene.util.TestRuleSetupTeardownChained$1.evaluate(TestRuleSetupTeardownChained.java:49)
	at org.apache.lucene.util.AbstractBeforeAfterRule$1.evaluate(AbstractBeforeAfterRule.java:45)
	at org.apache.lucene.util.TestRuleThreadAndTestName$1.evaluate(TestRuleThreadAndTestName.java:48)
	at org.apache.lucene.util.TestRuleIgnoreAfterMaxFailures$1.evaluate(TestRuleIgnoreAfterMaxFailures.java:64)
	at org.apache.lucene.util.TestRuleMarkFailure$1.evaluate(TestRuleMarkFailure.java:47)
	at com.carrotsearch.randomizedtesting.rules.StatementAdapter.evaluate(StatementAdapter.java:36)
	at com.carrotsearch.randomizedtesting.ThreadLeakControl$StatementRunner.run(ThreadLeakControl.java:367)
	at com.carrotsearch.randomizedtesting.ThreadLeakControl.forkTimeoutingTask(ThreadLeakControl.java:809)
	at com.carrotsearch.randomizedtesting.ThreadLeakControl$3.evaluate(ThreadLeakControl.java:460)
	at com.carrotsearch.randomizedtesting.RandomizedRunner.runSingleTest(RandomizedRunner.java:880)
	at com.carrotsearch.randomizedtesting.RandomizedRunner$5.evaluate(RandomizedRunner.java:781)
	at com.carrotsearch.randomizedtesting.RandomizedRunner$6.evaluate(RandomizedRunner.java:816)
	at com.carrotsearch.randomizedtesting.RandomizedRunner$7.evaluate(RandomizedRunner.java:827)
	at org.apache.lucene.util.AbstractBeforeAfterRule$1.evaluate(AbstractBeforeAfterRule.java:45)
	at com.carrotsearch.randomizedtesting.rules.StatementAdapter.evaluate(StatementAdapter.java:36)
	at org.apache.lucene.util.TestRuleStoreClassName$1.evaluate(TestRuleStoreClassName.java:41)
	at com.carrotsearch.randomizedtesting.rules.NoShadowingOrOverridesOnMethodsRule$1.evaluate(NoShadowingOrOverridesOnMethodsRule.java:40)
	at com.carrotsearch.randomizedtesting.rules.NoShadowingOrOverridesOnMethodsRule$1.evaluate(NoShadowingOrOverridesOnMethodsRule.java:40)
	at com.carrotsearch.randomizedtesting.rules.StatementAdapter.evaluate(StatementAdapter.java:36)
	at com.carrotsearch.randomizedtesting.rules.StatementAdapter.evaluate(StatementAdapter.java:36)
	at com.carrotsearch.randomizedtesting.rules.StatementAdapter.evaluate(StatementAdapter.java:36)
	at org.apache.lucene.util.TestRuleAssertionsRequired$1.evaluate(TestRuleAssertionsRequired.java:53)
	at org.apache.lucene.util.TestRuleMarkFailure$1.evaluate(TestRuleMarkFailure.java:47)
	at org.apache.lucene.util.TestRuleIgnoreAfterMaxFailures$1.evaluate(TestRuleIgnoreAfterMaxFailures.java:64)
	at org.apache.lucene.util.TestRuleIgnoreTestSuites$1.evaluate(TestRuleIgnoreTestSuites.java:54)
	at com.carrotsearch.randomizedtesting.rules.StatementAdapter.evaluate(StatementAdapter.java:36)
	at com.carrotsearch.randomizedtesting.ThreadLeakControl$StatementRunner.run(ThreadLeakControl.java:367)
	at java.lang.Thread.run(java.base@9-ea/Thread.java:804)




Build Log:
[...truncated 9004 lines...]
   [junit4] Suite: org.apache.lucene.spatial3d.TestGeo3DPoint
   [junit4]   2> NOTE: reproduce with: ant test  -Dtestcase=TestGeo3DPoint -Dtests.method=testShapeQueryToString -Dtests.seed=2BADA078073D9BC7 -Dtests.multiplier=3 -Dtests.slow=true -Dtests.locale=nyn -Dtests.timezone=GMT0 -Dtests.asserts=true -Dtests.file.encoding=UTF-8
   [junit4] FAILURE 0.01s J0 | TestGeo3DPoint.testShapeQueryToString <<<
   [junit4]    > Throwable #1: org.junit.ComparisonFailure: expected:<...at=0.772208221547936[6], lon=0.135607475210...> but was:<...at=0.772208221547936[7], lon=0.135607475210...>
   [junit4]    > 	at __randomizedtesting.SeedInfo.seed([2BADA078073D9BC7:23B7F8E25CF034B]:0)
   [junit4]    > 	at org.apache.lucene.spatial3d.TestGeo3DPoint.testShapeQueryToString(TestGeo3DPoint.java:735)
   [junit4]    > 	at java.lang.Thread.run(java.base@9-ea/Thread.java:804)
   [junit4] IGNOR/A 0.00s J0 | TestGeo3DPoint.testRandomBig
   [junit4]    > Assumption #1: 'nightly' test group is disabled (@Nightly())
   [junit4]   2> NOTE: test params are: codec=DummyCompressingStoredFields(storedFieldsFormat=CompressingStoredFieldsFormat(compressionMode=DUMMY, chunkSize=4520, maxDocsPerChunk=7, blockSize=1), termVectorsFormat=CompressingTermVectorsFormat(compressionMode=DUMMY, chunkSize=4520, blockSize=1)), sim=RandomSimilarity(queryNorm=false,coord=no): {}, locale=nyn, timezone=GMT0
   [junit4]   2> NOTE: Linux 4.2.0-34-generic i386/Oracle Corporation 9-ea (32-bit)/cpus=12,threads=1,free=28827056,total=75497472
   [junit4]   2> NOTE: All tests run in this JVM: [XYZSolidTest, TestGeo3DPoint]
   [junit4] Completed [10/10 (1!)] on J0 in 42.70s, 12 tests, 1 failure, 1 skipped <<< FAILURES!

[...truncated 11 lines...]
BUILD FAILED
/home/jenkins/workspace/Lucene-Solr-master-Linux/build.xml:740: The following error occurred while executing this line:
/home/jenkins/workspace/Lucene-Solr-master-Linux/build.xml:684: The following error occurred while executing this line:
/home/jenkins/workspace/Lucene-Solr-master-Linux/build.xml:59: The following error occurred while executing this line:
/home/jenkins/workspace/Lucene-Solr-master-Linux/lucene/build.xml:476: The following error occurred while executing this line:
/home/jenkins/workspace/Lucene-Solr-master-Linux/lucene/common-build.xml:2187: The following error occurred while executing this line:
/home/jenkins/workspace/Lucene-Solr-master-Linux/lucene/module-build.xml:58: The following error occurred while executing this line:
/home/jenkins/workspace/Lucene-Solr-master-Linux/lucene/common-build.xml:1457: The following error occurred while executing this line:
/home/jenkins/workspace/Lucene-Solr-master-Linux/lucene/common-build.xml:1014: There were test failures: 10 suites, 44 tests, 1 failure, 1 ignored (1 assumption) [seed: 2BADA078073D9BC7]

Total time: 38 minutes 2 seconds
Build step 'Invoke Ant' marked build as failure
Archiving artifacts
[WARNINGS] Skipping publisher since build result is FAILURE
Recording test results
Email was triggered for: Failure - Any
Sending email for trigger: Failure - Any



[JENKINS-EA] Lucene-Solr-master-Linux (64bit/jdk-9-ea+112-patched) - Build # 16455 - Still Failing!

Posted by Policeman Jenkins Server <je...@thetaphi.de>.
Build: http://jenkins.thetaphi.de/job/Lucene-Solr-master-Linux/16455/
Java: 64bit/jdk-9-ea+112-patched -XX:-UseCompressedOops -XX:+UseSerialGC -XX:-CompactStrings

1 tests failed.
FAILED:  org.apache.lucene.spatial3d.TestGeo3DPoint.testShapeQueryToString

Error Message:
expected:<...at=0.772208221547936[6], lon=0.135607475210...> but was:<...at=0.772208221547936[7], lon=0.135607475210...>

Stack Trace:
org.junit.ComparisonFailure: expected:<...at=0.772208221547936[6], lon=0.135607475210...> but was:<...at=0.772208221547936[7], lon=0.135607475210...>
	at __randomizedtesting.SeedInfo.seed([407AC547E8B28CB9:69EC1AB1CA401435]:0)
	at org.junit.Assert.assertEquals(Assert.java:125)
	at org.junit.Assert.assertEquals(Assert.java:147)
	at org.apache.lucene.spatial3d.TestGeo3DPoint.testShapeQueryToString(TestGeo3DPoint.java:735)
	at sun.reflect.NativeMethodAccessorImpl.invoke0(java.base@9-ea/Native Method)
	at sun.reflect.NativeMethodAccessorImpl.invoke(java.base@9-ea/NativeMethodAccessorImpl.java:62)
	at sun.reflect.DelegatingMethodAccessorImpl.invoke(java.base@9-ea/DelegatingMethodAccessorImpl.java:43)
	at java.lang.reflect.Method.invoke(java.base@9-ea/Method.java:531)
	at com.carrotsearch.randomizedtesting.RandomizedRunner.invoke(RandomizedRunner.java:1764)
	at com.carrotsearch.randomizedtesting.RandomizedRunner$8.evaluate(RandomizedRunner.java:871)
	at com.carrotsearch.randomizedtesting.RandomizedRunner$9.evaluate(RandomizedRunner.java:907)
	at com.carrotsearch.randomizedtesting.RandomizedRunner$10.evaluate(RandomizedRunner.java:921)
	at org.apache.lucene.util.TestRuleSetupTeardownChained$1.evaluate(TestRuleSetupTeardownChained.java:49)
	at org.apache.lucene.util.AbstractBeforeAfterRule$1.evaluate(AbstractBeforeAfterRule.java:45)
	at org.apache.lucene.util.TestRuleThreadAndTestName$1.evaluate(TestRuleThreadAndTestName.java:48)
	at org.apache.lucene.util.TestRuleIgnoreAfterMaxFailures$1.evaluate(TestRuleIgnoreAfterMaxFailures.java:64)
	at org.apache.lucene.util.TestRuleMarkFailure$1.evaluate(TestRuleMarkFailure.java:47)
	at com.carrotsearch.randomizedtesting.rules.StatementAdapter.evaluate(StatementAdapter.java:36)
	at com.carrotsearch.randomizedtesting.ThreadLeakControl$StatementRunner.run(ThreadLeakControl.java:367)
	at com.carrotsearch.randomizedtesting.ThreadLeakControl.forkTimeoutingTask(ThreadLeakControl.java:809)
	at com.carrotsearch.randomizedtesting.ThreadLeakControl$3.evaluate(ThreadLeakControl.java:460)
	at com.carrotsearch.randomizedtesting.RandomizedRunner.runSingleTest(RandomizedRunner.java:880)
	at com.carrotsearch.randomizedtesting.RandomizedRunner$5.evaluate(RandomizedRunner.java:781)
	at com.carrotsearch.randomizedtesting.RandomizedRunner$6.evaluate(RandomizedRunner.java:816)
	at com.carrotsearch.randomizedtesting.RandomizedRunner$7.evaluate(RandomizedRunner.java:827)
	at org.apache.lucene.util.AbstractBeforeAfterRule$1.evaluate(AbstractBeforeAfterRule.java:45)
	at com.carrotsearch.randomizedtesting.rules.StatementAdapter.evaluate(StatementAdapter.java:36)
	at org.apache.lucene.util.TestRuleStoreClassName$1.evaluate(TestRuleStoreClassName.java:41)
	at com.carrotsearch.randomizedtesting.rules.NoShadowingOrOverridesOnMethodsRule$1.evaluate(NoShadowingOrOverridesOnMethodsRule.java:40)
	at com.carrotsearch.randomizedtesting.rules.NoShadowingOrOverridesOnMethodsRule$1.evaluate(NoShadowingOrOverridesOnMethodsRule.java:40)
	at com.carrotsearch.randomizedtesting.rules.StatementAdapter.evaluate(StatementAdapter.java:36)
	at com.carrotsearch.randomizedtesting.rules.StatementAdapter.evaluate(StatementAdapter.java:36)
	at com.carrotsearch.randomizedtesting.rules.StatementAdapter.evaluate(StatementAdapter.java:36)
	at org.apache.lucene.util.TestRuleAssertionsRequired$1.evaluate(TestRuleAssertionsRequired.java:53)
	at org.apache.lucene.util.TestRuleMarkFailure$1.evaluate(TestRuleMarkFailure.java:47)
	at org.apache.lucene.util.TestRuleIgnoreAfterMaxFailures$1.evaluate(TestRuleIgnoreAfterMaxFailures.java:64)
	at org.apache.lucene.util.TestRuleIgnoreTestSuites$1.evaluate(TestRuleIgnoreTestSuites.java:54)
	at com.carrotsearch.randomizedtesting.rules.StatementAdapter.evaluate(StatementAdapter.java:36)
	at com.carrotsearch.randomizedtesting.ThreadLeakControl$StatementRunner.run(ThreadLeakControl.java:367)
	at java.lang.Thread.run(java.base@9-ea/Thread.java:804)




Build Log:
[...truncated 8989 lines...]
   [junit4] Suite: org.apache.lucene.spatial3d.TestGeo3DPoint
   [junit4] IGNOR/A 0.00s J0 | TestGeo3DPoint.testRandomBig
   [junit4]    > Assumption #1: 'nightly' test group is disabled (@Nightly())
   [junit4]   2> NOTE: reproduce with: ant test  -Dtestcase=TestGeo3DPoint -Dtests.method=testShapeQueryToString -Dtests.seed=407AC547E8B28CB9 -Dtests.multiplier=3 -Dtests.slow=true -Dtests.locale=bez -Dtests.timezone=Hongkong -Dtests.asserts=true -Dtests.file.encoding=ISO-8859-1
   [junit4] FAILURE 0.00s J0 | TestGeo3DPoint.testShapeQueryToString <<<
   [junit4]    > Throwable #1: org.junit.ComparisonFailure: expected:<...at=0.772208221547936[6], lon=0.135607475210...> but was:<...at=0.772208221547936[7], lon=0.135607475210...>
   [junit4]    > 	at __randomizedtesting.SeedInfo.seed([407AC547E8B28CB9:69EC1AB1CA401435]:0)
   [junit4]    > 	at org.apache.lucene.spatial3d.TestGeo3DPoint.testShapeQueryToString(TestGeo3DPoint.java:735)
   [junit4]    > 	at java.lang.Thread.run(java.base@9-ea/Thread.java:804)
   [junit4]   2> NOTE: test params are: codec=Asserting(Lucene60): {id=FSTOrd50}, docValues:{id=DocValuesFormat(name=Direct)}, maxPointsInLeafNode=1674, maxMBSortInHeap=6.26078971877499, sim=RandomSimilarity(queryNorm=true,coord=yes): {}, locale=bez, timezone=Hongkong
   [junit4]   2> NOTE: Linux 4.2.0-34-generic amd64/Oracle Corporation 9-ea (64-bit)/cpus=12,threads=1,free=355985144,total=508887040
   [junit4]   2> NOTE: All tests run in this JVM: [TestGeo3DPoint]
   [junit4] Completed [10/10 (1!)] on J0 in 33.83s, 12 tests, 1 failure, 1 skipped <<< FAILURES!

[...truncated 11 lines...]
BUILD FAILED
/home/jenkins/workspace/Lucene-Solr-master-Linux/build.xml:740: The following error occurred while executing this line:
/home/jenkins/workspace/Lucene-Solr-master-Linux/build.xml:684: The following error occurred while executing this line:
/home/jenkins/workspace/Lucene-Solr-master-Linux/build.xml:59: The following error occurred while executing this line:
/home/jenkins/workspace/Lucene-Solr-master-Linux/lucene/build.xml:476: The following error occurred while executing this line:
/home/jenkins/workspace/Lucene-Solr-master-Linux/lucene/common-build.xml:2187: The following error occurred while executing this line:
/home/jenkins/workspace/Lucene-Solr-master-Linux/lucene/module-build.xml:58: The following error occurred while executing this line:
/home/jenkins/workspace/Lucene-Solr-master-Linux/lucene/common-build.xml:1457: The following error occurred while executing this line:
/home/jenkins/workspace/Lucene-Solr-master-Linux/lucene/common-build.xml:1014: There were test failures: 10 suites, 44 tests, 1 failure, 1 ignored (1 assumption) [seed: 407AC547E8B28CB9]

Total time: 23 minutes 45 seconds
Build step 'Invoke Ant' marked build as failure
Archiving artifacts
[WARNINGS] Skipping publisher since build result is FAILURE
Recording test results
Email was triggered for: Failure - Any
Sending email for trigger: Failure - Any