You are viewing a plain text version of this content. The canonical link for it is here.
Posted to commits@cayenne.apache.org by Apache Jenkins Server <je...@builds.apache.org> on 2011/09/16 10:50:01 UTC
Build failed in Jenkins: Cayenne-trunk » derby,true,JDK 1.6 (latest),Ubuntu #585
See <https://builds.apache.org/job/Cayenne-trunk/./cayenneTestConnection=derby,collationCi=true,jdk=JDK%201.6%20(latest),label=Ubuntu/585/changes>
Changes:
[dkazimirchyk] CAY-1618 Create database adapters instances with proper injection
release notes
------------------------------------------
[...truncated 80985 lines...]
INFO: delete from PAINTING
Sep 16, 2011 8:49:59 AM org.apache.cayenne.test.jdbc.UtilityLogger log
INFO: INSERT INTO ARTIST (ARTIST_ID, ARTIST_NAME) VALUES (?, ?)
Sep 16, 2011 8:49:59 AM org.apache.cayenne.test.jdbc.UtilityLogger log
INFO: INSERT INTO PAINTING (PAINTING_ID, PAINTING_TITLE, ARTIST_ID, ESTIMATED_PRICE) VALUES (?, ?, ?, ?)
Sep 16, 2011 8:49:59 AM org.apache.cayenne.log.CommonsJdbcEventLogger logBeginTransaction
INFO: --- transaction started.
Sep 16, 2011 8:49:59 AM org.apache.cayenne.log.CommonsJdbcEventLogger logQuery
INFO: SELECT t0.DATE_OF_BIRTH, t0.ARTIST_ID, t0.ARTIST_NAME FROM ARTIST t0
Sep 16, 2011 8:49:59 AM org.apache.cayenne.log.CommonsJdbcEventLogger logSelectCount
INFO: === returned 1 row. - took 0 ms.
Sep 16, 2011 8:49:59 AM org.apache.cayenne.log.CommonsJdbcEventLogger logCommitTransaction
INFO: +++ transaction committed.
Sep 16, 2011 8:49:59 AM org.apache.cayenne.test.jdbc.UtilityLogger log
INFO: update ARTIST set ARTIST_NAME = ? where ARTIST_ID = ?
Sep 16, 2011 8:49:59 AM org.apache.cayenne.log.CommonsJdbcEventLogger logBeginTransaction
INFO: --- transaction started.
Sep 16, 2011 8:49:59 AM org.apache.cayenne.log.CommonsJdbcEventLogger logQuery
INFO: SELECT t0.DATE_OF_BIRTH, t0.ARTIST_ID, t0.ARTIST_NAME FROM ARTIST t0
Sep 16, 2011 8:49:59 AM org.apache.cayenne.log.CommonsJdbcEventLogger logSelectCount
INFO: === returned 1 row. - took 0 ms.
Sep 16, 2011 8:49:59 AM org.apache.cayenne.log.CommonsJdbcEventLogger logCommitTransaction
INFO: +++ transaction committed.
Tests run: 4, Failures: 0, Errors: 0, Skipped: 0, Time elapsed: 0.033 sec
Running org.apache.cayenne.access.NestedDataContextParentPeerEventsTest
Sep 16, 2011 8:49:59 AM org.apache.cayenne.configuration.XMLDataChannelDescriptorLoader load
INFO: Loading XML configuration resource from file:/x1/jenkins/jenkins-slave/workspace/Cayenne-trunk/cayenneTestConnection/derby/collationCi/true/jdk/JDK%201.6%20(latest)/label/Ubuntu/trunk/framework/cayenne-jdk1.5-unpublished/target/test-classes/cayenne-relationships.xml
Sep 16, 2011 8:49:59 AM org.apache.cayenne.map.EntityResolver applyDBLayerDefaults
INFO: added runtime complimentary DbRelationship from DELETE_RULE_TEST3 to DELETE_RULE_TEST1
Sep 16, 2011 8:49:59 AM org.apache.cayenne.map.EntityResolver applyObjectLayerDefaults
INFO: added runtime complimentary ObjRelationship from FlattenedTest3 to FlattenedTest1
Sep 16, 2011 8:49:59 AM org.apache.cayenne.map.EntityResolver applyObjectLayerDefaults
INFO: added runtime complimentary ObjRelationship from FlattenedTest4 to FlattenedTest1
Sep 16, 2011 8:49:59 AM org.apache.cayenne.log.CommonsJdbcEventLogger logBeginTransaction
INFO: --- transaction started.
Sep 16, 2011 8:49:59 AM org.apache.cayenne.log.CommonsJdbcEventLogger logQuery
INFO: SELECT NEXT_ID FROM AUTO_PK_SUPPORT WHERE TABLE_NAME = 'MASTER'
Sep 16, 2011 8:49:59 AM org.apache.cayenne.log.CommonsJdbcEventLogger logSelectCount
INFO: === returned 1 row. - took 0 ms.
Sep 16, 2011 8:49:59 AM org.apache.cayenne.log.CommonsJdbcEventLogger logQuery
INFO: UPDATE AUTO_PK_SUPPORT SET NEXT_ID = NEXT_ID + 20 WHERE TABLE_NAME = 'MASTER'
Sep 16, 2011 8:49:59 AM org.apache.cayenne.log.CommonsJdbcEventLogger logUpdateCount
INFO: === updated 1 row.
Sep 16, 2011 8:49:59 AM org.apache.cayenne.log.CommonsJdbcEventLogger logQuery
INFO: INSERT INTO MASTER (ID, NAME) VALUES (?, ?)
Sep 16, 2011 8:49:59 AM org.apache.cayenne.log.CommonsJdbcEventLogger logQueryParameters
INFO: [bind: 1->ID:200, 2->NAME:'X']
Sep 16, 2011 8:49:59 AM org.apache.cayenne.log.CommonsJdbcEventLogger logUpdateCount
INFO: === updated 1 row.
Sep 16, 2011 8:49:59 AM org.apache.cayenne.log.CommonsJdbcEventLogger logCommitTransaction
INFO: +++ transaction committed.
Sep 16, 2011 8:49:59 AM org.apache.cayenne.log.CommonsJdbcEventLogger logBeginTransaction
INFO: --- transaction started.
Sep 16, 2011 8:49:59 AM org.apache.cayenne.log.CommonsJdbcEventLogger logQuery
INFO: UPDATE MASTER SET NAME = ? WHERE ID = ?
Sep 16, 2011 8:49:59 AM org.apache.cayenne.log.CommonsJdbcEventLogger logQueryParameters
INFO: [bind: 1->NAME:'Y', 2->ID:200]
Sep 16, 2011 8:49:59 AM org.apache.cayenne.log.CommonsJdbcEventLogger logUpdateCount
INFO: === updated 1 row.
Sep 16, 2011 8:49:59 AM org.apache.cayenne.log.CommonsJdbcEventLogger logCommitTransaction
INFO: +++ transaction committed.
Sep 16, 2011 8:49:59 AM org.apache.cayenne.configuration.XMLDataChannelDescriptorLoader load
INFO: Loading XML configuration resource from file:/x1/jenkins/jenkins-slave/workspace/Cayenne-trunk/cayenneTestConnection/derby/collationCi/true/jdk/JDK%201.6%20(latest)/label/Ubuntu/trunk/framework/cayenne-jdk1.5-unpublished/target/test-classes/cayenne-relationships.xml
Sep 16, 2011 8:49:59 AM org.apache.cayenne.map.EntityResolver applyDBLayerDefaults
INFO: added runtime complimentary DbRelationship from DELETE_RULE_TEST3 to DELETE_RULE_TEST1
Sep 16, 2011 8:49:59 AM org.apache.cayenne.map.EntityResolver applyObjectLayerDefaults
INFO: added runtime complimentary ObjRelationship from FlattenedTest3 to FlattenedTest1
Sep 16, 2011 8:49:59 AM org.apache.cayenne.map.EntityResolver applyObjectLayerDefaults
INFO: added runtime complimentary ObjRelationship from FlattenedTest4 to FlattenedTest1
Sep 16, 2011 8:49:59 AM org.apache.cayenne.log.CommonsJdbcEventLogger logBeginTransaction
INFO: --- transaction started.
Sep 16, 2011 8:49:59 AM org.apache.cayenne.log.CommonsJdbcEventLogger logQuery
INFO: SELECT NEXT_ID FROM AUTO_PK_SUPPORT WHERE TABLE_NAME = 'CHILD'
Sep 16, 2011 8:49:59 AM org.apache.cayenne.log.CommonsJdbcEventLogger logSelectCount
INFO: === returned 1 row. - took 0 ms.
Sep 16, 2011 8:49:59 AM org.apache.cayenne.log.CommonsJdbcEventLogger logQuery
INFO: UPDATE AUTO_PK_SUPPORT SET NEXT_ID = NEXT_ID + 20 WHERE TABLE_NAME = 'CHILD'
Sep 16, 2011 8:49:59 AM org.apache.cayenne.log.CommonsJdbcEventLogger logUpdateCount
INFO: === updated 1 row.
Sep 16, 2011 8:49:59 AM org.apache.cayenne.log.CommonsJdbcEventLogger logQuery
INFO: INSERT INTO MASTER (ID, NAME) VALUES (?, ?)
Sep 16, 2011 8:49:59 AM org.apache.cayenne.log.CommonsJdbcEventLogger logQueryParameters
INFO: [bind: 1->ID:201, 2->NAME:'Y']
Sep 16, 2011 8:49:59 AM org.apache.cayenne.log.CommonsJdbcEventLogger logUpdateCount
INFO: === updated 1 row.
Sep 16, 2011 8:49:59 AM org.apache.cayenne.log.CommonsJdbcEventLogger logQueryParameters
INFO: [bind: 1->ID:202, 2->NAME:'X']
Sep 16, 2011 8:49:59 AM org.apache.cayenne.log.CommonsJdbcEventLogger logUpdateCount
INFO: === updated 1 row.
Sep 16, 2011 8:49:59 AM org.apache.cayenne.log.CommonsJdbcEventLogger logQuery
INFO: INSERT INTO CHILD (ID, MASTER_ID) VALUES (?, ?)
Sep 16, 2011 8:49:59 AM org.apache.cayenne.log.CommonsJdbcEventLogger logQueryParameters
INFO: [bind: 1->ID:200, 2->MASTER_ID:202]
Sep 16, 2011 8:49:59 AM org.apache.cayenne.log.CommonsJdbcEventLogger logUpdateCount
INFO: === updated 1 row.
Sep 16, 2011 8:49:59 AM org.apache.cayenne.log.CommonsJdbcEventLogger logCommitTransaction
INFO: +++ transaction committed.
Sep 16, 2011 8:49:59 AM org.apache.cayenne.log.CommonsJdbcEventLogger logBeginTransaction
INFO: --- transaction started.
Sep 16, 2011 8:49:59 AM org.apache.cayenne.log.CommonsJdbcEventLogger logQuery
INFO: UPDATE CHILD SET MASTER_ID = ? WHERE ID = ?
Sep 16, 2011 8:49:59 AM org.apache.cayenne.log.CommonsJdbcEventLogger logQueryParameters
INFO: [bind: 1->MASTER_ID:201, 2->ID:200]
Sep 16, 2011 8:49:59 AM org.apache.cayenne.log.CommonsJdbcEventLogger logUpdateCount
INFO: === updated 1 row.
Sep 16, 2011 8:49:59 AM org.apache.cayenne.log.CommonsJdbcEventLogger logCommitTransaction
INFO: +++ transaction committed.
Sep 16, 2011 8:49:59 AM org.apache.cayenne.configuration.XMLDataChannelDescriptorLoader load
INFO: Loading XML configuration resource from file:/x1/jenkins/jenkins-slave/workspace/Cayenne-trunk/cayenneTestConnection/derby/collationCi/true/jdk/JDK%201.6%20(latest)/label/Ubuntu/trunk/framework/cayenne-jdk1.5-unpublished/target/test-classes/cayenne-relationships.xml
Sep 16, 2011 8:49:59 AM org.apache.cayenne.map.EntityResolver applyDBLayerDefaults
INFO: added runtime complimentary DbRelationship from DELETE_RULE_TEST3 to DELETE_RULE_TEST1
Sep 16, 2011 8:49:59 AM org.apache.cayenne.map.EntityResolver applyObjectLayerDefaults
INFO: added runtime complimentary ObjRelationship from FlattenedTest3 to FlattenedTest1
Sep 16, 2011 8:49:59 AM org.apache.cayenne.map.EntityResolver applyObjectLayerDefaults
INFO: added runtime complimentary ObjRelationship from FlattenedTest4 to FlattenedTest1
Sep 16, 2011 8:49:59 AM org.apache.cayenne.log.CommonsJdbcEventLogger logBeginTransaction
INFO: --- transaction started.
Sep 16, 2011 8:49:59 AM org.apache.cayenne.log.CommonsJdbcEventLogger logQuery
INFO: INSERT INTO MASTER (ID, NAME) VALUES (?, ?)
Sep 16, 2011 8:49:59 AM org.apache.cayenne.log.CommonsJdbcEventLogger logQueryParameters
INFO: [bind: 1->ID:203, 2->NAME:'X']
Sep 16, 2011 8:49:59 AM org.apache.cayenne.log.CommonsJdbcEventLogger logUpdateCount
INFO: === updated 1 row.
Sep 16, 2011 8:49:59 AM org.apache.cayenne.log.CommonsJdbcEventLogger logQuery
INFO: INSERT INTO CHILD (ID, MASTER_ID) VALUES (?, ?)
Sep 16, 2011 8:49:59 AM org.apache.cayenne.log.CommonsJdbcEventLogger logQueryParameters
INFO: [bind: 1->ID:201, 2->MASTER_ID:203]
Sep 16, 2011 8:49:59 AM org.apache.cayenne.log.CommonsJdbcEventLogger logUpdateCount
INFO: === updated 1 row.
Sep 16, 2011 8:49:59 AM org.apache.cayenne.log.CommonsJdbcEventLogger logQueryParameters
INFO: [bind: 1->ID:202, 2->MASTER_ID:NULL]
Sep 16, 2011 8:49:59 AM org.apache.cayenne.log.CommonsJdbcEventLogger logUpdateCount
INFO: === updated 1 row.
Sep 16, 2011 8:49:59 AM org.apache.cayenne.log.CommonsJdbcEventLogger logCommitTransaction
INFO: +++ transaction committed.
Sep 16, 2011 8:49:59 AM org.apache.cayenne.log.CommonsJdbcEventLogger logBeginTransaction
INFO: --- transaction started.
Sep 16, 2011 8:49:59 AM org.apache.cayenne.log.CommonsJdbcEventLogger logQuery
INFO: UPDATE CHILD SET MASTER_ID = ? WHERE ID = ?
Sep 16, 2011 8:49:59 AM org.apache.cayenne.log.CommonsJdbcEventLogger logQueryParameters
INFO: [bind: 1->MASTER_ID:203, 2->ID:202]
Sep 16, 2011 8:49:59 AM org.apache.cayenne.log.CommonsJdbcEventLogger logUpdateCount
INFO: === updated 1 row.
Sep 16, 2011 8:49:59 AM org.apache.cayenne.log.CommonsJdbcEventLogger logCommitTransaction
INFO: +++ transaction committed.
Sep 16, 2011 8:50:00 AM org.apache.cayenne.log.CommonsJdbcEventLogger logBeginTransaction
INFO: --- transaction started.
Sep 16, 2011 8:50:00 AM org.apache.cayenne.log.CommonsJdbcEventLogger logQuery
INFO: SELECT t0.MASTER_ID, t0.ID FROM CHILD t0 WHERE t0.MASTER_ID = ? [bind: 1->MASTER_ID:203]
Sep 16, 2011 8:50:00 AM org.apache.cayenne.log.CommonsJdbcEventLogger logSelectCount
INFO: === returned 2 rows. - took 0 ms.
Sep 16, 2011 8:50:00 AM org.apache.cayenne.log.CommonsJdbcEventLogger logCommitTransaction
INFO: +++ transaction committed.
Tests run: 3, Failures: 0, Errors: 0, Skipped: 0, Time elapsed: 0.946 sec
Running org.apache.cayenne.DataRowTest
Tests run: 2, Failures: 0, Errors: 0, Skipped: 0, Time elapsed: 0.002 sec
Running org.apache.cayenne.access.types.EnumTypeTest
Tests run: 7, Failures: 0, Errors: 0, Skipped: 0, Time elapsed: 0.002 sec
Results :
Failed tests:
testSelectNotLikeIgnoreCaseSingleWildcardMatch(org.apache.cayenne.query.SelectQueryTest)
testSelectLikeIgnoreCaseObjects1(org.apache.cayenne.query.SelectQueryTest)
Tests run: 2095, Failures: 2, Errors: 0, Skipped: 0
[INFO] ------------------------------------------------------------------------
[INFO] Reactor Summary:
[INFO]
[INFO] Cayenne ........................................... SUCCESS [0.149s]
[INFO] Common Unit Test Utilities ........................ SUCCESS [1.375s]
[INFO] Cayenne Internal Build Plugin ..................... SUCCESS [0.922s]
[INFO] Cayenne Internal Documentation Build Plugin ....... SUCCESS [1.848s]
[INFO] Cayenne Build Tools Parent ........................ SUCCESS [0.007s]
[INFO] Cayenne License and Notice Bundle ................. SUCCESS [0.736s]
[INFO] Cayenne Dependency Injection Container ............ SUCCESS [2.545s]
[INFO] Cayenne Java 1.5 Unpublished ...................... FAILURE [58.745s]
[INFO] Cayenne WebObjects Compatibility Library .......... SKIPPED
[INFO] Cayenne Aggregated Server Jar ..................... SKIPPED
[INFO] Cayenne Aggregated Client Jar ..................... SKIPPED
[INFO] Cayenne Project ................................... SKIPPED
[INFO] Cayenne Tools ..................................... SKIPPED
[INFO] Library: cayenne-lifecycle ........................ SKIPPED
[INFO] Cayenne Maven Plugin .............................. SKIPPED
[INFO] Cayenne Framework Aggregator Project .............. SKIPPED
[INFO] Cayenne Integration Tests Parent .................. SKIPPED
[INFO] Integration Tests - Cayenne Runtime ............... SKIPPED
[INFO] Integration Tests - Cayenne Tools ................. SKIPPED
[INFO] Cayenne Modeler ................................... SKIPPED
[INFO] Cayenne Modeler Maven Plugin ...................... SKIPPED
[INFO] Cayenne Modeler Parent ............................ SKIPPED
[INFO] Cayenne Tutorial .................................. SKIPPED
[INFO] Cayenne ROP Server Tutorial ....................... SKIPPED
[INFO] Cayenne ROP Client Tutorial ....................... SKIPPED
[INFO] Cayenne Tutorials ................................. SKIPPED
[INFO] Cayenne Documentation ............................. SKIPPED
[INFO] Cayenne Documenation Parent ....................... SKIPPED
[INFO] ------------------------------------------------------------------------
[INFO] BUILD FAILURE
[INFO] ------------------------------------------------------------------------
[INFO] Total time: 1:07.429s
[INFO] Finished at: Fri Sep 16 08:50:00 UTC 2011
[INFO] Final Memory: 45M/373M
[INFO] ------------------------------------------------------------------------
[ERROR] Failed to execute goal org.apache.maven.plugins:maven-surefire-plugin:2.5:test (default-test) on project cayenne-jdk1.5-unpublished: There are test failures.
[ERROR]
[ERROR] Please refer to /x1/jenkins/jenkins-slave/workspace/Cayenne-trunk/cayenneTestConnection/derby/collationCi/true/jdk/JDK 1.6 (latest)/label/Ubuntu/trunk/framework/cayenne-jdk1.5-unpublished/target/surefire-reports for the individual test results.
[ERROR] -> [Help 1]
org.apache.maven.lifecycle.LifecycleExecutionException: Failed to execute goal org.apache.maven.plugins:maven-surefire-plugin:2.5:test (default-test) on project cayenne-jdk1.5-unpublished: There are test failures.
Please refer to /x1/jenkins/jenkins-slave/workspace/Cayenne-trunk/cayenneTestConnection/derby/collationCi/true/jdk/JDK 1.6 (latest)/label/Ubuntu/trunk/framework/cayenne-jdk1.5-unpublished/target/surefire-reports for the individual test results.
at org.apache.maven.lifecycle.internal.MojoExecutor.execute(MojoExecutor.java:213)
at org.apache.maven.lifecycle.internal.MojoExecutor.execute(MojoExecutor.java:153)
at org.apache.maven.lifecycle.internal.MojoExecutor.execute(MojoExecutor.java:145)
at org.apache.maven.lifecycle.internal.LifecycleModuleBuilder.buildProject(LifecycleModuleBuilder.java:84)
at org.apache.maven.lifecycle.internal.LifecycleModuleBuilder.buildProject(LifecycleModuleBuilder.java:59)
at org.apache.maven.lifecycle.internal.LifecycleStarter.singleThreadedBuild(LifecycleStarter.java:183)
at org.apache.maven.lifecycle.internal.LifecycleStarter.execute(LifecycleStarter.java:161)
at org.apache.maven.DefaultMaven.doExecute(DefaultMaven.java:319)
at org.apache.maven.DefaultMaven.execute(DefaultMaven.java:156)
at org.apache.maven.cli.MavenCli.execute(MavenCli.java:534)
at org.apache.maven.cli.MavenCli.doMain(MavenCli.java:196)
at org.apache.maven.cli.MavenCli.main(MavenCli.java:141)
at sun.reflect.NativeMethodAccessorImpl.invoke0(Native Method)
at sun.reflect.NativeMethodAccessorImpl.invoke(NativeMethodAccessorImpl.java:39)
at sun.reflect.DelegatingMethodAccessorImpl.invoke(DelegatingMethodAccessorImpl.java:25)
at java.lang.reflect.Method.invoke(Method.java:597)
at org.codehaus.plexus.classworlds.launcher.Launcher.launchEnhanced(Launcher.java:290)
at org.codehaus.plexus.classworlds.launcher.Launcher.launch(Launcher.java:230)
at org.codehaus.plexus.classworlds.launcher.Launcher.mainWithExitCode(Launcher.java:409)
at org.codehaus.plexus.classworlds.launcher.Launcher.main(Launcher.java:352)
Caused by: org.apache.maven.plugin.MojoFailureException: There are test failures.
Please refer to /x1/jenkins/jenkins-slave/workspace/Cayenne-trunk/cayenneTestConnection/derby/collationCi/true/jdk/JDK 1.6 (latest)/label/Ubuntu/trunk/framework/cayenne-jdk1.5-unpublished/target/surefire-reports for the individual test results.
at org.apache.maven.plugin.surefire.SurefirePlugin.execute(SurefirePlugin.java:629)
at org.apache.maven.plugin.DefaultBuildPluginManager.executeMojo(DefaultBuildPluginManager.java:107)
at org.apache.maven.lifecycle.internal.MojoExecutor.execute(MojoExecutor.java:209)
... 19 more
[ERROR]
[ERROR] Re-run Maven using the -X switch to enable full debug logging.
[ERROR]
[ERROR] For more information about the errors and possible solutions, please read the following articles:
[ERROR] [Help 1] http://cwiki.apache.org/confluence/display/MAVEN/MojoFailureException
[ERROR]
[ERROR] After correcting the problems, you can resume the build with the command
[ERROR] mvn <goals> -rf :cayenne-jdk1.5-unpublished
Build step 'Invoke top-level Maven targets' marked build as failure
Archiving artifacts
Build failed in Jenkins: Cayenne-trunk » derby,true,JDK 1.6 (latest),Ubuntu #594
Posted by Apache Jenkins Server <je...@builds.apache.org>.
See <https://builds.apache.org/job/Cayenne-trunk/./cayenneTestConnection=derby,collationCi=true,jdk=JDK%201.6%20(latest),label=Ubuntu/594/changes>
Changes:
[dkazimirchyk] removing docbook experiment files
[dkazimirchyk] ROP tutorial correction to correspond 3.1 changes
[dkazimirchyk] tutorial correction to correspond 3.1 changes
[dkazimirchyk] tutorial correction to correspond 3.1 changes
[aadamchik] tutorial screenshots updated for 3.1M3 Modeler
------------------------------------------
[...truncated 81049 lines...]
INFO: INSERT INTO ARTIST (ARTIST_ID, ARTIST_NAME) VALUES (?, ?)
Sep 28, 2011 4:30:53 PM org.apache.cayenne.test.jdbc.UtilityLogger log
INFO: INSERT INTO PAINTING (PAINTING_ID, PAINTING_TITLE, ARTIST_ID, ESTIMATED_PRICE) VALUES (?, ?, ?, ?)
Sep 28, 2011 4:30:53 PM org.apache.cayenne.log.CommonsJdbcEventLogger logBeginTransaction
INFO: --- transaction started.
Sep 28, 2011 4:30:53 PM org.apache.cayenne.log.CommonsJdbcEventLogger logQuery
INFO: SELECT t0.DATE_OF_BIRTH, t0.ARTIST_ID, t0.ARTIST_NAME FROM ARTIST t0
Sep 28, 2011 4:30:53 PM org.apache.cayenne.log.CommonsJdbcEventLogger logSelectCount
INFO: === returned 1 row. - took 1 ms.
Sep 28, 2011 4:30:53 PM org.apache.cayenne.log.CommonsJdbcEventLogger logCommitTransaction
INFO: +++ transaction committed.
Sep 28, 2011 4:30:53 PM org.apache.cayenne.test.jdbc.UtilityLogger log
INFO: update ARTIST set ARTIST_NAME = ? where ARTIST_ID = ?
Sep 28, 2011 4:30:53 PM org.apache.cayenne.log.CommonsJdbcEventLogger logBeginTransaction
INFO: --- transaction started.
Sep 28, 2011 4:30:53 PM org.apache.cayenne.log.CommonsJdbcEventLogger logQuery
INFO: SELECT t0.DATE_OF_BIRTH, t0.ARTIST_ID, t0.ARTIST_NAME FROM ARTIST t0
Sep 28, 2011 4:30:53 PM org.apache.cayenne.log.CommonsJdbcEventLogger logSelectCount
INFO: === returned 1 row. - took 0 ms.
Sep 28, 2011 4:30:53 PM org.apache.cayenne.log.CommonsJdbcEventLogger logCommitTransaction
INFO: +++ transaction committed.
Sep 28, 2011 4:30:53 PM org.apache.cayenne.configuration.XMLDataChannelDescriptorLoader load
INFO: Loading XML configuration resource from <https://builds.apache.org/job/Cayenne-trunk/./cayenneTestConnection=derby,collationCi=true,jdk=JDK%201.6%20(latest),label=Ubuntu/ws/trunk/framework/cayenne-jdk1.5-unpublished/target/test-classes/cayenne-relationships.xml>
Sep 28, 2011 4:30:53 PM org.apache.cayenne.map.EntityResolver applyDBLayerDefaults
INFO: added runtime complimentary DbRelationship from DELETE_RULE_TEST3 to DELETE_RULE_TEST1
Sep 28, 2011 4:30:53 PM org.apache.cayenne.map.EntityResolver applyObjectLayerDefaults
INFO: added runtime complimentary ObjRelationship from FlattenedTest3 to FlattenedTest1
Sep 28, 2011 4:30:53 PM org.apache.cayenne.map.EntityResolver applyObjectLayerDefaults
INFO: added runtime complimentary ObjRelationship from FlattenedTest4 to FlattenedTest1
Sep 28, 2011 4:30:53 PM org.apache.cayenne.log.CommonsJdbcEventLogger logBeginTransaction
INFO: --- transaction started.
Sep 28, 2011 4:30:53 PM org.apache.cayenne.log.CommonsJdbcEventLogger logQuery
INFO: SELECT NEXT_ID FROM AUTO_PK_SUPPORT WHERE TABLE_NAME = 'MASTER'
Sep 28, 2011 4:30:53 PM org.apache.cayenne.log.CommonsJdbcEventLogger logSelectCount
INFO: === returned 1 row. - took 0 ms.
Sep 28, 2011 4:30:53 PM org.apache.cayenne.log.CommonsJdbcEventLogger logQuery
INFO: UPDATE AUTO_PK_SUPPORT SET NEXT_ID = NEXT_ID + 20 WHERE TABLE_NAME = 'MASTER'
Sep 28, 2011 4:30:53 PM org.apache.cayenne.log.CommonsJdbcEventLogger logUpdateCount
INFO: === updated 1 row.
Sep 28, 2011 4:30:53 PM org.apache.cayenne.log.CommonsJdbcEventLogger logQuery
INFO: INSERT INTO MASTER (ID, NAME) VALUES (?, ?)
Sep 28, 2011 4:30:53 PM org.apache.cayenne.log.CommonsJdbcEventLogger logQueryParameters
INFO: [bind: 1->ID:200, 2->NAME:'X']
Sep 28, 2011 4:30:53 PM org.apache.cayenne.log.CommonsJdbcEventLogger logUpdateCount
INFO: === updated 1 row.
Sep 28, 2011 4:30:53 PM org.apache.cayenne.log.CommonsJdbcEventLogger logCommitTransaction
INFO: +++ transaction committed.
Sep 28, 2011 4:30:53 PM org.apache.cayenne.log.CommonsJdbcEventLogger logBeginTransaction
INFO: --- transaction started.
Sep 28, 2011 4:30:53 PM org.apache.cayenne.log.CommonsJdbcEventLogger logQuery
INFO: UPDATE MASTER SET NAME = ? WHERE ID = ?
Sep 28, 2011 4:30:53 PM org.apache.cayenne.log.CommonsJdbcEventLogger logQueryParameters
INFO: [bind: 1->NAME:'Y', 2->ID:200]
Sep 28, 2011 4:30:53 PM org.apache.cayenne.log.CommonsJdbcEventLogger logUpdateCount
INFO: === updated 1 row.
Sep 28, 2011 4:30:53 PM org.apache.cayenne.log.CommonsJdbcEventLogger logCommitTransaction
INFO: +++ transaction committed.
Sep 28, 2011 4:30:54 PM org.apache.cayenne.configuration.XMLDataChannelDescriptorLoader load
INFO: Loading XML configuration resource from <https://builds.apache.org/job/Cayenne-trunk/./cayenneTestConnection=derby,collationCi=true,jdk=JDK%201.6%20(latest),label=Ubuntu/ws/trunk/framework/cayenne-jdk1.5-unpublished/target/test-classes/cayenne-relationships.xml>
Sep 28, 2011 4:30:54 PM org.apache.cayenne.map.EntityResolver applyDBLayerDefaults
INFO: added runtime complimentary DbRelationship from DELETE_RULE_TEST3 to DELETE_RULE_TEST1
Sep 28, 2011 4:30:54 PM org.apache.cayenne.map.EntityResolver applyObjectLayerDefaults
INFO: added runtime complimentary ObjRelationship from FlattenedTest3 to FlattenedTest1
Sep 28, 2011 4:30:54 PM org.apache.cayenne.map.EntityResolver applyObjectLayerDefaults
INFO: added runtime complimentary ObjRelationship from FlattenedTest4 to FlattenedTest1
Sep 28, 2011 4:30:54 PM org.apache.cayenne.log.CommonsJdbcEventLogger logBeginTransaction
INFO: --- transaction started.
Sep 28, 2011 4:30:54 PM org.apache.cayenne.log.CommonsJdbcEventLogger logQuery
INFO: SELECT NEXT_ID FROM AUTO_PK_SUPPORT WHERE TABLE_NAME = 'CHILD'
Sep 28, 2011 4:30:54 PM org.apache.cayenne.log.CommonsJdbcEventLogger logSelectCount
INFO: === returned 1 row. - took 0 ms.
Sep 28, 2011 4:30:54 PM org.apache.cayenne.log.CommonsJdbcEventLogger logQuery
INFO: UPDATE AUTO_PK_SUPPORT SET NEXT_ID = NEXT_ID + 20 WHERE TABLE_NAME = 'CHILD'
Sep 28, 2011 4:30:54 PM org.apache.cayenne.log.CommonsJdbcEventLogger logUpdateCount
INFO: === updated 1 row.
Sep 28, 2011 4:30:54 PM org.apache.cayenne.log.CommonsJdbcEventLogger logQuery
INFO: INSERT INTO MASTER (ID, NAME) VALUES (?, ?)
Sep 28, 2011 4:30:54 PM org.apache.cayenne.log.CommonsJdbcEventLogger logQueryParameters
INFO: [bind: 1->ID:201, 2->NAME:'X']
Sep 28, 2011 4:30:54 PM org.apache.cayenne.log.CommonsJdbcEventLogger logUpdateCount
INFO: === updated 1 row.
Sep 28, 2011 4:30:54 PM org.apache.cayenne.log.CommonsJdbcEventLogger logQueryParameters
INFO: [bind: 1->ID:202, 2->NAME:'Y']
Sep 28, 2011 4:30:54 PM org.apache.cayenne.log.CommonsJdbcEventLogger logUpdateCount
INFO: === updated 1 row.
Sep 28, 2011 4:30:54 PM org.apache.cayenne.log.CommonsJdbcEventLogger logQuery
INFO: INSERT INTO CHILD (ID, MASTER_ID) VALUES (?, ?)
Sep 28, 2011 4:30:54 PM org.apache.cayenne.log.CommonsJdbcEventLogger logQueryParameters
INFO: [bind: 1->ID:200, 2->MASTER_ID:201]
Sep 28, 2011 4:30:54 PM org.apache.cayenne.log.CommonsJdbcEventLogger logUpdateCount
INFO: === updated 1 row.
Sep 28, 2011 4:30:54 PM org.apache.cayenne.log.CommonsJdbcEventLogger logCommitTransaction
INFO: +++ transaction committed.
Sep 28, 2011 4:30:54 PM org.apache.cayenne.log.CommonsJdbcEventLogger logBeginTransaction
INFO: --- transaction started.
Sep 28, 2011 4:30:54 PM org.apache.cayenne.log.CommonsJdbcEventLogger logQuery
INFO: UPDATE CHILD SET MASTER_ID = ? WHERE ID = ?
Sep 28, 2011 4:30:54 PM org.apache.cayenne.log.CommonsJdbcEventLogger logQueryParameters
INFO: [bind: 1->MASTER_ID:202, 2->ID:200]
Sep 28, 2011 4:30:54 PM org.apache.cayenne.log.CommonsJdbcEventLogger logUpdateCount
INFO: === updated 1 row.
Sep 28, 2011 4:30:54 PM org.apache.cayenne.log.CommonsJdbcEventLogger logCommitTransaction
INFO: +++ transaction committed.
Sep 28, 2011 4:30:54 PM org.apache.cayenne.configuration.XMLDataChannelDescriptorLoader load
INFO: Loading XML configuration resource from <https://builds.apache.org/job/Cayenne-trunk/./cayenneTestConnection=derby,collationCi=true,jdk=JDK%201.6%20(latest),label=Ubuntu/ws/trunk/framework/cayenne-jdk1.5-unpublished/target/test-classes/cayenne-relationships.xml>
Sep 28, 2011 4:30:54 PM org.apache.cayenne.map.EntityResolver applyDBLayerDefaults
INFO: added runtime complimentary DbRelationship from DELETE_RULE_TEST3 to DELETE_RULE_TEST1
Sep 28, 2011 4:30:54 PM org.apache.cayenne.map.EntityResolver applyObjectLayerDefaults
INFO: added runtime complimentary ObjRelationship from FlattenedTest3 to FlattenedTest1
Sep 28, 2011 4:30:54 PM org.apache.cayenne.map.EntityResolver applyObjectLayerDefaults
INFO: added runtime complimentary ObjRelationship from FlattenedTest4 to FlattenedTest1
Sep 28, 2011 4:30:54 PM org.apache.cayenne.log.CommonsJdbcEventLogger logBeginTransaction
INFO: --- transaction started.
Sep 28, 2011 4:30:54 PM org.apache.cayenne.log.CommonsJdbcEventLogger logQuery
INFO: INSERT INTO MASTER (ID, NAME) VALUES (?, ?)
Sep 28, 2011 4:30:54 PM org.apache.cayenne.log.CommonsJdbcEventLogger logQueryParameters
INFO: [bind: 1->ID:203, 2->NAME:'X']
Sep 28, 2011 4:30:54 PM org.apache.cayenne.log.CommonsJdbcEventLogger logUpdateCount
INFO: === updated 1 row.
Sep 28, 2011 4:30:54 PM org.apache.cayenne.log.CommonsJdbcEventLogger logQuery
INFO: INSERT INTO CHILD (ID, MASTER_ID) VALUES (?, ?)
Sep 28, 2011 4:30:54 PM org.apache.cayenne.log.CommonsJdbcEventLogger logQueryParameters
INFO: [bind: 1->ID:201, 2->MASTER_ID:203]
Sep 28, 2011 4:30:54 PM org.apache.cayenne.log.CommonsJdbcEventLogger logUpdateCount
INFO: === updated 1 row.
Sep 28, 2011 4:30:54 PM org.apache.cayenne.log.CommonsJdbcEventLogger logQueryParameters
INFO: [bind: 1->ID:202, 2->MASTER_ID:NULL]
Sep 28, 2011 4:30:54 PM org.apache.cayenne.log.CommonsJdbcEventLogger logUpdateCount
INFO: === updated 1 row.
Sep 28, 2011 4:30:54 PM org.apache.cayenne.log.CommonsJdbcEventLogger logCommitTransaction
INFO: +++ transaction committed.
Sep 28, 2011 4:30:54 PM org.apache.cayenne.log.CommonsJdbcEventLogger logBeginTransaction
INFO: --- transaction started.
Sep 28, 2011 4:30:54 PM org.apache.cayenne.log.CommonsJdbcEventLogger logQuery
INFO: UPDATE CHILD SET MASTER_ID = ? WHERE ID = ?
Sep 28, 2011 4:30:54 PM org.apache.cayenne.log.CommonsJdbcEventLogger logQueryParameters
INFO: [bind: 1->MASTER_ID:203, 2->ID:202]
Sep 28, 2011 4:30:54 PM org.apache.cayenne.log.CommonsJdbcEventLogger logUpdateCount
INFO: === updated 1 row.
Sep 28, 2011 4:30:54 PM org.apache.cayenne.log.CommonsJdbcEventLogger logCommitTransaction
INFO: +++ transaction committed.
Sep 28, 2011 4:30:54 PM org.apache.cayenne.log.CommonsJdbcEventLogger logBeginTransaction
INFO: --- transaction started.
Sep 28, 2011 4:30:54 PM org.apache.cayenne.log.CommonsJdbcEventLogger logQuery
INFO: SELECT t0.MASTER_ID, t0.ID FROM CHILD t0 WHERE t0.MASTER_ID = ? [bind: 1->MASTER_ID:203]
Sep 28, 2011 4:30:54 PM org.apache.cayenne.log.CommonsJdbcEventLogger logSelectCount
INFO: === returned 2 rows. - took 0 ms.
Sep 28, 2011 4:30:54 PM org.apache.cayenne.log.CommonsJdbcEventLogger logCommitTransaction
INFO: +++ transaction committed.
Tests run: 3, Failures: 0, Errors: 0, Skipped: 0, Time elapsed: 0.958 sec
Running org.apache.cayenne.DataRowTest
Tests run: 2, Failures: 0, Errors: 0, Skipped: 0, Time elapsed: 0.003 sec
Running org.apache.cayenne.access.types.EnumTypeTest
Tests run: 7, Failures: 0, Errors: 0, Skipped: 0, Time elapsed: 0.002 sec
Results :
Failed tests:
testSelectNotLikeIgnoreCaseSingleWildcardMatch(org.apache.cayenne.query.SelectQueryTest)
testSelectLikeIgnoreCaseObjects1(org.apache.cayenne.query.SelectQueryTest)
Tests run: 2095, Failures: 2, Errors: 0, Skipped: 0
[INFO] ------------------------------------------------------------------------
[INFO] Reactor Summary:
[INFO]
[INFO] Cayenne ........................................... SUCCESS [0.206s]
[INFO] Common Unit Test Utilities ........................ SUCCESS [1.528s]
[INFO] Cayenne Internal Build Plugin ..................... SUCCESS [1.287s]
[INFO] Cayenne Internal Documentation Build Plugin ....... SUCCESS [1.725s]
[INFO] Cayenne Build Tools Parent ........................ SUCCESS [0.005s]
[INFO] Cayenne License and Notice Bundle ................. SUCCESS [0.863s]
[INFO] Cayenne Dependency Injection Container ............ SUCCESS [2.607s]
[INFO] Cayenne Java 1.5 Unpublished ...................... FAILURE [1:07.477s]
[INFO] Cayenne WebObjects Compatibility Library .......... SKIPPED
[INFO] Cayenne Aggregated Server Jar ..................... SKIPPED
[INFO] Cayenne Aggregated Client Jar ..................... SKIPPED
[INFO] Cayenne Project ................................... SKIPPED
[INFO] Cayenne Tools ..................................... SKIPPED
[INFO] Library: cayenne-lifecycle ........................ SKIPPED
[INFO] Cayenne Maven Plugin .............................. SKIPPED
[INFO] Cayenne Framework Aggregator Project .............. SKIPPED
[INFO] Cayenne Integration Tests Parent .................. SKIPPED
[INFO] Integration Tests - Cayenne Runtime ............... SKIPPED
[INFO] Integration Tests - Cayenne Tools ................. SKIPPED
[INFO] Cayenne Modeler ................................... SKIPPED
[INFO] Cayenne Modeler Maven Plugin ...................... SKIPPED
[INFO] Cayenne Modeler Parent ............................ SKIPPED
[INFO] Cayenne Tutorial .................................. SKIPPED
[INFO] Cayenne ROP Server Tutorial ....................... SKIPPED
[INFO] Cayenne ROP Client Tutorial ....................... SKIPPED
[INFO] Cayenne Tutorials ................................. SKIPPED
[INFO] Cayenne Documentation ............................. SKIPPED
[INFO] Cayenne Documenation Parent ....................... SKIPPED
[INFO] Cayenne Docbook Documenation ...................... SKIPPED
[INFO] Docbook: Cayenne Guide ............................ SKIPPED
[INFO] Docbook: Getting Started with Cayenne ............. SKIPPED
[INFO] Docbook: Getting Started with Cayenne ROP ......... SKIPPED
[INFO] ------------------------------------------------------------------------
[INFO] BUILD FAILURE
[INFO] ------------------------------------------------------------------------
[INFO] Total time: 1:16.693s
[INFO] Finished at: Wed Sep 28 16:30:55 UTC 2011
[INFO] Final Memory: 46M/358M
[INFO] ------------------------------------------------------------------------
[ERROR] Failed to execute goal org.apache.maven.plugins:maven-surefire-plugin:2.5:test (default-test) on project cayenne-jdk1.5-unpublished: There are test failures.
[ERROR]
[ERROR] Please refer to <https://builds.apache.org/job/Cayenne-trunk/./cayenneTestConnection=derby,collationCi=true,jdk=JDK%201.6%20(latest),label=Ubuntu/ws/trunk/framework/cayenne-jdk1.5-unpublished/target/surefire-reports> for the individual test results.
[ERROR] -> [Help 1]
org.apache.maven.lifecycle.LifecycleExecutionException: Failed to execute goal org.apache.maven.plugins:maven-surefire-plugin:2.5:test (default-test) on project cayenne-jdk1.5-unpublished: There are test failures.
Please refer to <https://builds.apache.org/job/Cayenne-trunk/./cayenneTestConnection=derby,collationCi=true,jdk=JDK%201.6%20(latest),label=Ubuntu/ws/trunk/framework/cayenne-jdk1.5-unpublished/target/surefire-reports> for the individual test results.
at org.apache.maven.lifecycle.internal.MojoExecutor.execute(MojoExecutor.java:213)
at org.apache.maven.lifecycle.internal.MojoExecutor.execute(MojoExecutor.java:153)
at org.apache.maven.lifecycle.internal.MojoExecutor.execute(MojoExecutor.java:145)
at org.apache.maven.lifecycle.internal.LifecycleModuleBuilder.buildProject(LifecycleModuleBuilder.java:84)
at org.apache.maven.lifecycle.internal.LifecycleModuleBuilder.buildProject(LifecycleModuleBuilder.java:59)
at org.apache.maven.lifecycle.internal.LifecycleStarter.singleThreadedBuild(LifecycleStarter.java:183)
at org.apache.maven.lifecycle.internal.LifecycleStarter.execute(LifecycleStarter.java:161)
at org.apache.maven.DefaultMaven.doExecute(DefaultMaven.java:319)
at org.apache.maven.DefaultMaven.execute(DefaultMaven.java:156)
at org.apache.maven.cli.MavenCli.execute(MavenCli.java:537)
at org.apache.maven.cli.MavenCli.doMain(MavenCli.java:196)
at org.apache.maven.cli.MavenCli.main(MavenCli.java:141)
at sun.reflect.NativeMethodAccessorImpl.invoke0(Native Method)
at sun.reflect.NativeMethodAccessorImpl.invoke(NativeMethodAccessorImpl.java:39)
at sun.reflect.DelegatingMethodAccessorImpl.invoke(DelegatingMethodAccessorImpl.java:25)
at java.lang.reflect.Method.invoke(Method.java:597)
at org.codehaus.plexus.classworlds.launcher.Launcher.launchEnhanced(Launcher.java:290)
at org.codehaus.plexus.classworlds.launcher.Launcher.launch(Launcher.java:230)
at org.codehaus.plexus.classworlds.launcher.Launcher.mainWithExitCode(Launcher.java:409)
at org.codehaus.plexus.classworlds.launcher.Launcher.main(Launcher.java:352)
Caused by: org.apache.maven.plugin.MojoFailureException: There are test failures.
Please refer to <https://builds.apache.org/job/Cayenne-trunk/./cayenneTestConnection=derby,collationCi=true,jdk=JDK%201.6%20(latest),label=Ubuntu/ws/trunk/framework/cayenne-jdk1.5-unpublished/target/surefire-reports> for the individual test results.
at org.apache.maven.plugin.surefire.SurefirePlugin.execute(SurefirePlugin.java:629)
at org.apache.maven.plugin.DefaultBuildPluginManager.executeMojo(DefaultBuildPluginManager.java:101)
at org.apache.maven.lifecycle.internal.MojoExecutor.execute(MojoExecutor.java:209)
... 19 more
[ERROR]
[ERROR] Re-run Maven using the -X switch to enable full debug logging.
[ERROR]
[ERROR] For more information about the errors and possible solutions, please read the following articles:
[ERROR] [Help 1] http://cwiki.apache.org/confluence/display/MAVEN/MojoFailureException
[ERROR]
[ERROR] After correcting the problems, you can resume the build with the command
[ERROR] mvn <goals> -rf :cayenne-jdk1.5-unpublished
Build step 'Invoke top-level Maven targets' marked build as failure
Archiving artifacts
Build failed in Jenkins: Cayenne-trunk » derby,true,JDK 1.6 (latest),Ubuntu #593
Posted by Apache Jenkins Server <je...@builds.apache.org>.
See <https://builds.apache.org/job/Cayenne-trunk/./cayenneTestConnection=derby,collationCi=true,jdk=JDK%201.6%20(latest),label=Ubuntu/593/changes>
Changes:
[dkazimirchyk] Docbook: Getting Started with Cayenne ROP correction to correspond to 3.1 changes
[dkazimirchyk] Docbook: Getting Started with Cayenne correction to correspond to 3.1 changes
------------------------------------------
[...truncated 81005 lines...]
INFO: INSERT INTO PAINTING (PAINTING_ID, PAINTING_TITLE, ARTIST_ID, ESTIMATED_PRICE) VALUES (?, ?, ?, ?)
Sep 28, 2011 2:25:05 PM org.apache.cayenne.log.CommonsJdbcEventLogger logBeginTransaction
INFO: --- transaction started.
Sep 28, 2011 2:25:05 PM org.apache.cayenne.log.CommonsJdbcEventLogger logQuery
INFO: SELECT t0.DATE_OF_BIRTH, t0.ARTIST_ID, t0.ARTIST_NAME FROM ARTIST t0
Sep 28, 2011 2:25:05 PM org.apache.cayenne.log.CommonsJdbcEventLogger logSelectCount
INFO: === returned 1 row. - took 0 ms.
Sep 28, 2011 2:25:05 PM org.apache.cayenne.log.CommonsJdbcEventLogger logCommitTransaction
INFO: +++ transaction committed.
Sep 28, 2011 2:25:05 PM org.apache.cayenne.test.jdbc.UtilityLogger log
INFO: update ARTIST set ARTIST_NAME = ? where ARTIST_ID = ?
Sep 28, 2011 2:25:05 PM org.apache.cayenne.log.CommonsJdbcEventLogger logBeginTransaction
INFO: --- transaction started.
Sep 28, 2011 2:25:05 PM org.apache.cayenne.log.CommonsJdbcEventLogger logQuery
INFO: SELECT t0.DATE_OF_BIRTH, t0.ARTIST_ID, t0.ARTIST_NAME FROM ARTIST t0
Sep 28, 2011 2:25:05 PM org.apache.cayenne.log.CommonsJdbcEventLogger logSelectCount
INFO: === returned 1 row. - took 0 ms.
Sep 28, 2011 2:25:05 PM org.apache.cayenne.log.CommonsJdbcEventLogger logCommitTransaction
INFO: +++ transaction committed.
Tests run: 4, Failures: 0, Errors: 0, Skipped: 0, Time elapsed: 0.026 sec
Running org.apache.cayenne.access.NestedDataContextParentPeerEventsTest
Sep 28, 2011 2:25:05 PM org.apache.cayenne.configuration.XMLDataChannelDescriptorLoader load
INFO: Loading XML configuration resource from file:/x1/jenkins/jenkins-slave/workspace/Cayenne-trunk/cayenneTestConnection/derby/collationCi/true/jdk/JDK%201.6%20(latest)/label/Ubuntu/trunk/framework/cayenne-jdk1.5-unpublished/target/test-classes/cayenne-relationships.xml
Sep 28, 2011 2:25:05 PM org.apache.cayenne.map.EntityResolver applyDBLayerDefaults
INFO: added runtime complimentary DbRelationship from DELETE_RULE_TEST3 to DELETE_RULE_TEST1
Sep 28, 2011 2:25:05 PM org.apache.cayenne.map.EntityResolver applyObjectLayerDefaults
INFO: added runtime complimentary ObjRelationship from FlattenedTest3 to FlattenedTest1
Sep 28, 2011 2:25:05 PM org.apache.cayenne.map.EntityResolver applyObjectLayerDefaults
INFO: added runtime complimentary ObjRelationship from FlattenedTest4 to FlattenedTest1
Sep 28, 2011 2:25:05 PM org.apache.cayenne.log.CommonsJdbcEventLogger logBeginTransaction
INFO: --- transaction started.
Sep 28, 2011 2:25:05 PM org.apache.cayenne.log.CommonsJdbcEventLogger logQuery
INFO: SELECT NEXT_ID FROM AUTO_PK_SUPPORT WHERE TABLE_NAME = 'MASTER'
Sep 28, 2011 2:25:05 PM org.apache.cayenne.log.CommonsJdbcEventLogger logSelectCount
INFO: === returned 1 row. - took 0 ms.
Sep 28, 2011 2:25:05 PM org.apache.cayenne.log.CommonsJdbcEventLogger logQuery
INFO: UPDATE AUTO_PK_SUPPORT SET NEXT_ID = NEXT_ID + 20 WHERE TABLE_NAME = 'MASTER'
Sep 28, 2011 2:25:05 PM org.apache.cayenne.log.CommonsJdbcEventLogger logUpdateCount
INFO: === updated 1 row.
Sep 28, 2011 2:25:05 PM org.apache.cayenne.log.CommonsJdbcEventLogger logQuery
INFO: INSERT INTO MASTER (ID, NAME) VALUES (?, ?)
Sep 28, 2011 2:25:05 PM org.apache.cayenne.log.CommonsJdbcEventLogger logQueryParameters
INFO: [bind: 1->ID:200, 2->NAME:'X']
Sep 28, 2011 2:25:05 PM org.apache.cayenne.log.CommonsJdbcEventLogger logUpdateCount
INFO: === updated 1 row.
Sep 28, 2011 2:25:05 PM org.apache.cayenne.log.CommonsJdbcEventLogger logCommitTransaction
INFO: +++ transaction committed.
Sep 28, 2011 2:25:05 PM org.apache.cayenne.log.CommonsJdbcEventLogger logBeginTransaction
INFO: --- transaction started.
Sep 28, 2011 2:25:05 PM org.apache.cayenne.log.CommonsJdbcEventLogger logQuery
INFO: UPDATE MASTER SET NAME = ? WHERE ID = ?
Sep 28, 2011 2:25:05 PM org.apache.cayenne.log.CommonsJdbcEventLogger logQueryParameters
INFO: [bind: 1->NAME:'Y', 2->ID:200]
Sep 28, 2011 2:25:05 PM org.apache.cayenne.log.CommonsJdbcEventLogger logUpdateCount
INFO: === updated 1 row.
Sep 28, 2011 2:25:05 PM org.apache.cayenne.log.CommonsJdbcEventLogger logCommitTransaction
INFO: +++ transaction committed.
Sep 28, 2011 2:25:05 PM org.apache.cayenne.configuration.XMLDataChannelDescriptorLoader load
INFO: Loading XML configuration resource from file:/x1/jenkins/jenkins-slave/workspace/Cayenne-trunk/cayenneTestConnection/derby/collationCi/true/jdk/JDK%201.6%20(latest)/label/Ubuntu/trunk/framework/cayenne-jdk1.5-unpublished/target/test-classes/cayenne-relationships.xml
Sep 28, 2011 2:25:05 PM org.apache.cayenne.map.EntityResolver applyDBLayerDefaults
INFO: added runtime complimentary DbRelationship from DELETE_RULE_TEST3 to DELETE_RULE_TEST1
Sep 28, 2011 2:25:05 PM org.apache.cayenne.map.EntityResolver applyObjectLayerDefaults
INFO: added runtime complimentary ObjRelationship from FlattenedTest3 to FlattenedTest1
Sep 28, 2011 2:25:05 PM org.apache.cayenne.map.EntityResolver applyObjectLayerDefaults
INFO: added runtime complimentary ObjRelationship from FlattenedTest4 to FlattenedTest1
Sep 28, 2011 2:25:05 PM org.apache.cayenne.log.CommonsJdbcEventLogger logBeginTransaction
INFO: --- transaction started.
Sep 28, 2011 2:25:05 PM org.apache.cayenne.log.CommonsJdbcEventLogger logQuery
INFO: SELECT NEXT_ID FROM AUTO_PK_SUPPORT WHERE TABLE_NAME = 'CHILD'
Sep 28, 2011 2:25:05 PM org.apache.cayenne.log.CommonsJdbcEventLogger logSelectCount
INFO: === returned 1 row. - took 0 ms.
Sep 28, 2011 2:25:05 PM org.apache.cayenne.log.CommonsJdbcEventLogger logQuery
INFO: UPDATE AUTO_PK_SUPPORT SET NEXT_ID = NEXT_ID + 20 WHERE TABLE_NAME = 'CHILD'
Sep 28, 2011 2:25:05 PM org.apache.cayenne.log.CommonsJdbcEventLogger logUpdateCount
INFO: === updated 1 row.
Sep 28, 2011 2:25:05 PM org.apache.cayenne.log.CommonsJdbcEventLogger logQuery
INFO: INSERT INTO MASTER (ID, NAME) VALUES (?, ?)
Sep 28, 2011 2:25:05 PM org.apache.cayenne.log.CommonsJdbcEventLogger logQueryParameters
INFO: [bind: 1->ID:201, 2->NAME:'Y']
Sep 28, 2011 2:25:05 PM org.apache.cayenne.log.CommonsJdbcEventLogger logUpdateCount
INFO: === updated 1 row.
Sep 28, 2011 2:25:05 PM org.apache.cayenne.log.CommonsJdbcEventLogger logQueryParameters
INFO: [bind: 1->ID:202, 2->NAME:'X']
Sep 28, 2011 2:25:05 PM org.apache.cayenne.log.CommonsJdbcEventLogger logUpdateCount
INFO: === updated 1 row.
Sep 28, 2011 2:25:05 PM org.apache.cayenne.log.CommonsJdbcEventLogger logQuery
INFO: INSERT INTO CHILD (ID, MASTER_ID) VALUES (?, ?)
Sep 28, 2011 2:25:05 PM org.apache.cayenne.log.CommonsJdbcEventLogger logQueryParameters
INFO: [bind: 1->ID:200, 2->MASTER_ID:202]
Sep 28, 2011 2:25:05 PM org.apache.cayenne.log.CommonsJdbcEventLogger logUpdateCount
INFO: === updated 1 row.
Sep 28, 2011 2:25:05 PM org.apache.cayenne.log.CommonsJdbcEventLogger logCommitTransaction
INFO: +++ transaction committed.
Sep 28, 2011 2:25:05 PM org.apache.cayenne.log.CommonsJdbcEventLogger logBeginTransaction
INFO: --- transaction started.
Sep 28, 2011 2:25:05 PM org.apache.cayenne.log.CommonsJdbcEventLogger logQuery
INFO: UPDATE CHILD SET MASTER_ID = ? WHERE ID = ?
Sep 28, 2011 2:25:05 PM org.apache.cayenne.log.CommonsJdbcEventLogger logQueryParameters
INFO: [bind: 1->MASTER_ID:201, 2->ID:200]
Sep 28, 2011 2:25:05 PM org.apache.cayenne.log.CommonsJdbcEventLogger logUpdateCount
INFO: === updated 1 row.
Sep 28, 2011 2:25:05 PM org.apache.cayenne.log.CommonsJdbcEventLogger logCommitTransaction
INFO: +++ transaction committed.
Sep 28, 2011 2:25:06 PM org.apache.cayenne.configuration.XMLDataChannelDescriptorLoader load
INFO: Loading XML configuration resource from file:/x1/jenkins/jenkins-slave/workspace/Cayenne-trunk/cayenneTestConnection/derby/collationCi/true/jdk/JDK%201.6%20(latest)/label/Ubuntu/trunk/framework/cayenne-jdk1.5-unpublished/target/test-classes/cayenne-relationships.xml
Sep 28, 2011 2:25:06 PM org.apache.cayenne.map.EntityResolver applyDBLayerDefaults
INFO: added runtime complimentary DbRelationship from DELETE_RULE_TEST3 to DELETE_RULE_TEST1
Sep 28, 2011 2:25:06 PM org.apache.cayenne.map.EntityResolver applyObjectLayerDefaults
INFO: added runtime complimentary ObjRelationship from FlattenedTest3 to FlattenedTest1
Sep 28, 2011 2:25:06 PM org.apache.cayenne.map.EntityResolver applyObjectLayerDefaults
INFO: added runtime complimentary ObjRelationship from FlattenedTest4 to FlattenedTest1
Sep 28, 2011 2:25:06 PM org.apache.cayenne.log.CommonsJdbcEventLogger logBeginTransaction
INFO: --- transaction started.
Sep 28, 2011 2:25:06 PM org.apache.cayenne.log.CommonsJdbcEventLogger logQuery
INFO: INSERT INTO MASTER (ID, NAME) VALUES (?, ?)
Sep 28, 2011 2:25:06 PM org.apache.cayenne.log.CommonsJdbcEventLogger logQueryParameters
INFO: [bind: 1->ID:203, 2->NAME:'X']
Sep 28, 2011 2:25:06 PM org.apache.cayenne.log.CommonsJdbcEventLogger logUpdateCount
INFO: === updated 1 row.
Sep 28, 2011 2:25:06 PM org.apache.cayenne.log.CommonsJdbcEventLogger logQuery
INFO: INSERT INTO CHILD (ID, MASTER_ID) VALUES (?, ?)
Sep 28, 2011 2:25:06 PM org.apache.cayenne.log.CommonsJdbcEventLogger logQueryParameters
INFO: [bind: 1->ID:201, 2->MASTER_ID:203]
Sep 28, 2011 2:25:06 PM org.apache.cayenne.log.CommonsJdbcEventLogger logUpdateCount
INFO: === updated 1 row.
Sep 28, 2011 2:25:06 PM org.apache.cayenne.log.CommonsJdbcEventLogger logQueryParameters
INFO: [bind: 1->ID:202, 2->MASTER_ID:NULL]
Sep 28, 2011 2:25:06 PM org.apache.cayenne.log.CommonsJdbcEventLogger logUpdateCount
INFO: === updated 1 row.
Sep 28, 2011 2:25:06 PM org.apache.cayenne.log.CommonsJdbcEventLogger logCommitTransaction
INFO: +++ transaction committed.
Sep 28, 2011 2:25:06 PM org.apache.cayenne.log.CommonsJdbcEventLogger logBeginTransaction
INFO: --- transaction started.
Sep 28, 2011 2:25:06 PM org.apache.cayenne.log.CommonsJdbcEventLogger logQuery
INFO: UPDATE CHILD SET MASTER_ID = ? WHERE ID = ?
Sep 28, 2011 2:25:06 PM org.apache.cayenne.log.CommonsJdbcEventLogger logQueryParameters
INFO: [bind: 1->MASTER_ID:203, 2->ID:202]
Sep 28, 2011 2:25:06 PM org.apache.cayenne.log.CommonsJdbcEventLogger logUpdateCount
INFO: === updated 1 row.
Sep 28, 2011 2:25:06 PM org.apache.cayenne.log.CommonsJdbcEventLogger logCommitTransaction
INFO: +++ transaction committed.
Sep 28, 2011 2:25:06 PM org.apache.cayenne.log.CommonsJdbcEventLogger logBeginTransaction
INFO: --- transaction started.
Sep 28, 2011 2:25:06 PM org.apache.cayenne.log.CommonsJdbcEventLogger logQuery
INFO: SELECT t0.MASTER_ID, t0.ID FROM CHILD t0 WHERE t0.MASTER_ID = ? [bind: 1->MASTER_ID:203]
Sep 28, 2011 2:25:06 PM org.apache.cayenne.log.CommonsJdbcEventLogger logSelectCount
INFO: === returned 2 rows. - took 0 ms.
Sep 28, 2011 2:25:06 PM org.apache.cayenne.log.CommonsJdbcEventLogger logCommitTransaction
INFO: +++ transaction committed.
Tests run: 3, Failures: 0, Errors: 0, Skipped: 0, Time elapsed: 0.96 sec
Running org.apache.cayenne.DataRowTest
Tests run: 2, Failures: 0, Errors: 0, Skipped: 0, Time elapsed: 0.003 sec
Running org.apache.cayenne.access.types.EnumTypeTest
Tests run: 7, Failures: 0, Errors: 0, Skipped: 0, Time elapsed: 0.003 sec
Results :
Failed tests:
testSelectNotLikeIgnoreCaseSingleWildcardMatch(org.apache.cayenne.query.SelectQueryTest)
testSelectLikeIgnoreCaseObjects1(org.apache.cayenne.query.SelectQueryTest)
Tests run: 2095, Failures: 2, Errors: 0, Skipped: 0
[INFO] ------------------------------------------------------------------------
[INFO] Reactor Summary:
[INFO]
[INFO] Cayenne ........................................... SUCCESS [0.153s]
[INFO] Common Unit Test Utilities ........................ SUCCESS [1.063s]
[INFO] Cayenne Internal Build Plugin ..................... SUCCESS [0.933s]
[INFO] Cayenne Internal Documentation Build Plugin ....... SUCCESS [1.254s]
[INFO] Cayenne Build Tools Parent ........................ SUCCESS [0.007s]
[INFO] Cayenne License and Notice Bundle ................. SUCCESS [0.613s]
[INFO] Cayenne Dependency Injection Container ............ SUCCESS [2.011s]
[INFO] Cayenne Java 1.5 Unpublished ...................... FAILURE [50.200s]
[INFO] Cayenne WebObjects Compatibility Library .......... SKIPPED
[INFO] Cayenne Aggregated Server Jar ..................... SKIPPED
[INFO] Cayenne Aggregated Client Jar ..................... SKIPPED
[INFO] Cayenne Project ................................... SKIPPED
[INFO] Cayenne Tools ..................................... SKIPPED
[INFO] Library: cayenne-lifecycle ........................ SKIPPED
[INFO] Cayenne Maven Plugin .............................. SKIPPED
[INFO] Cayenne Framework Aggregator Project .............. SKIPPED
[INFO] Cayenne Integration Tests Parent .................. SKIPPED
[INFO] Integration Tests - Cayenne Runtime ............... SKIPPED
[INFO] Integration Tests - Cayenne Tools ................. SKIPPED
[INFO] Cayenne Modeler ................................... SKIPPED
[INFO] Cayenne Modeler Maven Plugin ...................... SKIPPED
[INFO] Cayenne Modeler Parent ............................ SKIPPED
[INFO] Cayenne Tutorial .................................. SKIPPED
[INFO] Cayenne ROP Server Tutorial ....................... SKIPPED
[INFO] Cayenne ROP Client Tutorial ....................... SKIPPED
[INFO] Cayenne Tutorials ................................. SKIPPED
[INFO] Cayenne Documentation ............................. SKIPPED
[INFO] Cayenne Documenation Parent ....................... SKIPPED
[INFO] Cayenne Docbook Documenation ...................... SKIPPED
[INFO] Docbook: Cayenne Guide ............................ SKIPPED
[INFO] Docbook: Getting Started with Cayenne ............. SKIPPED
[INFO] Docbook: Getting Started with Cayenne ROP ......... SKIPPED
[INFO] ------------------------------------------------------------------------
[INFO] BUILD FAILURE
[INFO] ------------------------------------------------------------------------
[INFO] Total time: 56.810s
[INFO] Finished at: Wed Sep 28 14:25:06 UTC 2011
[INFO] Final Memory: 48M/409M
[INFO] ------------------------------------------------------------------------
[ERROR] Failed to execute goal org.apache.maven.plugins:maven-surefire-plugin:2.5:test (default-test) on project cayenne-jdk1.5-unpublished: There are test failures.
[ERROR]
[ERROR] Please refer to /x1/jenkins/jenkins-slave/workspace/Cayenne-trunk/cayenneTestConnection/derby/collationCi/true/jdk/JDK 1.6 (latest)/label/Ubuntu/trunk/framework/cayenne-jdk1.5-unpublished/target/surefire-reports for the individual test results.
[ERROR] -> [Help 1]
org.apache.maven.lifecycle.LifecycleExecutionException: Failed to execute goal org.apache.maven.plugins:maven-surefire-plugin:2.5:test (default-test) on project cayenne-jdk1.5-unpublished: There are test failures.
Please refer to /x1/jenkins/jenkins-slave/workspace/Cayenne-trunk/cayenneTestConnection/derby/collationCi/true/jdk/JDK 1.6 (latest)/label/Ubuntu/trunk/framework/cayenne-jdk1.5-unpublished/target/surefire-reports for the individual test results.
at org.apache.maven.lifecycle.internal.MojoExecutor.execute(MojoExecutor.java:213)
at org.apache.maven.lifecycle.internal.MojoExecutor.execute(MojoExecutor.java:153)
at org.apache.maven.lifecycle.internal.MojoExecutor.execute(MojoExecutor.java:145)
at org.apache.maven.lifecycle.internal.LifecycleModuleBuilder.buildProject(LifecycleModuleBuilder.java:84)
at org.apache.maven.lifecycle.internal.LifecycleModuleBuilder.buildProject(LifecycleModuleBuilder.java:59)
at org.apache.maven.lifecycle.internal.LifecycleStarter.singleThreadedBuild(LifecycleStarter.java:183)
at org.apache.maven.lifecycle.internal.LifecycleStarter.execute(LifecycleStarter.java:161)
at org.apache.maven.DefaultMaven.doExecute(DefaultMaven.java:319)
at org.apache.maven.DefaultMaven.execute(DefaultMaven.java:156)
at org.apache.maven.cli.MavenCli.execute(MavenCli.java:534)
at org.apache.maven.cli.MavenCli.doMain(MavenCli.java:196)
at org.apache.maven.cli.MavenCli.main(MavenCli.java:141)
at sun.reflect.NativeMethodAccessorImpl.invoke0(Native Method)
at sun.reflect.NativeMethodAccessorImpl.invoke(NativeMethodAccessorImpl.java:39)
at sun.reflect.DelegatingMethodAccessorImpl.invoke(DelegatingMethodAccessorImpl.java:25)
at java.lang.reflect.Method.invoke(Method.java:597)
at org.codehaus.plexus.classworlds.launcher.Launcher.launchEnhanced(Launcher.java:290)
at org.codehaus.plexus.classworlds.launcher.Launcher.launch(Launcher.java:230)
at org.codehaus.plexus.classworlds.launcher.Launcher.mainWithExitCode(Launcher.java:409)
at org.codehaus.plexus.classworlds.launcher.Launcher.main(Launcher.java:352)
Caused by: org.apache.maven.plugin.MojoFailureException: There are test failures.
Please refer to /x1/jenkins/jenkins-slave/workspace/Cayenne-trunk/cayenneTestConnection/derby/collationCi/true/jdk/JDK 1.6 (latest)/label/Ubuntu/trunk/framework/cayenne-jdk1.5-unpublished/target/surefire-reports for the individual test results.
at org.apache.maven.plugin.surefire.SurefirePlugin.execute(SurefirePlugin.java:629)
at org.apache.maven.plugin.DefaultBuildPluginManager.executeMojo(DefaultBuildPluginManager.java:107)
at org.apache.maven.lifecycle.internal.MojoExecutor.execute(MojoExecutor.java:209)
... 19 more
[ERROR]
[ERROR] Re-run Maven using the -X switch to enable full debug logging.
[ERROR]
[ERROR] For more information about the errors and possible solutions, please read the following articles:
[ERROR] [Help 1] http://cwiki.apache.org/confluence/display/MAVEN/MojoFailureException
[ERROR]
[ERROR] After correcting the problems, you can resume the build with the command
[ERROR] mvn <goals> -rf :cayenne-jdk1.5-unpublished
Build step 'Invoke top-level Maven targets' marked build as failure
Archiving artifacts
Build failed in Jenkins: Cayenne-trunk » derby,true,JDK 1.6 (latest),Ubuntu #592
Posted by Apache Jenkins Server <je...@builds.apache.org>.
See <https://builds.apache.org/job/Cayenne-trunk/./cayenneTestConnection=derby,collationCi=true,jdk=JDK%201.6%20(latest),label=Ubuntu/592/changes>
Changes:
[dkazimirchyk] Docbook: removed links and corrected image paths
------------------------------------------
[...truncated 81006 lines...]
INFO: INSERT INTO PAINTING (PAINTING_ID, PAINTING_TITLE, ARTIST_ID, ESTIMATED_PRICE) VALUES (?, ?, ?, ?)
Sep 28, 2011 9:41:09 AM org.apache.cayenne.log.CommonsJdbcEventLogger logBeginTransaction
INFO: --- transaction started.
Sep 28, 2011 9:41:09 AM org.apache.cayenne.log.CommonsJdbcEventLogger logQuery
INFO: SELECT t0.DATE_OF_BIRTH, t0.ARTIST_ID, t0.ARTIST_NAME FROM ARTIST t0
Sep 28, 2011 9:41:09 AM org.apache.cayenne.log.CommonsJdbcEventLogger logSelectCount
INFO: === returned 1 row. - took 0 ms.
Sep 28, 2011 9:41:09 AM org.apache.cayenne.log.CommonsJdbcEventLogger logCommitTransaction
INFO: +++ transaction committed.
Sep 28, 2011 9:41:09 AM org.apache.cayenne.test.jdbc.UtilityLogger log
INFO: update ARTIST set ARTIST_NAME = ? where ARTIST_ID = ?
Sep 28, 2011 9:41:09 AM org.apache.cayenne.log.CommonsJdbcEventLogger logBeginTransaction
INFO: --- transaction started.
Sep 28, 2011 9:41:09 AM org.apache.cayenne.log.CommonsJdbcEventLogger logQuery
INFO: SELECT t0.DATE_OF_BIRTH, t0.ARTIST_ID, t0.ARTIST_NAME FROM ARTIST t0
Sep 28, 2011 9:41:09 AM org.apache.cayenne.log.CommonsJdbcEventLogger logSelectCount
INFO: === returned 1 row. - took 0 ms.
Sep 28, 2011 9:41:09 AM org.apache.cayenne.log.CommonsJdbcEventLogger logCommitTransaction
INFO: +++ transaction committed.
Tests run: 4, Failures: 0, Errors: 0, Skipped: 0, Time elapsed: 0.036 sec
Running org.apache.cayenne.access.NestedDataContextParentPeerEventsTest
Sep 28, 2011 9:41:09 AM org.apache.cayenne.configuration.XMLDataChannelDescriptorLoader load
INFO: Loading XML configuration resource from file:/x1/jenkins/jenkins-slave/workspace/Cayenne-trunk/cayenneTestConnection/derby/collationCi/true/jdk/JDK%201.6%20(latest)/label/Ubuntu/trunk/framework/cayenne-jdk1.5-unpublished/target/test-classes/cayenne-relationships.xml
Sep 28, 2011 9:41:09 AM org.apache.cayenne.map.EntityResolver applyDBLayerDefaults
INFO: added runtime complimentary DbRelationship from DELETE_RULE_TEST3 to DELETE_RULE_TEST1
Sep 28, 2011 9:41:09 AM org.apache.cayenne.map.EntityResolver applyObjectLayerDefaults
INFO: added runtime complimentary ObjRelationship from FlattenedTest3 to FlattenedTest1
Sep 28, 2011 9:41:09 AM org.apache.cayenne.map.EntityResolver applyObjectLayerDefaults
INFO: added runtime complimentary ObjRelationship from FlattenedTest4 to FlattenedTest1
Sep 28, 2011 9:41:09 AM org.apache.cayenne.log.CommonsJdbcEventLogger logBeginTransaction
INFO: --- transaction started.
Sep 28, 2011 9:41:09 AM org.apache.cayenne.log.CommonsJdbcEventLogger logQuery
INFO: SELECT NEXT_ID FROM AUTO_PK_SUPPORT WHERE TABLE_NAME = 'MASTER'
Sep 28, 2011 9:41:09 AM org.apache.cayenne.log.CommonsJdbcEventLogger logSelectCount
INFO: === returned 1 row. - took 0 ms.
Sep 28, 2011 9:41:09 AM org.apache.cayenne.log.CommonsJdbcEventLogger logQuery
INFO: UPDATE AUTO_PK_SUPPORT SET NEXT_ID = NEXT_ID + 20 WHERE TABLE_NAME = 'MASTER'
Sep 28, 2011 9:41:09 AM org.apache.cayenne.log.CommonsJdbcEventLogger logUpdateCount
INFO: === updated 1 row.
Sep 28, 2011 9:41:09 AM org.apache.cayenne.log.CommonsJdbcEventLogger logQuery
INFO: INSERT INTO MASTER (ID, NAME) VALUES (?, ?)
Sep 28, 2011 9:41:09 AM org.apache.cayenne.log.CommonsJdbcEventLogger logQueryParameters
INFO: [bind: 1->ID:200, 2->NAME:'X']
Sep 28, 2011 9:41:09 AM org.apache.cayenne.log.CommonsJdbcEventLogger logUpdateCount
INFO: === updated 1 row.
Sep 28, 2011 9:41:09 AM org.apache.cayenne.log.CommonsJdbcEventLogger logCommitTransaction
INFO: +++ transaction committed.
Sep 28, 2011 9:41:09 AM org.apache.cayenne.log.CommonsJdbcEventLogger logBeginTransaction
INFO: --- transaction started.
Sep 28, 2011 9:41:09 AM org.apache.cayenne.log.CommonsJdbcEventLogger logQuery
INFO: UPDATE MASTER SET NAME = ? WHERE ID = ?
Sep 28, 2011 9:41:09 AM org.apache.cayenne.log.CommonsJdbcEventLogger logQueryParameters
INFO: [bind: 1->NAME:'Y', 2->ID:200]
Sep 28, 2011 9:41:09 AM org.apache.cayenne.log.CommonsJdbcEventLogger logUpdateCount
INFO: === updated 1 row.
Sep 28, 2011 9:41:09 AM org.apache.cayenne.log.CommonsJdbcEventLogger logCommitTransaction
INFO: +++ transaction committed.
Sep 28, 2011 9:41:09 AM org.apache.cayenne.configuration.XMLDataChannelDescriptorLoader load
INFO: Loading XML configuration resource from file:/x1/jenkins/jenkins-slave/workspace/Cayenne-trunk/cayenneTestConnection/derby/collationCi/true/jdk/JDK%201.6%20(latest)/label/Ubuntu/trunk/framework/cayenne-jdk1.5-unpublished/target/test-classes/cayenne-relationships.xml
Sep 28, 2011 9:41:09 AM org.apache.cayenne.map.EntityResolver applyDBLayerDefaults
INFO: added runtime complimentary DbRelationship from DELETE_RULE_TEST3 to DELETE_RULE_TEST1
Sep 28, 2011 9:41:09 AM org.apache.cayenne.map.EntityResolver applyObjectLayerDefaults
INFO: added runtime complimentary ObjRelationship from FlattenedTest3 to FlattenedTest1
Sep 28, 2011 9:41:09 AM org.apache.cayenne.map.EntityResolver applyObjectLayerDefaults
INFO: added runtime complimentary ObjRelationship from FlattenedTest4 to FlattenedTest1
Sep 28, 2011 9:41:09 AM org.apache.cayenne.log.CommonsJdbcEventLogger logBeginTransaction
INFO: --- transaction started.
Sep 28, 2011 9:41:09 AM org.apache.cayenne.log.CommonsJdbcEventLogger logQuery
INFO: SELECT NEXT_ID FROM AUTO_PK_SUPPORT WHERE TABLE_NAME = 'CHILD'
Sep 28, 2011 9:41:09 AM org.apache.cayenne.log.CommonsJdbcEventLogger logSelectCount
INFO: === returned 1 row. - took 0 ms.
Sep 28, 2011 9:41:09 AM org.apache.cayenne.log.CommonsJdbcEventLogger logQuery
INFO: UPDATE AUTO_PK_SUPPORT SET NEXT_ID = NEXT_ID + 20 WHERE TABLE_NAME = 'CHILD'
Sep 28, 2011 9:41:09 AM org.apache.cayenne.log.CommonsJdbcEventLogger logUpdateCount
INFO: === updated 1 row.
Sep 28, 2011 9:41:09 AM org.apache.cayenne.log.CommonsJdbcEventLogger logQuery
INFO: INSERT INTO MASTER (ID, NAME) VALUES (?, ?)
Sep 28, 2011 9:41:09 AM org.apache.cayenne.log.CommonsJdbcEventLogger logQueryParameters
INFO: [bind: 1->ID:201, 2->NAME:'Y']
Sep 28, 2011 9:41:09 AM org.apache.cayenne.log.CommonsJdbcEventLogger logUpdateCount
INFO: === updated 1 row.
Sep 28, 2011 9:41:09 AM org.apache.cayenne.log.CommonsJdbcEventLogger logQueryParameters
INFO: [bind: 1->ID:202, 2->NAME:'X']
Sep 28, 2011 9:41:09 AM org.apache.cayenne.log.CommonsJdbcEventLogger logUpdateCount
INFO: === updated 1 row.
Sep 28, 2011 9:41:09 AM org.apache.cayenne.log.CommonsJdbcEventLogger logQuery
INFO: INSERT INTO CHILD (ID, MASTER_ID) VALUES (?, ?)
Sep 28, 2011 9:41:09 AM org.apache.cayenne.log.CommonsJdbcEventLogger logQueryParameters
INFO: [bind: 1->ID:200, 2->MASTER_ID:202]
Sep 28, 2011 9:41:09 AM org.apache.cayenne.log.CommonsJdbcEventLogger logUpdateCount
INFO: === updated 1 row.
Sep 28, 2011 9:41:09 AM org.apache.cayenne.log.CommonsJdbcEventLogger logCommitTransaction
INFO: +++ transaction committed.
Sep 28, 2011 9:41:09 AM org.apache.cayenne.log.CommonsJdbcEventLogger logBeginTransaction
INFO: --- transaction started.
Sep 28, 2011 9:41:09 AM org.apache.cayenne.log.CommonsJdbcEventLogger logQuery
INFO: UPDATE CHILD SET MASTER_ID = ? WHERE ID = ?
Sep 28, 2011 9:41:09 AM org.apache.cayenne.log.CommonsJdbcEventLogger logQueryParameters
INFO: [bind: 1->MASTER_ID:201, 2->ID:200]
Sep 28, 2011 9:41:09 AM org.apache.cayenne.log.CommonsJdbcEventLogger logUpdateCount
INFO: === updated 1 row.
Sep 28, 2011 9:41:09 AM org.apache.cayenne.log.CommonsJdbcEventLogger logCommitTransaction
INFO: +++ transaction committed.
Sep 28, 2011 9:41:10 AM org.apache.cayenne.configuration.XMLDataChannelDescriptorLoader load
INFO: Loading XML configuration resource from file:/x1/jenkins/jenkins-slave/workspace/Cayenne-trunk/cayenneTestConnection/derby/collationCi/true/jdk/JDK%201.6%20(latest)/label/Ubuntu/trunk/framework/cayenne-jdk1.5-unpublished/target/test-classes/cayenne-relationships.xml
Sep 28, 2011 9:41:10 AM org.apache.cayenne.map.EntityResolver applyDBLayerDefaults
INFO: added runtime complimentary DbRelationship from DELETE_RULE_TEST3 to DELETE_RULE_TEST1
Sep 28, 2011 9:41:10 AM org.apache.cayenne.map.EntityResolver applyObjectLayerDefaults
INFO: added runtime complimentary ObjRelationship from FlattenedTest3 to FlattenedTest1
Sep 28, 2011 9:41:10 AM org.apache.cayenne.map.EntityResolver applyObjectLayerDefaults
INFO: added runtime complimentary ObjRelationship from FlattenedTest4 to FlattenedTest1
Sep 28, 2011 9:41:10 AM org.apache.cayenne.log.CommonsJdbcEventLogger logBeginTransaction
INFO: --- transaction started.
Sep 28, 2011 9:41:10 AM org.apache.cayenne.log.CommonsJdbcEventLogger logQuery
INFO: INSERT INTO MASTER (ID, NAME) VALUES (?, ?)
Sep 28, 2011 9:41:10 AM org.apache.cayenne.log.CommonsJdbcEventLogger logQueryParameters
INFO: [bind: 1->ID:203, 2->NAME:'X']
Sep 28, 2011 9:41:10 AM org.apache.cayenne.log.CommonsJdbcEventLogger logUpdateCount
INFO: === updated 1 row.
Sep 28, 2011 9:41:10 AM org.apache.cayenne.log.CommonsJdbcEventLogger logQuery
INFO: INSERT INTO CHILD (ID, MASTER_ID) VALUES (?, ?)
Sep 28, 2011 9:41:10 AM org.apache.cayenne.log.CommonsJdbcEventLogger logQueryParameters
INFO: [bind: 1->ID:201, 2->MASTER_ID:NULL]
Sep 28, 2011 9:41:10 AM org.apache.cayenne.log.CommonsJdbcEventLogger logUpdateCount
INFO: === updated 1 row.
Sep 28, 2011 9:41:10 AM org.apache.cayenne.log.CommonsJdbcEventLogger logQueryParameters
INFO: [bind: 1->ID:202, 2->MASTER_ID:203]
Sep 28, 2011 9:41:10 AM org.apache.cayenne.log.CommonsJdbcEventLogger logUpdateCount
INFO: === updated 1 row.
Sep 28, 2011 9:41:10 AM org.apache.cayenne.log.CommonsJdbcEventLogger logCommitTransaction
INFO: +++ transaction committed.
Sep 28, 2011 9:41:10 AM org.apache.cayenne.log.CommonsJdbcEventLogger logBeginTransaction
INFO: --- transaction started.
Sep 28, 2011 9:41:10 AM org.apache.cayenne.log.CommonsJdbcEventLogger logQuery
INFO: UPDATE CHILD SET MASTER_ID = ? WHERE ID = ?
Sep 28, 2011 9:41:10 AM org.apache.cayenne.log.CommonsJdbcEventLogger logQueryParameters
INFO: [bind: 1->MASTER_ID:203, 2->ID:201]
Sep 28, 2011 9:41:10 AM org.apache.cayenne.log.CommonsJdbcEventLogger logUpdateCount
INFO: === updated 1 row.
Sep 28, 2011 9:41:10 AM org.apache.cayenne.log.CommonsJdbcEventLogger logCommitTransaction
INFO: +++ transaction committed.
Sep 28, 2011 9:41:10 AM org.apache.cayenne.log.CommonsJdbcEventLogger logBeginTransaction
INFO: --- transaction started.
Sep 28, 2011 9:41:10 AM org.apache.cayenne.log.CommonsJdbcEventLogger logQuery
INFO: SELECT t0.MASTER_ID, t0.ID FROM CHILD t0 WHERE t0.MASTER_ID = ? [bind: 1->MASTER_ID:203]
Sep 28, 2011 9:41:10 AM org.apache.cayenne.log.CommonsJdbcEventLogger logSelectCount
INFO: === returned 2 rows. - took 1 ms.
Sep 28, 2011 9:41:10 AM org.apache.cayenne.log.CommonsJdbcEventLogger logCommitTransaction
INFO: +++ transaction committed.
Tests run: 3, Failures: 0, Errors: 0, Skipped: 0, Time elapsed: 0.955 sec
Running org.apache.cayenne.DataRowTest
Tests run: 2, Failures: 0, Errors: 0, Skipped: 0, Time elapsed: 0.002 sec
Running org.apache.cayenne.access.types.EnumTypeTest
Tests run: 7, Failures: 0, Errors: 0, Skipped: 0, Time elapsed: 0.003 sec
Results :
Failed tests:
testSelectNotLikeIgnoreCaseSingleWildcardMatch(org.apache.cayenne.query.SelectQueryTest)
testSelectLikeIgnoreCaseObjects1(org.apache.cayenne.query.SelectQueryTest)
Tests run: 2095, Failures: 2, Errors: 0, Skipped: 0
[INFO] ------------------------------------------------------------------------
[INFO] Reactor Summary:
[INFO]
[INFO] Cayenne ........................................... SUCCESS [0.274s]
[INFO] Common Unit Test Utilities ........................ SUCCESS [1.710s]
[INFO] Cayenne Internal Build Plugin ..................... SUCCESS [1.683s]
[INFO] Cayenne Internal Documentation Build Plugin ....... SUCCESS [2.121s]
[INFO] Cayenne Build Tools Parent ........................ SUCCESS [0.028s]
[INFO] Cayenne License and Notice Bundle ................. SUCCESS [0.822s]
[INFO] Cayenne Dependency Injection Container ............ SUCCESS [2.368s]
[INFO] Cayenne Java 1.5 Unpublished ...................... FAILURE [58.022s]
[INFO] Cayenne WebObjects Compatibility Library .......... SKIPPED
[INFO] Cayenne Aggregated Server Jar ..................... SKIPPED
[INFO] Cayenne Aggregated Client Jar ..................... SKIPPED
[INFO] Cayenne Project ................................... SKIPPED
[INFO] Cayenne Tools ..................................... SKIPPED
[INFO] Library: cayenne-lifecycle ........................ SKIPPED
[INFO] Cayenne Maven Plugin .............................. SKIPPED
[INFO] Cayenne Framework Aggregator Project .............. SKIPPED
[INFO] Cayenne Integration Tests Parent .................. SKIPPED
[INFO] Integration Tests - Cayenne Runtime ............... SKIPPED
[INFO] Integration Tests - Cayenne Tools ................. SKIPPED
[INFO] Cayenne Modeler ................................... SKIPPED
[INFO] Cayenne Modeler Maven Plugin ...................... SKIPPED
[INFO] Cayenne Modeler Parent ............................ SKIPPED
[INFO] Cayenne Tutorial .................................. SKIPPED
[INFO] Cayenne ROP Server Tutorial ....................... SKIPPED
[INFO] Cayenne ROP Client Tutorial ....................... SKIPPED
[INFO] Cayenne Tutorials ................................. SKIPPED
[INFO] Cayenne Documentation ............................. SKIPPED
[INFO] Cayenne Documenation Parent ....................... SKIPPED
[INFO] Cayenne Docbook Documenation ...................... SKIPPED
[INFO] Docbook: Cayenne Guide ............................ SKIPPED
[INFO] Docbook: Getting Started with Cayenne ............. SKIPPED
[INFO] Docbook: Getting Started with Cayenne ROP ......... SKIPPED
[INFO] ------------------------------------------------------------------------
[INFO] BUILD FAILURE
[INFO] ------------------------------------------------------------------------
[INFO] Total time: 1:08.074s
[INFO] Finished at: Wed Sep 28 09:41:10 UTC 2011
[INFO] Final Memory: 47M/348M
[INFO] ------------------------------------------------------------------------
[ERROR] Failed to execute goal org.apache.maven.plugins:maven-surefire-plugin:2.5:test (default-test) on project cayenne-jdk1.5-unpublished: There are test failures.
[ERROR]
[ERROR] Please refer to /x1/jenkins/jenkins-slave/workspace/Cayenne-trunk/cayenneTestConnection/derby/collationCi/true/jdk/JDK 1.6 (latest)/label/Ubuntu/trunk/framework/cayenne-jdk1.5-unpublished/target/surefire-reports for the individual test results.
[ERROR] -> [Help 1]
org.apache.maven.lifecycle.LifecycleExecutionException: Failed to execute goal org.apache.maven.plugins:maven-surefire-plugin:2.5:test (default-test) on project cayenne-jdk1.5-unpublished: There are test failures.
Please refer to /x1/jenkins/jenkins-slave/workspace/Cayenne-trunk/cayenneTestConnection/derby/collationCi/true/jdk/JDK 1.6 (latest)/label/Ubuntu/trunk/framework/cayenne-jdk1.5-unpublished/target/surefire-reports for the individual test results.
at org.apache.maven.lifecycle.internal.MojoExecutor.execute(MojoExecutor.java:213)
at org.apache.maven.lifecycle.internal.MojoExecutor.execute(MojoExecutor.java:153)
at org.apache.maven.lifecycle.internal.MojoExecutor.execute(MojoExecutor.java:145)
at org.apache.maven.lifecycle.internal.LifecycleModuleBuilder.buildProject(LifecycleModuleBuilder.java:84)
at org.apache.maven.lifecycle.internal.LifecycleModuleBuilder.buildProject(LifecycleModuleBuilder.java:59)
at org.apache.maven.lifecycle.internal.LifecycleStarter.singleThreadedBuild(LifecycleStarter.java:183)
at org.apache.maven.lifecycle.internal.LifecycleStarter.execute(LifecycleStarter.java:161)
at org.apache.maven.DefaultMaven.doExecute(DefaultMaven.java:319)
at org.apache.maven.DefaultMaven.execute(DefaultMaven.java:156)
at org.apache.maven.cli.MavenCli.execute(MavenCli.java:534)
at org.apache.maven.cli.MavenCli.doMain(MavenCli.java:196)
at org.apache.maven.cli.MavenCli.main(MavenCli.java:141)
at sun.reflect.NativeMethodAccessorImpl.invoke0(Native Method)
at sun.reflect.NativeMethodAccessorImpl.invoke(NativeMethodAccessorImpl.java:39)
at sun.reflect.DelegatingMethodAccessorImpl.invoke(DelegatingMethodAccessorImpl.java:25)
at java.lang.reflect.Method.invoke(Method.java:597)
at org.codehaus.plexus.classworlds.launcher.Launcher.launchEnhanced(Launcher.java:290)
at org.codehaus.plexus.classworlds.launcher.Launcher.launch(Launcher.java:230)
at org.codehaus.plexus.classworlds.launcher.Launcher.mainWithExitCode(Launcher.java:409)
at org.codehaus.plexus.classworlds.launcher.Launcher.main(Launcher.java:352)
Caused by: org.apache.maven.plugin.MojoFailureException: There are test failures.
Please refer to /x1/jenkins/jenkins-slave/workspace/Cayenne-trunk/cayenneTestConnection/derby/collationCi/true/jdk/JDK 1.6 (latest)/label/Ubuntu/trunk/framework/cayenne-jdk1.5-unpublished/target/surefire-reports for the individual test results.
at org.apache.maven.plugin.surefire.SurefirePlugin.execute(SurefirePlugin.java:629)
at org.apache.maven.plugin.DefaultBuildPluginManager.executeMojo(DefaultBuildPluginManager.java:107)
at org.apache.maven.lifecycle.internal.MojoExecutor.execute(MojoExecutor.java:209)
... 19 more
[ERROR]
[ERROR] Re-run Maven using the -X switch to enable full debug logging.
[ERROR]
[ERROR] For more information about the errors and possible solutions, please read the following articles:
[ERROR] [Help 1] http://cwiki.apache.org/confluence/display/MAVEN/MojoFailureException
[ERROR]
[ERROR] After correcting the problems, you can resume the build with the command
[ERROR] mvn <goals> -rf :cayenne-jdk1.5-unpublished
Build step 'Invoke top-level Maven targets' marked build as failure
Archiving artifacts
Build failed in Jenkins: Cayenne-trunk » derby,true,JDK 1.6 (latest),Ubuntu #591
Posted by Apache Jenkins Server <je...@builds.apache.org>.
See <https://builds.apache.org/job/Cayenne-trunk/./cayenneTestConnection=derby,collationCi=true,jdk=JDK%201.6%20(latest),label=Ubuntu/591/changes>
Changes:
[dkazimirchyk] added docbook to default Cayenne build process
------------------------------------------
[...truncated 85370 lines...]
INFO: INSERT INTO PAINTING (PAINTING_ID, PAINTING_TITLE, ARTIST_ID, ESTIMATED_PRICE) VALUES (?, ?, ?, ?)
Sep 27, 2011 4:38:29 PM org.apache.cayenne.log.CommonsJdbcEventLogger logBeginTransaction
INFO: --- transaction started.
Sep 27, 2011 4:38:29 PM org.apache.cayenne.log.CommonsJdbcEventLogger logQuery
INFO: SELECT t0.DATE_OF_BIRTH, t0.ARTIST_ID, t0.ARTIST_NAME FROM ARTIST t0
Sep 27, 2011 4:38:29 PM org.apache.cayenne.log.CommonsJdbcEventLogger logSelectCount
INFO: === returned 1 row. - took 1 ms.
Sep 27, 2011 4:38:29 PM org.apache.cayenne.log.CommonsJdbcEventLogger logCommitTransaction
INFO: +++ transaction committed.
Sep 27, 2011 4:38:29 PM org.apache.cayenne.test.jdbc.UtilityLogger log
INFO: update ARTIST set ARTIST_NAME = ? where ARTIST_ID = ?
Sep 27, 2011 4:38:29 PM org.apache.cayenne.log.CommonsJdbcEventLogger logBeginTransaction
INFO: --- transaction started.
Sep 27, 2011 4:38:29 PM org.apache.cayenne.log.CommonsJdbcEventLogger logQuery
INFO: SELECT t0.DATE_OF_BIRTH, t0.ARTIST_ID, t0.ARTIST_NAME FROM ARTIST t0
Sep 27, 2011 4:38:29 PM org.apache.cayenne.log.CommonsJdbcEventLogger logSelectCount
INFO: === returned 1 row. - took 1 ms.
Sep 27, 2011 4:38:29 PM org.apache.cayenne.log.CommonsJdbcEventLogger logCommitTransaction
INFO: +++ transaction committed.
Tests run: 4, Failures: 0, Errors: 0, Skipped: 0, Time elapsed: 0.032 sec
Running org.apache.cayenne.access.NestedDataContextParentPeerEventsTest
Sep 27, 2011 4:38:29 PM org.apache.cayenne.configuration.XMLDataChannelDescriptorLoader load
INFO: Loading XML configuration resource from file:/x1/jenkins/jenkins-slave/workspace/Cayenne-trunk/cayenneTestConnection/derby/collationCi/true/jdk/JDK%201.6%20(latest)/label/Ubuntu/trunk/framework/cayenne-jdk1.5-unpublished/target/test-classes/cayenne-relationships.xml
Sep 27, 2011 4:38:29 PM org.apache.cayenne.map.EntityResolver applyDBLayerDefaults
INFO: added runtime complimentary DbRelationship from DELETE_RULE_TEST3 to DELETE_RULE_TEST1
Sep 27, 2011 4:38:29 PM org.apache.cayenne.map.EntityResolver applyObjectLayerDefaults
INFO: added runtime complimentary ObjRelationship from FlattenedTest3 to FlattenedTest1
Sep 27, 2011 4:38:29 PM org.apache.cayenne.map.EntityResolver applyObjectLayerDefaults
INFO: added runtime complimentary ObjRelationship from FlattenedTest4 to FlattenedTest1
Sep 27, 2011 4:38:29 PM org.apache.cayenne.log.CommonsJdbcEventLogger logBeginTransaction
INFO: --- transaction started.
Sep 27, 2011 4:38:29 PM org.apache.cayenne.log.CommonsJdbcEventLogger logQuery
INFO: SELECT NEXT_ID FROM AUTO_PK_SUPPORT WHERE TABLE_NAME = 'MASTER'
Sep 27, 2011 4:38:29 PM org.apache.cayenne.log.CommonsJdbcEventLogger logSelectCount
INFO: === returned 1 row. - took 0 ms.
Sep 27, 2011 4:38:29 PM org.apache.cayenne.log.CommonsJdbcEventLogger logQuery
INFO: UPDATE AUTO_PK_SUPPORT SET NEXT_ID = NEXT_ID + 20 WHERE TABLE_NAME = 'MASTER'
Sep 27, 2011 4:38:29 PM org.apache.cayenne.log.CommonsJdbcEventLogger logUpdateCount
INFO: === updated 1 row.
Sep 27, 2011 4:38:29 PM org.apache.cayenne.log.CommonsJdbcEventLogger logQuery
INFO: INSERT INTO MASTER (ID, NAME) VALUES (?, ?)
Sep 27, 2011 4:38:29 PM org.apache.cayenne.log.CommonsJdbcEventLogger logQueryParameters
INFO: [bind: 1->ID:200, 2->NAME:'X']
Sep 27, 2011 4:38:29 PM org.apache.cayenne.log.CommonsJdbcEventLogger logUpdateCount
INFO: === updated 1 row.
Sep 27, 2011 4:38:29 PM org.apache.cayenne.log.CommonsJdbcEventLogger logCommitTransaction
INFO: +++ transaction committed.
Sep 27, 2011 4:38:29 PM org.apache.cayenne.log.CommonsJdbcEventLogger logBeginTransaction
INFO: --- transaction started.
Sep 27, 2011 4:38:29 PM org.apache.cayenne.log.CommonsJdbcEventLogger logQuery
INFO: UPDATE MASTER SET NAME = ? WHERE ID = ?
Sep 27, 2011 4:38:29 PM org.apache.cayenne.log.CommonsJdbcEventLogger logQueryParameters
INFO: [bind: 1->NAME:'Y', 2->ID:200]
Sep 27, 2011 4:38:29 PM org.apache.cayenne.log.CommonsJdbcEventLogger logUpdateCount
INFO: === updated 1 row.
Sep 27, 2011 4:38:29 PM org.apache.cayenne.log.CommonsJdbcEventLogger logCommitTransaction
INFO: +++ transaction committed.
Sep 27, 2011 4:38:30 PM org.apache.cayenne.configuration.XMLDataChannelDescriptorLoader load
INFO: Loading XML configuration resource from file:/x1/jenkins/jenkins-slave/workspace/Cayenne-trunk/cayenneTestConnection/derby/collationCi/true/jdk/JDK%201.6%20(latest)/label/Ubuntu/trunk/framework/cayenne-jdk1.5-unpublished/target/test-classes/cayenne-relationships.xml
Sep 27, 2011 4:38:30 PM org.apache.cayenne.map.EntityResolver applyDBLayerDefaults
INFO: added runtime complimentary DbRelationship from DELETE_RULE_TEST3 to DELETE_RULE_TEST1
Sep 27, 2011 4:38:30 PM org.apache.cayenne.map.EntityResolver applyObjectLayerDefaults
INFO: added runtime complimentary ObjRelationship from FlattenedTest3 to FlattenedTest1
Sep 27, 2011 4:38:30 PM org.apache.cayenne.map.EntityResolver applyObjectLayerDefaults
INFO: added runtime complimentary ObjRelationship from FlattenedTest4 to FlattenedTest1
Sep 27, 2011 4:38:30 PM org.apache.cayenne.log.CommonsJdbcEventLogger logBeginTransaction
INFO: --- transaction started.
Sep 27, 2011 4:38:30 PM org.apache.cayenne.log.CommonsJdbcEventLogger logQuery
INFO: SELECT NEXT_ID FROM AUTO_PK_SUPPORT WHERE TABLE_NAME = 'CHILD'
Sep 27, 2011 4:38:30 PM org.apache.cayenne.log.CommonsJdbcEventLogger logSelectCount
INFO: === returned 1 row. - took 0 ms.
Sep 27, 2011 4:38:30 PM org.apache.cayenne.log.CommonsJdbcEventLogger logQuery
INFO: UPDATE AUTO_PK_SUPPORT SET NEXT_ID = NEXT_ID + 20 WHERE TABLE_NAME = 'CHILD'
Sep 27, 2011 4:38:30 PM org.apache.cayenne.log.CommonsJdbcEventLogger logUpdateCount
INFO: === updated 1 row.
Sep 27, 2011 4:38:30 PM org.apache.cayenne.log.CommonsJdbcEventLogger logQuery
INFO: INSERT INTO MASTER (ID, NAME) VALUES (?, ?)
Sep 27, 2011 4:38:30 PM org.apache.cayenne.log.CommonsJdbcEventLogger logQueryParameters
INFO: [bind: 1->ID:201, 2->NAME:'X']
Sep 27, 2011 4:38:30 PM org.apache.cayenne.log.CommonsJdbcEventLogger logUpdateCount
INFO: === updated 1 row.
Sep 27, 2011 4:38:30 PM org.apache.cayenne.log.CommonsJdbcEventLogger logQueryParameters
INFO: [bind: 1->ID:202, 2->NAME:'Y']
Sep 27, 2011 4:38:30 PM org.apache.cayenne.log.CommonsJdbcEventLogger logUpdateCount
INFO: === updated 1 row.
Sep 27, 2011 4:38:30 PM org.apache.cayenne.log.CommonsJdbcEventLogger logQuery
INFO: INSERT INTO CHILD (ID, MASTER_ID) VALUES (?, ?)
Sep 27, 2011 4:38:30 PM org.apache.cayenne.log.CommonsJdbcEventLogger logQueryParameters
INFO: [bind: 1->ID:200, 2->MASTER_ID:201]
Sep 27, 2011 4:38:30 PM org.apache.cayenne.log.CommonsJdbcEventLogger logUpdateCount
INFO: === updated 1 row.
Sep 27, 2011 4:38:30 PM org.apache.cayenne.log.CommonsJdbcEventLogger logCommitTransaction
INFO: +++ transaction committed.
Sep 27, 2011 4:38:30 PM org.apache.cayenne.log.CommonsJdbcEventLogger logBeginTransaction
INFO: --- transaction started.
Sep 27, 2011 4:38:30 PM org.apache.cayenne.log.CommonsJdbcEventLogger logQuery
INFO: UPDATE CHILD SET MASTER_ID = ? WHERE ID = ?
Sep 27, 2011 4:38:30 PM org.apache.cayenne.log.CommonsJdbcEventLogger logQueryParameters
INFO: [bind: 1->MASTER_ID:202, 2->ID:200]
Sep 27, 2011 4:38:30 PM org.apache.cayenne.log.CommonsJdbcEventLogger logUpdateCount
INFO: === updated 1 row.
Sep 27, 2011 4:38:30 PM org.apache.cayenne.log.CommonsJdbcEventLogger logCommitTransaction
INFO: +++ transaction committed.
Sep 27, 2011 4:38:30 PM org.apache.cayenne.configuration.XMLDataChannelDescriptorLoader load
INFO: Loading XML configuration resource from file:/x1/jenkins/jenkins-slave/workspace/Cayenne-trunk/cayenneTestConnection/derby/collationCi/true/jdk/JDK%201.6%20(latest)/label/Ubuntu/trunk/framework/cayenne-jdk1.5-unpublished/target/test-classes/cayenne-relationships.xml
Sep 27, 2011 4:38:30 PM org.apache.cayenne.map.EntityResolver applyDBLayerDefaults
INFO: added runtime complimentary DbRelationship from DELETE_RULE_TEST3 to DELETE_RULE_TEST1
Sep 27, 2011 4:38:30 PM org.apache.cayenne.map.EntityResolver applyObjectLayerDefaults
INFO: added runtime complimentary ObjRelationship from FlattenedTest3 to FlattenedTest1
Sep 27, 2011 4:38:30 PM org.apache.cayenne.map.EntityResolver applyObjectLayerDefaults
INFO: added runtime complimentary ObjRelationship from FlattenedTest4 to FlattenedTest1
Sep 27, 2011 4:38:30 PM org.apache.cayenne.log.CommonsJdbcEventLogger logBeginTransaction
INFO: --- transaction started.
Sep 27, 2011 4:38:30 PM org.apache.cayenne.log.CommonsJdbcEventLogger logQuery
INFO: INSERT INTO MASTER (ID, NAME) VALUES (?, ?)
Sep 27, 2011 4:38:30 PM org.apache.cayenne.log.CommonsJdbcEventLogger logQueryParameters
INFO: [bind: 1->ID:203, 2->NAME:'X']
Sep 27, 2011 4:38:30 PM org.apache.cayenne.log.CommonsJdbcEventLogger logUpdateCount
INFO: === updated 1 row.
Sep 27, 2011 4:38:30 PM org.apache.cayenne.log.CommonsJdbcEventLogger logQuery
INFO: INSERT INTO CHILD (ID, MASTER_ID) VALUES (?, ?)
Sep 27, 2011 4:38:30 PM org.apache.cayenne.log.CommonsJdbcEventLogger logQueryParameters
INFO: [bind: 1->ID:201, 2->MASTER_ID:203]
Sep 27, 2011 4:38:30 PM org.apache.cayenne.log.CommonsJdbcEventLogger logUpdateCount
INFO: === updated 1 row.
Sep 27, 2011 4:38:30 PM org.apache.cayenne.log.CommonsJdbcEventLogger logQueryParameters
INFO: [bind: 1->ID:202, 2->MASTER_ID:NULL]
Sep 27, 2011 4:38:30 PM org.apache.cayenne.log.CommonsJdbcEventLogger logUpdateCount
INFO: === updated 1 row.
Sep 27, 2011 4:38:30 PM org.apache.cayenne.log.CommonsJdbcEventLogger logCommitTransaction
INFO: +++ transaction committed.
Sep 27, 2011 4:38:30 PM org.apache.cayenne.log.CommonsJdbcEventLogger logBeginTransaction
INFO: --- transaction started.
Sep 27, 2011 4:38:30 PM org.apache.cayenne.log.CommonsJdbcEventLogger logQuery
INFO: UPDATE CHILD SET MASTER_ID = ? WHERE ID = ?
Sep 27, 2011 4:38:30 PM org.apache.cayenne.log.CommonsJdbcEventLogger logQueryParameters
INFO: [bind: 1->MASTER_ID:203, 2->ID:202]
Sep 27, 2011 4:38:30 PM org.apache.cayenne.log.CommonsJdbcEventLogger logUpdateCount
INFO: === updated 1 row.
Sep 27, 2011 4:38:30 PM org.apache.cayenne.log.CommonsJdbcEventLogger logCommitTransaction
INFO: +++ transaction committed.
Sep 27, 2011 4:38:30 PM org.apache.cayenne.log.CommonsJdbcEventLogger logBeginTransaction
INFO: --- transaction started.
Sep 27, 2011 4:38:30 PM org.apache.cayenne.log.CommonsJdbcEventLogger logQuery
INFO: SELECT t0.MASTER_ID, t0.ID FROM CHILD t0 WHERE t0.MASTER_ID = ? [bind: 1->MASTER_ID:203]
Sep 27, 2011 4:38:30 PM org.apache.cayenne.log.CommonsJdbcEventLogger logSelectCount
INFO: === returned 2 rows. - took 1 ms.
Sep 27, 2011 4:38:30 PM org.apache.cayenne.log.CommonsJdbcEventLogger logCommitTransaction
INFO: +++ transaction committed.
Tests run: 3, Failures: 0, Errors: 0, Skipped: 0, Time elapsed: 0.955 sec
Running org.apache.cayenne.DataRowTest
Tests run: 2, Failures: 0, Errors: 0, Skipped: 0, Time elapsed: 0.003 sec
Running org.apache.cayenne.access.types.EnumTypeTest
Tests run: 7, Failures: 0, Errors: 0, Skipped: 0, Time elapsed: 0.003 sec
Results :
Failed tests:
testSelectNotLikeIgnoreCaseSingleWildcardMatch(org.apache.cayenne.query.SelectQueryTest)
testSelectLikeIgnoreCaseObjects1(org.apache.cayenne.query.SelectQueryTest)
Tests run: 2095, Failures: 2, Errors: 0, Skipped: 0
[INFO] ------------------------------------------------------------------------
[INFO] Reactor Summary:
[INFO]
[INFO] Cayenne ........................................... SUCCESS [0.148s]
[INFO] Common Unit Test Utilities ........................ SUCCESS [0.987s]
[INFO] Cayenne Internal Build Plugin ..................... SUCCESS [0.841s]
[INFO] Cayenne Internal Documentation Build Plugin ....... SUCCESS [1.123s]
[INFO] Cayenne Build Tools Parent ........................ SUCCESS [0.006s]
[INFO] Cayenne License and Notice Bundle ................. SUCCESS [0.483s]
[INFO] Cayenne Dependency Injection Container ............ SUCCESS [1.796s]
[INFO] Cayenne Java 1.5 Unpublished ...................... FAILURE [48.139s]
[INFO] Cayenne WebObjects Compatibility Library .......... SKIPPED
[INFO] Cayenne Aggregated Server Jar ..................... SKIPPED
[INFO] Cayenne Aggregated Client Jar ..................... SKIPPED
[INFO] Cayenne Project ................................... SKIPPED
[INFO] Cayenne Tools ..................................... SKIPPED
[INFO] Library: cayenne-lifecycle ........................ SKIPPED
[INFO] Cayenne Maven Plugin .............................. SKIPPED
[INFO] Cayenne Framework Aggregator Project .............. SKIPPED
[INFO] Cayenne Integration Tests Parent .................. SKIPPED
[INFO] Integration Tests - Cayenne Runtime ............... SKIPPED
[INFO] Integration Tests - Cayenne Tools ................. SKIPPED
[INFO] Cayenne Modeler ................................... SKIPPED
[INFO] Cayenne Modeler Maven Plugin ...................... SKIPPED
[INFO] Cayenne Modeler Parent ............................ SKIPPED
[INFO] Cayenne Tutorial .................................. SKIPPED
[INFO] Cayenne ROP Server Tutorial ....................... SKIPPED
[INFO] Cayenne ROP Client Tutorial ....................... SKIPPED
[INFO] Cayenne Tutorials ................................. SKIPPED
[INFO] Cayenne Documentation ............................. SKIPPED
[INFO] Cayenne Documenation Parent ....................... SKIPPED
[INFO] Cayenne Docbook Documenation ...................... SKIPPED
[INFO] Docbook: Cayenne Guide ............................ SKIPPED
[INFO] Docbook: Getting Started with Cayenne ............. SKIPPED
[INFO] Docbook: Getting Started with Cayenne ROP ......... SKIPPED
[INFO] ------------------------------------------------------------------------
[INFO] BUILD FAILURE
[INFO] ------------------------------------------------------------------------
[INFO] Total time: 54.103s
[INFO] Finished at: Tue Sep 27 16:38:31 UTC 2011
[INFO] Final Memory: 46M/386M
[INFO] ------------------------------------------------------------------------
[ERROR] Failed to execute goal org.apache.maven.plugins:maven-surefire-plugin:2.5:test (default-test) on project cayenne-jdk1.5-unpublished: There are test failures.
[ERROR]
[ERROR] Please refer to /x1/jenkins/jenkins-slave/workspace/Cayenne-trunk/cayenneTestConnection/derby/collationCi/true/jdk/JDK 1.6 (latest)/label/Ubuntu/trunk/framework/cayenne-jdk1.5-unpublished/target/surefire-reports for the individual test results.
[ERROR] -> [Help 1]
org.apache.maven.lifecycle.LifecycleExecutionException: Failed to execute goal org.apache.maven.plugins:maven-surefire-plugin:2.5:test (default-test) on project cayenne-jdk1.5-unpublished: There are test failures.
Please refer to /x1/jenkins/jenkins-slave/workspace/Cayenne-trunk/cayenneTestConnection/derby/collationCi/true/jdk/JDK 1.6 (latest)/label/Ubuntu/trunk/framework/cayenne-jdk1.5-unpublished/target/surefire-reports for the individual test results.
at org.apache.maven.lifecycle.internal.MojoExecutor.execute(MojoExecutor.java:213)
at org.apache.maven.lifecycle.internal.MojoExecutor.execute(MojoExecutor.java:153)
at org.apache.maven.lifecycle.internal.MojoExecutor.execute(MojoExecutor.java:145)
at org.apache.maven.lifecycle.internal.LifecycleModuleBuilder.buildProject(LifecycleModuleBuilder.java:84)
at org.apache.maven.lifecycle.internal.LifecycleModuleBuilder.buildProject(LifecycleModuleBuilder.java:59)
at org.apache.maven.lifecycle.internal.LifecycleStarter.singleThreadedBuild(LifecycleStarter.java:183)
at org.apache.maven.lifecycle.internal.LifecycleStarter.execute(LifecycleStarter.java:161)
at org.apache.maven.DefaultMaven.doExecute(DefaultMaven.java:319)
at org.apache.maven.DefaultMaven.execute(DefaultMaven.java:156)
at org.apache.maven.cli.MavenCli.execute(MavenCli.java:534)
at org.apache.maven.cli.MavenCli.doMain(MavenCli.java:196)
at org.apache.maven.cli.MavenCli.main(MavenCli.java:141)
at sun.reflect.NativeMethodAccessorImpl.invoke0(Native Method)
at sun.reflect.NativeMethodAccessorImpl.invoke(NativeMethodAccessorImpl.java:39)
at sun.reflect.DelegatingMethodAccessorImpl.invoke(DelegatingMethodAccessorImpl.java:25)
at java.lang.reflect.Method.invoke(Method.java:597)
at org.codehaus.plexus.classworlds.launcher.Launcher.launchEnhanced(Launcher.java:290)
at org.codehaus.plexus.classworlds.launcher.Launcher.launch(Launcher.java:230)
at org.codehaus.plexus.classworlds.launcher.Launcher.mainWithExitCode(Launcher.java:409)
at org.codehaus.plexus.classworlds.launcher.Launcher.main(Launcher.java:352)
Caused by: org.apache.maven.plugin.MojoFailureException: There are test failures.
Please refer to /x1/jenkins/jenkins-slave/workspace/Cayenne-trunk/cayenneTestConnection/derby/collationCi/true/jdk/JDK 1.6 (latest)/label/Ubuntu/trunk/framework/cayenne-jdk1.5-unpublished/target/surefire-reports for the individual test results.
at org.apache.maven.plugin.surefire.SurefirePlugin.execute(SurefirePlugin.java:629)
at org.apache.maven.plugin.DefaultBuildPluginManager.executeMojo(DefaultBuildPluginManager.java:107)
at org.apache.maven.lifecycle.internal.MojoExecutor.execute(MojoExecutor.java:209)
... 19 more
[ERROR]
[ERROR] Re-run Maven using the -X switch to enable full debug logging.
[ERROR]
[ERROR] For more information about the errors and possible solutions, please read the following articles:
[ERROR] [Help 1] http://cwiki.apache.org/confluence/display/MAVEN/MojoFailureException
[ERROR]
[ERROR] After correcting the problems, you can resume the build with the command
[ERROR] mvn <goals> -rf :cayenne-jdk1.5-unpublished
Build step 'Invoke top-level Maven targets' marked build as failure
Archiving artifacts
Build failed in Jenkins: Cayenne-trunk » derby,true,JDK 1.6 (latest),Ubuntu #590
Posted by Apache Jenkins Server <je...@builds.apache.org>.
See <https://builds.apache.org/job/Cayenne-trunk/./cayenneTestConnection=derby,collationCi=true,jdk=JDK%201.6%20(latest),label=Ubuntu/590/changes>
Changes:
[dkazimirchyk] added getting-started-rop docbook module to the docs
[dkazimirchyk] changed size of monospace font since listings didn't fit to pdf pages
[dkazimirchyk] Getting Started with Cayenne docbook correction
[dkazimirchyk] Getting Started with Cayenne ROP docbook
------------------------------------------
[...truncated 80430 lines...]
INFO: added runtime complimentary ObjRelationship from Artist to CompoundPaintingLongNames
Sep 27, 2011 3:33:07 PM org.apache.cayenne.map.EntityResolver applyObjectLayerDefaults
INFO: added runtime complimentary ObjRelationship from ROArtist to CompoundPaintingLongNames
Sep 27, 2011 3:33:07 PM org.apache.cayenne.map.EntityResolver applyObjectLayerDefaults
INFO: added runtime complimentary ObjRelationship from Gallery to CompoundPaintingLongNames
Sep 27, 2011 3:33:07 PM org.apache.cayenne.map.EntityResolver applyObjectLayerDefaults
INFO: added runtime complimentary ObjRelationship from PaintingInfo to CompoundPaintingLongNames
Sep 27, 2011 3:33:07 PM org.apache.cayenne.map.EntityResolver applyObjectLayerDefaults
INFO: added runtime complimentary ObjRelationship from Artist to Painting1
Sep 27, 2011 3:33:07 PM org.apache.cayenne.map.EntityResolver applyObjectLayerDefaults
INFO: added runtime complimentary ObjRelationship from Painting to ROArtist
Sep 27, 2011 3:33:07 PM org.apache.cayenne.map.EntityResolver applyObjectLayerDefaults
INFO: added runtime complimentary ObjRelationship from Artist to ROPainting
Sep 27, 2011 3:33:07 PM org.apache.cayenne.test.jdbc.UtilityLogger log
INFO: delete from ARTIST
Sep 27, 2011 3:33:07 PM org.apache.cayenne.test.jdbc.UtilityLogger log
INFO: delete from PAINTING
Sep 27, 2011 3:33:07 PM org.apache.cayenne.test.jdbc.UtilityLogger log
INFO: INSERT INTO ARTIST (ARTIST_ID, ARTIST_NAME) VALUES (?, ?)
Sep 27, 2011 3:33:07 PM org.apache.cayenne.test.jdbc.UtilityLogger log
INFO: INSERT INTO PAINTING (PAINTING_ID, PAINTING_TITLE, ARTIST_ID, ESTIMATED_PRICE) VALUES (?, ?, ?, ?)
Sep 27, 2011 3:33:07 PM org.apache.cayenne.log.CommonsJdbcEventLogger logBeginTransaction
INFO: --- transaction started.
Sep 27, 2011 3:33:07 PM org.apache.cayenne.log.CommonsJdbcEventLogger logQuery
INFO: SELECT t0.DATE_OF_BIRTH, t0.ARTIST_ID, t0.ARTIST_NAME FROM ARTIST t0
Sep 27, 2011 3:33:07 PM org.apache.cayenne.log.CommonsJdbcEventLogger logSelectCount
INFO: === returned 1 row. - took 3 ms.
Sep 27, 2011 3:33:07 PM org.apache.cayenne.log.CommonsJdbcEventLogger logCommitTransaction
INFO: +++ transaction committed.
Sep 27, 2011 3:33:07 PM org.apache.cayenne.test.jdbc.UtilityLogger log
INFO: update ARTIST set ARTIST_NAME = ? where ARTIST_ID = ?
Sep 27, 2011 3:33:07 PM org.apache.cayenne.log.CommonsJdbcEventLogger logBeginTransaction
INFO: --- transaction started.
Sep 27, 2011 3:33:07 PM org.apache.cayenne.log.CommonsJdbcEventLogger logQuery
INFO: SELECT t0.DATE_OF_BIRTH, t0.ARTIST_ID, t0.ARTIST_NAME FROM ARTIST t0
Sep 27, 2011 3:33:07 PM org.apache.cayenne.log.CommonsJdbcEventLogger logSelectCount
INFO: === returned 1 row. - took 1 ms.
Sep 27, 2011 3:33:07 PM org.apache.cayenne.log.CommonsJdbcEventLogger logCommitTransaction
INFO: +++ transaction committed.
Tests run: 4, Failures: 0, Errors: 0, Skipped: 0, Time elapsed: 0.122 sec
Running org.apache.cayenne.access.NestedDataContextParentPeerEventsTest
Sep 27, 2011 3:33:07 PM org.apache.cayenne.configuration.XMLDataChannelDescriptorLoader load
INFO: Loading XML configuration resource from <https://builds.apache.org/job/Cayenne-trunk/./cayenneTestConnection=derby,collationCi=true,jdk=JDK%201.6%20(latest),label=Ubuntu/ws/trunk/framework/cayenne-jdk1.5-unpublished/target/test-classes/cayenne-relationships.xml>
Sep 27, 2011 3:33:07 PM org.apache.cayenne.map.EntityResolver applyDBLayerDefaults
INFO: added runtime complimentary DbRelationship from DELETE_RULE_TEST3 to DELETE_RULE_TEST1
Sep 27, 2011 3:33:07 PM org.apache.cayenne.map.EntityResolver applyObjectLayerDefaults
INFO: added runtime complimentary ObjRelationship from FlattenedTest3 to FlattenedTest1
Sep 27, 2011 3:33:07 PM org.apache.cayenne.map.EntityResolver applyObjectLayerDefaults
INFO: added runtime complimentary ObjRelationship from FlattenedTest4 to FlattenedTest1
Sep 27, 2011 3:33:07 PM org.apache.cayenne.log.CommonsJdbcEventLogger logQuery
INFO: SELECT NEXT_ID FROM AUTO_PK_SUPPORT WHERE TABLE_NAME = ? FOR UPDATE [bind: 1:'MASTER']
Sep 27, 2011 3:33:07 PM org.apache.cayenne.log.CommonsJdbcEventLogger logBeginTransaction
INFO: --- transaction started.
Sep 27, 2011 3:33:07 PM org.apache.cayenne.log.CommonsJdbcEventLogger logQuery
INFO: INSERT INTO MASTER (ID, NAME) VALUES (?, ?)
Sep 27, 2011 3:33:07 PM org.apache.cayenne.log.CommonsJdbcEventLogger logQueryParameters
INFO: [batch bind: 1->ID:200, 2->NAME:'X']
Sep 27, 2011 3:33:07 PM org.apache.cayenne.log.CommonsJdbcEventLogger logUpdateCount
INFO: === updated 1 row.
Sep 27, 2011 3:33:07 PM org.apache.cayenne.log.CommonsJdbcEventLogger logCommitTransaction
INFO: +++ transaction committed.
Sep 27, 2011 3:33:07 PM org.apache.cayenne.log.CommonsJdbcEventLogger logBeginTransaction
INFO: --- transaction started.
Sep 27, 2011 3:33:07 PM org.apache.cayenne.log.CommonsJdbcEventLogger logQuery
INFO: UPDATE MASTER SET NAME = ? WHERE ID = ?
Sep 27, 2011 3:33:07 PM org.apache.cayenne.log.CommonsJdbcEventLogger logQueryParameters
INFO: [batch bind: 1->NAME:'Y', 2->ID:200]
Sep 27, 2011 3:33:07 PM org.apache.cayenne.log.CommonsJdbcEventLogger logUpdateCount
INFO: === updated 1 row.
Sep 27, 2011 3:33:07 PM org.apache.cayenne.log.CommonsJdbcEventLogger logCommitTransaction
INFO: +++ transaction committed.
Sep 27, 2011 3:33:08 PM org.apache.cayenne.configuration.XMLDataChannelDescriptorLoader load
INFO: Loading XML configuration resource from <https://builds.apache.org/job/Cayenne-trunk/./cayenneTestConnection=derby,collationCi=true,jdk=JDK%201.6%20(latest),label=Ubuntu/ws/trunk/framework/cayenne-jdk1.5-unpublished/target/test-classes/cayenne-relationships.xml>
Sep 27, 2011 3:33:08 PM org.apache.cayenne.map.EntityResolver applyDBLayerDefaults
INFO: added runtime complimentary DbRelationship from DELETE_RULE_TEST3 to DELETE_RULE_TEST1
Sep 27, 2011 3:33:08 PM org.apache.cayenne.map.EntityResolver applyObjectLayerDefaults
INFO: added runtime complimentary ObjRelationship from FlattenedTest3 to FlattenedTest1
Sep 27, 2011 3:33:08 PM org.apache.cayenne.map.EntityResolver applyObjectLayerDefaults
INFO: added runtime complimentary ObjRelationship from FlattenedTest4 to FlattenedTest1
Sep 27, 2011 3:33:08 PM org.apache.cayenne.log.CommonsJdbcEventLogger logQuery
INFO: SELECT NEXT_ID FROM AUTO_PK_SUPPORT WHERE TABLE_NAME = ? FOR UPDATE [bind: 1:'CHILD']
Sep 27, 2011 3:33:08 PM org.apache.cayenne.log.CommonsJdbcEventLogger logBeginTransaction
INFO: --- transaction started.
Sep 27, 2011 3:33:08 PM org.apache.cayenne.log.CommonsJdbcEventLogger logQuery
INFO: INSERT INTO MASTER (ID, NAME) VALUES (?, ?)
Sep 27, 2011 3:33:08 PM org.apache.cayenne.log.CommonsJdbcEventLogger logQueryParameters
INFO: [batch bind: 1->ID:201, 2->NAME:'Y']
Sep 27, 2011 3:33:08 PM org.apache.cayenne.log.CommonsJdbcEventLogger logQueryParameters
INFO: [batch bind: 1->ID:202, 2->NAME:'X']
Sep 27, 2011 3:33:08 PM org.apache.cayenne.log.CommonsJdbcEventLogger logUpdateCount
INFO: === updated 2 rows.
Sep 27, 2011 3:33:08 PM org.apache.cayenne.log.CommonsJdbcEventLogger logQuery
INFO: INSERT INTO CHILD (ID, MASTER_ID) VALUES (?, ?)
Sep 27, 2011 3:33:08 PM org.apache.cayenne.log.CommonsJdbcEventLogger logQueryParameters
INFO: [batch bind: 1->ID:200, 2->MASTER_ID:202]
Sep 27, 2011 3:33:08 PM org.apache.cayenne.log.CommonsJdbcEventLogger logUpdateCount
INFO: === updated 1 row.
Sep 27, 2011 3:33:08 PM org.apache.cayenne.log.CommonsJdbcEventLogger logCommitTransaction
INFO: +++ transaction committed.
Sep 27, 2011 3:33:08 PM org.apache.cayenne.log.CommonsJdbcEventLogger logBeginTransaction
INFO: --- transaction started.
Sep 27, 2011 3:33:08 PM org.apache.cayenne.log.CommonsJdbcEventLogger logQuery
INFO: UPDATE CHILD SET MASTER_ID = ? WHERE ID = ?
Sep 27, 2011 3:33:08 PM org.apache.cayenne.log.CommonsJdbcEventLogger logQueryParameters
INFO: [batch bind: 1->MASTER_ID:201, 2->ID:200]
Sep 27, 2011 3:33:08 PM org.apache.cayenne.log.CommonsJdbcEventLogger logUpdateCount
INFO: === updated 1 row.
Sep 27, 2011 3:33:08 PM org.apache.cayenne.log.CommonsJdbcEventLogger logCommitTransaction
INFO: +++ transaction committed.
Sep 27, 2011 3:33:08 PM org.apache.cayenne.configuration.XMLDataChannelDescriptorLoader load
INFO: Loading XML configuration resource from <https://builds.apache.org/job/Cayenne-trunk/./cayenneTestConnection=derby,collationCi=true,jdk=JDK%201.6%20(latest),label=Ubuntu/ws/trunk/framework/cayenne-jdk1.5-unpublished/target/test-classes/cayenne-relationships.xml>
Sep 27, 2011 3:33:08 PM org.apache.cayenne.map.EntityResolver applyDBLayerDefaults
INFO: added runtime complimentary DbRelationship from DELETE_RULE_TEST3 to DELETE_RULE_TEST1
Sep 27, 2011 3:33:08 PM org.apache.cayenne.map.EntityResolver applyObjectLayerDefaults
INFO: added runtime complimentary ObjRelationship from FlattenedTest3 to FlattenedTest1
Sep 27, 2011 3:33:08 PM org.apache.cayenne.map.EntityResolver applyObjectLayerDefaults
INFO: added runtime complimentary ObjRelationship from FlattenedTest4 to FlattenedTest1
Sep 27, 2011 3:33:08 PM org.apache.cayenne.log.CommonsJdbcEventLogger logBeginTransaction
INFO: --- transaction started.
Sep 27, 2011 3:33:08 PM org.apache.cayenne.log.CommonsJdbcEventLogger logQuery
INFO: INSERT INTO MASTER (ID, NAME) VALUES (?, ?)
Sep 27, 2011 3:33:08 PM org.apache.cayenne.log.CommonsJdbcEventLogger logQueryParameters
INFO: [batch bind: 1->ID:203, 2->NAME:'X']
Sep 27, 2011 3:33:08 PM org.apache.cayenne.log.CommonsJdbcEventLogger logUpdateCount
INFO: === updated 1 row.
Sep 27, 2011 3:33:08 PM org.apache.cayenne.log.CommonsJdbcEventLogger logQuery
INFO: INSERT INTO CHILD (ID, MASTER_ID) VALUES (?, ?)
Sep 27, 2011 3:33:08 PM org.apache.cayenne.log.CommonsJdbcEventLogger logQueryParameters
INFO: [batch bind: 1->ID:201, 2->MASTER_ID:203]
Sep 27, 2011 3:33:08 PM org.apache.cayenne.log.CommonsJdbcEventLogger logQueryParameters
INFO: [batch bind: 1->ID:202, 2->MASTER_ID:NULL]
Sep 27, 2011 3:33:08 PM org.apache.cayenne.log.CommonsJdbcEventLogger logUpdateCount
INFO: === updated 2 rows.
Sep 27, 2011 3:33:08 PM org.apache.cayenne.log.CommonsJdbcEventLogger logCommitTransaction
INFO: +++ transaction committed.
Sep 27, 2011 3:33:08 PM org.apache.cayenne.log.CommonsJdbcEventLogger logBeginTransaction
INFO: --- transaction started.
Sep 27, 2011 3:33:08 PM org.apache.cayenne.log.CommonsJdbcEventLogger logQuery
INFO: UPDATE CHILD SET MASTER_ID = ? WHERE ID = ?
Sep 27, 2011 3:33:08 PM org.apache.cayenne.log.CommonsJdbcEventLogger logQueryParameters
INFO: [batch bind: 1->MASTER_ID:203, 2->ID:202]
Sep 27, 2011 3:33:08 PM org.apache.cayenne.log.CommonsJdbcEventLogger logUpdateCount
INFO: === updated 1 row.
Sep 27, 2011 3:33:08 PM org.apache.cayenne.log.CommonsJdbcEventLogger logCommitTransaction
INFO: +++ transaction committed.
Sep 27, 2011 3:33:09 PM org.apache.cayenne.log.CommonsJdbcEventLogger logBeginTransaction
INFO: --- transaction started.
Sep 27, 2011 3:33:09 PM org.apache.cayenne.log.CommonsJdbcEventLogger logQuery
INFO: SELECT t0.MASTER_ID, t0.ID FROM CHILD t0 WHERE t0.MASTER_ID = ? [bind: 1->MASTER_ID:203]
Sep 27, 2011 3:33:09 PM org.apache.cayenne.log.CommonsJdbcEventLogger logSelectCount
INFO: === returned 2 rows. - took 3 ms.
Sep 27, 2011 3:33:09 PM org.apache.cayenne.log.CommonsJdbcEventLogger logCommitTransaction
INFO: +++ transaction committed.
Tests run: 3, Failures: 0, Errors: 0, Skipped: 0, Time elapsed: 1.232 sec
Running org.apache.cayenne.DataRowTest
Tests run: 2, Failures: 0, Errors: 0, Skipped: 0, Time elapsed: 0.002 sec
Running org.apache.cayenne.access.types.EnumTypeTest
Tests run: 7, Failures: 0, Errors: 0, Skipped: 0, Time elapsed: 0.002 sec
Results :
Failed tests:
testSelectNotLikeIgnoreCaseSingleWildcardMatch(org.apache.cayenne.query.SelectQueryTest)
testSelectLikeIgnoreCaseObjects1(org.apache.cayenne.query.SelectQueryTest)
Tests run: 2095, Failures: 2, Errors: 0, Skipped: 0
[INFO] ------------------------------------------------------------------------
[INFO] Reactor Summary:
[INFO]
[INFO] Cayenne ........................................... SUCCESS [0.228s]
[INFO] Common Unit Test Utilities ........................ SUCCESS [1.721s]
[INFO] Cayenne Internal Build Plugin ..................... SUCCESS [1.217s]
[INFO] Cayenne Internal Documentation Build Plugin ....... SUCCESS [1.630s]
[INFO] Cayenne Build Tools Parent ........................ SUCCESS [0.005s]
[INFO] Cayenne License and Notice Bundle ................. SUCCESS [0.662s]
[INFO] Cayenne Dependency Injection Container ............ SUCCESS [2.410s]
[INFO] Cayenne Java 1.5 Unpublished ...................... FAILURE [5:03.372s]
[INFO] Cayenne WebObjects Compatibility Library .......... SKIPPED
[INFO] Cayenne Aggregated Server Jar ..................... SKIPPED
[INFO] Cayenne Aggregated Client Jar ..................... SKIPPED
[INFO] Cayenne Project ................................... SKIPPED
[INFO] Cayenne Tools ..................................... SKIPPED
[INFO] Library: cayenne-lifecycle ........................ SKIPPED
[INFO] Cayenne Maven Plugin .............................. SKIPPED
[INFO] Cayenne Framework Aggregator Project .............. SKIPPED
[INFO] Cayenne Integration Tests Parent .................. SKIPPED
[INFO] Integration Tests - Cayenne Runtime ............... SKIPPED
[INFO] Integration Tests - Cayenne Tools ................. SKIPPED
[INFO] Cayenne Modeler ................................... SKIPPED
[INFO] Cayenne Modeler Maven Plugin ...................... SKIPPED
[INFO] Cayenne Modeler Parent ............................ SKIPPED
[INFO] Cayenne Tutorial .................................. SKIPPED
[INFO] Cayenne ROP Server Tutorial ....................... SKIPPED
[INFO] Cayenne ROP Client Tutorial ....................... SKIPPED
[INFO] Cayenne Tutorials ................................. SKIPPED
[INFO] Cayenne Documentation ............................. SKIPPED
[INFO] Cayenne Documenation Parent ....................... SKIPPED
[INFO] ------------------------------------------------------------------------
[INFO] BUILD FAILURE
[INFO] ------------------------------------------------------------------------
[INFO] Total time: 5:11.934s
[INFO] Finished at: Tue Sep 27 15:33:09 UTC 2011
[INFO] Final Memory: 46M/372M
[INFO] ------------------------------------------------------------------------
[ERROR] Failed to execute goal org.apache.maven.plugins:maven-surefire-plugin:2.5:test (default-test) on project cayenne-jdk1.5-unpublished: There are test failures.
[ERROR]
[ERROR] Please refer to <https://builds.apache.org/job/Cayenne-trunk/./cayenneTestConnection=derby,collationCi=true,jdk=JDK%201.6%20(latest),label=Ubuntu/ws/trunk/framework/cayenne-jdk1.5-unpublished/target/surefire-reports> for the individual test results.
[ERROR] -> [Help 1]
org.apache.maven.lifecycle.LifecycleExecutionException: Failed to execute goal org.apache.maven.plugins:maven-surefire-plugin:2.5:test (default-test) on project cayenne-jdk1.5-unpublished: There are test failures.
Please refer to <https://builds.apache.org/job/Cayenne-trunk/./cayenneTestConnection=derby,collationCi=true,jdk=JDK%201.6%20(latest),label=Ubuntu/ws/trunk/framework/cayenne-jdk1.5-unpublished/target/surefire-reports> for the individual test results.
at org.apache.maven.lifecycle.internal.MojoExecutor.execute(MojoExecutor.java:213)
at org.apache.maven.lifecycle.internal.MojoExecutor.execute(MojoExecutor.java:153)
at org.apache.maven.lifecycle.internal.MojoExecutor.execute(MojoExecutor.java:145)
at org.apache.maven.lifecycle.internal.LifecycleModuleBuilder.buildProject(LifecycleModuleBuilder.java:84)
at org.apache.maven.lifecycle.internal.LifecycleModuleBuilder.buildProject(LifecycleModuleBuilder.java:59)
at org.apache.maven.lifecycle.internal.LifecycleStarter.singleThreadedBuild(LifecycleStarter.java:183)
at org.apache.maven.lifecycle.internal.LifecycleStarter.execute(LifecycleStarter.java:161)
at org.apache.maven.DefaultMaven.doExecute(DefaultMaven.java:319)
at org.apache.maven.DefaultMaven.execute(DefaultMaven.java:156)
at org.apache.maven.cli.MavenCli.execute(MavenCli.java:537)
at org.apache.maven.cli.MavenCli.doMain(MavenCli.java:196)
at org.apache.maven.cli.MavenCli.main(MavenCli.java:141)
at sun.reflect.NativeMethodAccessorImpl.invoke0(Native Method)
at sun.reflect.NativeMethodAccessorImpl.invoke(NativeMethodAccessorImpl.java:39)
at sun.reflect.DelegatingMethodAccessorImpl.invoke(DelegatingMethodAccessorImpl.java:25)
at java.lang.reflect.Method.invoke(Method.java:597)
at org.codehaus.plexus.classworlds.launcher.Launcher.launchEnhanced(Launcher.java:290)
at org.codehaus.plexus.classworlds.launcher.Launcher.launch(Launcher.java:230)
at org.codehaus.plexus.classworlds.launcher.Launcher.mainWithExitCode(Launcher.java:409)
at org.codehaus.plexus.classworlds.launcher.Launcher.main(Launcher.java:352)
Caused by: org.apache.maven.plugin.MojoFailureException: There are test failures.
Please refer to <https://builds.apache.org/job/Cayenne-trunk/./cayenneTestConnection=derby,collationCi=true,jdk=JDK%201.6%20(latest),label=Ubuntu/ws/trunk/framework/cayenne-jdk1.5-unpublished/target/surefire-reports> for the individual test results.
at org.apache.maven.plugin.surefire.SurefirePlugin.execute(SurefirePlugin.java:629)
at org.apache.maven.plugin.DefaultBuildPluginManager.executeMojo(DefaultBuildPluginManager.java:101)
at org.apache.maven.lifecycle.internal.MojoExecutor.execute(MojoExecutor.java:209)
... 19 more
[ERROR]
[ERROR] Re-run Maven using the -X switch to enable full debug logging.
[ERROR]
[ERROR] For more information about the errors and possible solutions, please read the following articles:
[ERROR] [Help 1] http://cwiki.apache.org/confluence/display/MAVEN/MojoFailureException
[ERROR]
[ERROR] After correcting the problems, you can resume the build with the command
[ERROR] mvn <goals> -rf :cayenne-jdk1.5-unpublished
Build step 'Invoke top-level Maven targets' marked build as failure
Archiving artifacts
Build failed in Jenkins: Cayenne-trunk » derby,true,JDK 1.6 (latest),Ubuntu #589
Posted by Apache Jenkins Server <je...@builds.apache.org>.
See <https://builds.apache.org/job/Cayenne-trunk/./cayenneTestConnection=derby,collationCi=true,jdk=JDK%201.6%20(latest),label=Ubuntu/589/changes>
Changes:
[amaniatis] Syntax highlighting for code in the docbook.
[dkazimirchyk] cleaning up previous commit
------------------------------------------
[...truncated 85343 lines...]
INFO: delete from ARTIST
Sep 27, 2011 7:29:58 AM org.apache.cayenne.test.jdbc.UtilityLogger log
INFO: delete from PAINTING
Sep 27, 2011 7:29:58 AM org.apache.cayenne.test.jdbc.UtilityLogger log
INFO: INSERT INTO ARTIST (ARTIST_ID, ARTIST_NAME) VALUES (?, ?)
Sep 27, 2011 7:29:58 AM org.apache.cayenne.test.jdbc.UtilityLogger log
INFO: INSERT INTO PAINTING (PAINTING_ID, PAINTING_TITLE, ARTIST_ID, ESTIMATED_PRICE) VALUES (?, ?, ?, ?)
Sep 27, 2011 7:29:58 AM org.apache.cayenne.log.CommonsJdbcEventLogger logBeginTransaction
INFO: --- transaction started.
Sep 27, 2011 7:29:58 AM org.apache.cayenne.log.CommonsJdbcEventLogger logQuery
INFO: SELECT t0.DATE_OF_BIRTH, t0.ARTIST_ID, t0.ARTIST_NAME FROM ARTIST t0
Sep 27, 2011 7:29:58 AM org.apache.cayenne.log.CommonsJdbcEventLogger logSelectCount
INFO: === returned 1 row. - took 1 ms.
Sep 27, 2011 7:29:58 AM org.apache.cayenne.log.CommonsJdbcEventLogger logCommitTransaction
INFO: +++ transaction committed.
Sep 27, 2011 7:29:58 AM org.apache.cayenne.test.jdbc.UtilityLogger log
INFO: update ARTIST set ARTIST_NAME = ? where ARTIST_ID = ?
Sep 27, 2011 7:29:58 AM org.apache.cayenne.log.CommonsJdbcEventLogger logBeginTransaction
INFO: --- transaction started.
Sep 27, 2011 7:29:58 AM org.apache.cayenne.log.CommonsJdbcEventLogger logQuery
INFO: SELECT t0.DATE_OF_BIRTH, t0.ARTIST_ID, t0.ARTIST_NAME FROM ARTIST t0
Sep 27, 2011 7:29:58 AM org.apache.cayenne.log.CommonsJdbcEventLogger logSelectCount
INFO: === returned 1 row. - took 1 ms.
Sep 27, 2011 7:29:58 AM org.apache.cayenne.log.CommonsJdbcEventLogger logCommitTransaction
INFO: +++ transaction committed.
Sep 27, 2011 7:29:58 AM org.apache.cayenne.configuration.XMLDataChannelDescriptorLoader load
INFO: Loading XML configuration resource from <https://builds.apache.org/job/Cayenne-trunk/./cayenneTestConnection=derby,collationCi=true,jdk=JDK%201.6%20(latest),label=Ubuntu/ws/trunk/framework/cayenne-jdk1.5-unpublished/target/test-classes/cayenne-relationships.xml>
Sep 27, 2011 7:29:58 AM org.apache.cayenne.map.EntityResolver applyDBLayerDefaults
INFO: added runtime complimentary DbRelationship from DELETE_RULE_TEST3 to DELETE_RULE_TEST1
Sep 27, 2011 7:29:58 AM org.apache.cayenne.map.EntityResolver applyObjectLayerDefaults
INFO: added runtime complimentary ObjRelationship from FlattenedTest3 to FlattenedTest1
Sep 27, 2011 7:29:58 AM org.apache.cayenne.map.EntityResolver applyObjectLayerDefaults
INFO: added runtime complimentary ObjRelationship from FlattenedTest4 to FlattenedTest1
Sep 27, 2011 7:29:58 AM org.apache.cayenne.log.CommonsJdbcEventLogger logBeginTransaction
INFO: --- transaction started.
Sep 27, 2011 7:29:58 AM org.apache.cayenne.log.CommonsJdbcEventLogger logQuery
INFO: SELECT NEXT_ID FROM AUTO_PK_SUPPORT WHERE TABLE_NAME = 'MASTER'
Sep 27, 2011 7:29:58 AM org.apache.cayenne.log.CommonsJdbcEventLogger logSelectCount
INFO: === returned 1 row. - took 0 ms.
Sep 27, 2011 7:29:58 AM org.apache.cayenne.log.CommonsJdbcEventLogger logQuery
INFO: UPDATE AUTO_PK_SUPPORT SET NEXT_ID = NEXT_ID + 20 WHERE TABLE_NAME = 'MASTER'
Sep 27, 2011 7:29:58 AM org.apache.cayenne.log.CommonsJdbcEventLogger logUpdateCount
INFO: === updated 1 row.
Sep 27, 2011 7:29:58 AM org.apache.cayenne.log.CommonsJdbcEventLogger logQuery
INFO: INSERT INTO MASTER (ID, NAME) VALUES (?, ?)
Sep 27, 2011 7:29:58 AM org.apache.cayenne.log.CommonsJdbcEventLogger logQueryParameters
INFO: [bind: 1->ID:200, 2->NAME:'X']
Sep 27, 2011 7:29:58 AM org.apache.cayenne.log.CommonsJdbcEventLogger logUpdateCount
INFO: === updated 1 row.
Sep 27, 2011 7:29:58 AM org.apache.cayenne.log.CommonsJdbcEventLogger logCommitTransaction
INFO: +++ transaction committed.
Sep 27, 2011 7:29:58 AM org.apache.cayenne.log.CommonsJdbcEventLogger logBeginTransaction
INFO: --- transaction started.
Sep 27, 2011 7:29:58 AM org.apache.cayenne.log.CommonsJdbcEventLogger logQuery
INFO: UPDATE MASTER SET NAME = ? WHERE ID = ?
Sep 27, 2011 7:29:58 AM org.apache.cayenne.log.CommonsJdbcEventLogger logQueryParameters
INFO: [bind: 1->NAME:'Y', 2->ID:200]
Sep 27, 2011 7:29:58 AM org.apache.cayenne.log.CommonsJdbcEventLogger logUpdateCount
INFO: === updated 1 row.
Sep 27, 2011 7:29:58 AM org.apache.cayenne.log.CommonsJdbcEventLogger logCommitTransaction
INFO: +++ transaction committed.
Sep 27, 2011 7:29:58 AM org.apache.cayenne.configuration.XMLDataChannelDescriptorLoader load
INFO: Loading XML configuration resource from <https://builds.apache.org/job/Cayenne-trunk/./cayenneTestConnection=derby,collationCi=true,jdk=JDK%201.6%20(latest),label=Ubuntu/ws/trunk/framework/cayenne-jdk1.5-unpublished/target/test-classes/cayenne-relationships.xml>
Sep 27, 2011 7:29:58 AM org.apache.cayenne.map.EntityResolver applyDBLayerDefaults
INFO: added runtime complimentary DbRelationship from DELETE_RULE_TEST3 to DELETE_RULE_TEST1
Sep 27, 2011 7:29:58 AM org.apache.cayenne.map.EntityResolver applyObjectLayerDefaults
INFO: added runtime complimentary ObjRelationship from FlattenedTest3 to FlattenedTest1
Sep 27, 2011 7:29:58 AM org.apache.cayenne.map.EntityResolver applyObjectLayerDefaults
INFO: added runtime complimentary ObjRelationship from FlattenedTest4 to FlattenedTest1
Sep 27, 2011 7:29:58 AM org.apache.cayenne.log.CommonsJdbcEventLogger logBeginTransaction
INFO: --- transaction started.
Sep 27, 2011 7:29:58 AM org.apache.cayenne.log.CommonsJdbcEventLogger logQuery
INFO: SELECT NEXT_ID FROM AUTO_PK_SUPPORT WHERE TABLE_NAME = 'CHILD'
Sep 27, 2011 7:29:58 AM org.apache.cayenne.log.CommonsJdbcEventLogger logSelectCount
INFO: === returned 1 row. - took 0 ms.
Sep 27, 2011 7:29:58 AM org.apache.cayenne.log.CommonsJdbcEventLogger logQuery
INFO: UPDATE AUTO_PK_SUPPORT SET NEXT_ID = NEXT_ID + 20 WHERE TABLE_NAME = 'CHILD'
Sep 27, 2011 7:29:58 AM org.apache.cayenne.log.CommonsJdbcEventLogger logUpdateCount
INFO: === updated 1 row.
Sep 27, 2011 7:29:58 AM org.apache.cayenne.log.CommonsJdbcEventLogger logQuery
INFO: INSERT INTO MASTER (ID, NAME) VALUES (?, ?)
Sep 27, 2011 7:29:58 AM org.apache.cayenne.log.CommonsJdbcEventLogger logQueryParameters
INFO: [bind: 1->ID:201, 2->NAME:'Y']
Sep 27, 2011 7:29:58 AM org.apache.cayenne.log.CommonsJdbcEventLogger logUpdateCount
INFO: === updated 1 row.
Sep 27, 2011 7:29:58 AM org.apache.cayenne.log.CommonsJdbcEventLogger logQueryParameters
INFO: [bind: 1->ID:202, 2->NAME:'X']
Sep 27, 2011 7:29:58 AM org.apache.cayenne.log.CommonsJdbcEventLogger logUpdateCount
INFO: === updated 1 row.
Sep 27, 2011 7:29:58 AM org.apache.cayenne.log.CommonsJdbcEventLogger logQuery
INFO: INSERT INTO CHILD (ID, MASTER_ID) VALUES (?, ?)
Sep 27, 2011 7:29:58 AM org.apache.cayenne.log.CommonsJdbcEventLogger logQueryParameters
INFO: [bind: 1->ID:200, 2->MASTER_ID:202]
Sep 27, 2011 7:29:58 AM org.apache.cayenne.log.CommonsJdbcEventLogger logUpdateCount
INFO: === updated 1 row.
Sep 27, 2011 7:29:58 AM org.apache.cayenne.log.CommonsJdbcEventLogger logCommitTransaction
INFO: +++ transaction committed.
Sep 27, 2011 7:29:58 AM org.apache.cayenne.log.CommonsJdbcEventLogger logBeginTransaction
INFO: --- transaction started.
Sep 27, 2011 7:29:58 AM org.apache.cayenne.log.CommonsJdbcEventLogger logQuery
INFO: UPDATE CHILD SET MASTER_ID = ? WHERE ID = ?
Sep 27, 2011 7:29:58 AM org.apache.cayenne.log.CommonsJdbcEventLogger logQueryParameters
INFO: [bind: 1->MASTER_ID:201, 2->ID:200]
Sep 27, 2011 7:29:58 AM org.apache.cayenne.log.CommonsJdbcEventLogger logUpdateCount
INFO: === updated 1 row.
Sep 27, 2011 7:29:58 AM org.apache.cayenne.log.CommonsJdbcEventLogger logCommitTransaction
INFO: +++ transaction committed.
Sep 27, 2011 7:29:58 AM org.apache.cayenne.configuration.XMLDataChannelDescriptorLoader load
INFO: Loading XML configuration resource from <https://builds.apache.org/job/Cayenne-trunk/./cayenneTestConnection=derby,collationCi=true,jdk=JDK%201.6%20(latest),label=Ubuntu/ws/trunk/framework/cayenne-jdk1.5-unpublished/target/test-classes/cayenne-relationships.xml>
Sep 27, 2011 7:29:58 AM org.apache.cayenne.map.EntityResolver applyDBLayerDefaults
INFO: added runtime complimentary DbRelationship from DELETE_RULE_TEST3 to DELETE_RULE_TEST1
Sep 27, 2011 7:29:58 AM org.apache.cayenne.map.EntityResolver applyObjectLayerDefaults
INFO: added runtime complimentary ObjRelationship from FlattenedTest3 to FlattenedTest1
Sep 27, 2011 7:29:58 AM org.apache.cayenne.map.EntityResolver applyObjectLayerDefaults
INFO: added runtime complimentary ObjRelationship from FlattenedTest4 to FlattenedTest1
Sep 27, 2011 7:29:58 AM org.apache.cayenne.log.CommonsJdbcEventLogger logBeginTransaction
INFO: --- transaction started.
Sep 27, 2011 7:29:58 AM org.apache.cayenne.log.CommonsJdbcEventLogger logQuery
INFO: INSERT INTO MASTER (ID, NAME) VALUES (?, ?)
Sep 27, 2011 7:29:58 AM org.apache.cayenne.log.CommonsJdbcEventLogger logQueryParameters
INFO: [bind: 1->ID:203, 2->NAME:'X']
Sep 27, 2011 7:29:58 AM org.apache.cayenne.log.CommonsJdbcEventLogger logUpdateCount
INFO: === updated 1 row.
Sep 27, 2011 7:29:58 AM org.apache.cayenne.log.CommonsJdbcEventLogger logQuery
INFO: INSERT INTO CHILD (ID, MASTER_ID) VALUES (?, ?)
Sep 27, 2011 7:29:58 AM org.apache.cayenne.log.CommonsJdbcEventLogger logQueryParameters
INFO: [bind: 1->ID:201, 2->MASTER_ID:203]
Sep 27, 2011 7:29:58 AM org.apache.cayenne.log.CommonsJdbcEventLogger logUpdateCount
INFO: === updated 1 row.
Sep 27, 2011 7:29:58 AM org.apache.cayenne.log.CommonsJdbcEventLogger logQueryParameters
INFO: [bind: 1->ID:202, 2->MASTER_ID:NULL]
Sep 27, 2011 7:29:58 AM org.apache.cayenne.log.CommonsJdbcEventLogger logUpdateCount
INFO: === updated 1 row.
Sep 27, 2011 7:29:58 AM org.apache.cayenne.log.CommonsJdbcEventLogger logCommitTransaction
INFO: +++ transaction committed.
Sep 27, 2011 7:29:58 AM org.apache.cayenne.log.CommonsJdbcEventLogger logBeginTransaction
INFO: --- transaction started.
Sep 27, 2011 7:29:58 AM org.apache.cayenne.log.CommonsJdbcEventLogger logQuery
INFO: UPDATE CHILD SET MASTER_ID = ? WHERE ID = ?
Sep 27, 2011 7:29:58 AM org.apache.cayenne.log.CommonsJdbcEventLogger logQueryParameters
INFO: [bind: 1->MASTER_ID:203, 2->ID:202]
Sep 27, 2011 7:29:58 AM org.apache.cayenne.log.CommonsJdbcEventLogger logUpdateCount
INFO: === updated 1 row.
Sep 27, 2011 7:29:58 AM org.apache.cayenne.log.CommonsJdbcEventLogger logCommitTransaction
INFO: +++ transaction committed.
Sep 27, 2011 7:29:59 AM org.apache.cayenne.log.CommonsJdbcEventLogger logBeginTransaction
INFO: --- transaction started.
Sep 27, 2011 7:29:59 AM org.apache.cayenne.log.CommonsJdbcEventLogger logQuery
INFO: SELECT t0.MASTER_ID, t0.ID FROM CHILD t0 WHERE t0.MASTER_ID = ? [bind: 1->MASTER_ID:203]
Sep 27, 2011 7:29:59 AM org.apache.cayenne.log.CommonsJdbcEventLogger logSelectCount
INFO: === returned 2 rows. - took 1 ms.
Sep 27, 2011 7:29:59 AM org.apache.cayenne.log.CommonsJdbcEventLogger logCommitTransaction
INFO: +++ transaction committed.
Tests run: 3, Failures: 0, Errors: 0, Skipped: 0, Time elapsed: 0.955 sec
Running org.apache.cayenne.DataRowTest
Tests run: 2, Failures: 0, Errors: 0, Skipped: 0, Time elapsed: 0.003 sec
Running org.apache.cayenne.access.types.EnumTypeTest
Tests run: 7, Failures: 0, Errors: 0, Skipped: 0, Time elapsed: 0.002 sec
Results :
Failed tests:
testSelectNotLikeIgnoreCaseSingleWildcardMatch(org.apache.cayenne.query.SelectQueryTest)
testSelectLikeIgnoreCaseObjects1(org.apache.cayenne.query.SelectQueryTest)
Tests run: 2095, Failures: 2, Errors: 0, Skipped: 0
[INFO] ------------------------------------------------------------------------
[INFO] Reactor Summary:
[INFO]
[INFO] Cayenne ........................................... SUCCESS [0.263s]
[INFO] Common Unit Test Utilities ........................ SUCCESS [1.385s]
[INFO] Cayenne Internal Build Plugin ..................... SUCCESS [1.241s]
[INFO] Cayenne Internal Documentation Build Plugin ....... SUCCESS [1.664s]
[INFO] Cayenne Build Tools Parent ........................ SUCCESS [0.006s]
[INFO] Cayenne License and Notice Bundle ................. SUCCESS [0.664s]
[INFO] Cayenne Dependency Injection Container ............ SUCCESS [2.560s]
[INFO] Cayenne Java 1.5 Unpublished ...................... FAILURE [59.698s]
[INFO] Cayenne WebObjects Compatibility Library .......... SKIPPED
[INFO] Cayenne Aggregated Server Jar ..................... SKIPPED
[INFO] Cayenne Aggregated Client Jar ..................... SKIPPED
[INFO] Cayenne Project ................................... SKIPPED
[INFO] Cayenne Tools ..................................... SKIPPED
[INFO] Library: cayenne-lifecycle ........................ SKIPPED
[INFO] Cayenne Maven Plugin .............................. SKIPPED
[INFO] Cayenne Framework Aggregator Project .............. SKIPPED
[INFO] Cayenne Integration Tests Parent .................. SKIPPED
[INFO] Integration Tests - Cayenne Runtime ............... SKIPPED
[INFO] Integration Tests - Cayenne Tools ................. SKIPPED
[INFO] Cayenne Modeler ................................... SKIPPED
[INFO] Cayenne Modeler Maven Plugin ...................... SKIPPED
[INFO] Cayenne Modeler Parent ............................ SKIPPED
[INFO] Cayenne Tutorial .................................. SKIPPED
[INFO] Cayenne ROP Server Tutorial ....................... SKIPPED
[INFO] Cayenne ROP Client Tutorial ....................... SKIPPED
[INFO] Cayenne Tutorials ................................. SKIPPED
[INFO] Cayenne Documentation ............................. SKIPPED
[INFO] Cayenne Documenation Parent ....................... SKIPPED
[INFO] ------------------------------------------------------------------------
[INFO] BUILD FAILURE
[INFO] ------------------------------------------------------------------------
[INFO] Total time: 1:08.936s
[INFO] Finished at: Tue Sep 27 07:29:59 UTC 2011
[INFO] Final Memory: 50M/441M
[INFO] ------------------------------------------------------------------------
[ERROR] Failed to execute goal org.apache.maven.plugins:maven-surefire-plugin:2.5:test (default-test) on project cayenne-jdk1.5-unpublished: There are test failures.
[ERROR]
[ERROR] Please refer to <https://builds.apache.org/job/Cayenne-trunk/./cayenneTestConnection=derby,collationCi=true,jdk=JDK%201.6%20(latest),label=Ubuntu/ws/trunk/framework/cayenne-jdk1.5-unpublished/target/surefire-reports> for the individual test results.
[ERROR] -> [Help 1]
org.apache.maven.lifecycle.LifecycleExecutionException: Failed to execute goal org.apache.maven.plugins:maven-surefire-plugin:2.5:test (default-test) on project cayenne-jdk1.5-unpublished: There are test failures.
Please refer to <https://builds.apache.org/job/Cayenne-trunk/./cayenneTestConnection=derby,collationCi=true,jdk=JDK%201.6%20(latest),label=Ubuntu/ws/trunk/framework/cayenne-jdk1.5-unpublished/target/surefire-reports> for the individual test results.
at org.apache.maven.lifecycle.internal.MojoExecutor.execute(MojoExecutor.java:213)
at org.apache.maven.lifecycle.internal.MojoExecutor.execute(MojoExecutor.java:153)
at org.apache.maven.lifecycle.internal.MojoExecutor.execute(MojoExecutor.java:145)
at org.apache.maven.lifecycle.internal.LifecycleModuleBuilder.buildProject(LifecycleModuleBuilder.java:84)
at org.apache.maven.lifecycle.internal.LifecycleModuleBuilder.buildProject(LifecycleModuleBuilder.java:59)
at org.apache.maven.lifecycle.internal.LifecycleStarter.singleThreadedBuild(LifecycleStarter.java:183)
at org.apache.maven.lifecycle.internal.LifecycleStarter.execute(LifecycleStarter.java:161)
at org.apache.maven.DefaultMaven.doExecute(DefaultMaven.java:319)
at org.apache.maven.DefaultMaven.execute(DefaultMaven.java:156)
at org.apache.maven.cli.MavenCli.execute(MavenCli.java:537)
at org.apache.maven.cli.MavenCli.doMain(MavenCli.java:196)
at org.apache.maven.cli.MavenCli.main(MavenCli.java:141)
at sun.reflect.NativeMethodAccessorImpl.invoke0(Native Method)
at sun.reflect.NativeMethodAccessorImpl.invoke(NativeMethodAccessorImpl.java:39)
at sun.reflect.DelegatingMethodAccessorImpl.invoke(DelegatingMethodAccessorImpl.java:25)
at java.lang.reflect.Method.invoke(Method.java:597)
at org.codehaus.plexus.classworlds.launcher.Launcher.launchEnhanced(Launcher.java:290)
at org.codehaus.plexus.classworlds.launcher.Launcher.launch(Launcher.java:230)
at org.codehaus.plexus.classworlds.launcher.Launcher.mainWithExitCode(Launcher.java:409)
at org.codehaus.plexus.classworlds.launcher.Launcher.main(Launcher.java:352)
Caused by: org.apache.maven.plugin.MojoFailureException: There are test failures.
Please refer to <https://builds.apache.org/job/Cayenne-trunk/./cayenneTestConnection=derby,collationCi=true,jdk=JDK%201.6%20(latest),label=Ubuntu/ws/trunk/framework/cayenne-jdk1.5-unpublished/target/surefire-reports> for the individual test results.
at org.apache.maven.plugin.surefire.SurefirePlugin.execute(SurefirePlugin.java:629)
at org.apache.maven.plugin.DefaultBuildPluginManager.executeMojo(DefaultBuildPluginManager.java:101)
at org.apache.maven.lifecycle.internal.MojoExecutor.execute(MojoExecutor.java:209)
... 19 more
[ERROR]
[ERROR] Re-run Maven using the -X switch to enable full debug logging.
[ERROR]
[ERROR] For more information about the errors and possible solutions, please read the following articles:
[ERROR] [Help 1] http://cwiki.apache.org/confluence/display/MAVEN/MojoFailureException
[ERROR]
[ERROR] After correcting the problems, you can resume the build with the command
[ERROR] mvn <goals> -rf :cayenne-jdk1.5-unpublished
Build step 'Invoke top-level Maven targets' marked build as failure
Archiving artifacts
Build failed in Jenkins: Cayenne-trunk » derby,true,JDK 1.6 (latest),Ubuntu #588
Posted by Apache Jenkins Server <je...@builds.apache.org>.
See <https://builds.apache.org/job/Cayenne-trunk/./cayenneTestConnection=derby,collationCi=true,jdk=JDK%201.6%20(latest),label=Ubuntu/588/changes>
Changes:
[dkazimirchyk] converted 'Getting Started Tutorial' to docbook
------------------------------------------
[...truncated 81021 lines...]
INFO: delete from ARTIST
Sep 26, 2011 4:48:13 PM org.apache.cayenne.test.jdbc.UtilityLogger log
INFO: delete from PAINTING
Sep 26, 2011 4:48:13 PM org.apache.cayenne.test.jdbc.UtilityLogger log
INFO: INSERT INTO ARTIST (ARTIST_ID, ARTIST_NAME) VALUES (?, ?)
Sep 26, 2011 4:48:13 PM org.apache.cayenne.test.jdbc.UtilityLogger log
INFO: INSERT INTO PAINTING (PAINTING_ID, PAINTING_TITLE, ARTIST_ID, ESTIMATED_PRICE) VALUES (?, ?, ?, ?)
Sep 26, 2011 4:48:13 PM org.apache.cayenne.log.CommonsJdbcEventLogger logBeginTransaction
INFO: --- transaction started.
Sep 26, 2011 4:48:13 PM org.apache.cayenne.log.CommonsJdbcEventLogger logQuery
INFO: SELECT t0.DATE_OF_BIRTH, t0.ARTIST_ID, t0.ARTIST_NAME FROM ARTIST t0
Sep 26, 2011 4:48:13 PM org.apache.cayenne.log.CommonsJdbcEventLogger logSelectCount
INFO: === returned 1 row. - took 0 ms.
Sep 26, 2011 4:48:13 PM org.apache.cayenne.log.CommonsJdbcEventLogger logCommitTransaction
INFO: +++ transaction committed.
Sep 26, 2011 4:48:13 PM org.apache.cayenne.test.jdbc.UtilityLogger log
INFO: update ARTIST set ARTIST_NAME = ? where ARTIST_ID = ?
Sep 26, 2011 4:48:13 PM org.apache.cayenne.log.CommonsJdbcEventLogger logBeginTransaction
INFO: --- transaction started.
Sep 26, 2011 4:48:13 PM org.apache.cayenne.log.CommonsJdbcEventLogger logQuery
INFO: SELECT t0.DATE_OF_BIRTH, t0.ARTIST_ID, t0.ARTIST_NAME FROM ARTIST t0
Sep 26, 2011 4:48:13 PM org.apache.cayenne.log.CommonsJdbcEventLogger logSelectCount
INFO: === returned 1 row. - took 0 ms.
Sep 26, 2011 4:48:13 PM org.apache.cayenne.log.CommonsJdbcEventLogger logCommitTransaction
INFO: +++ transaction committed.
Sep 26, 2011 4:48:13 PM org.apache.cayenne.configuration.XMLDataChannelDescriptorLoader load
INFO: Loading XML configuration resource from <https://builds.apache.org/job/Cayenne-trunk/./cayenneTestConnection=derby,collationCi=true,jdk=JDK%201.6%20(latest),label=Ubuntu/ws/trunk/framework/cayenne-jdk1.5-unpublished/target/test-classes/cayenne-relationships.xml>
Sep 26, 2011 4:48:13 PM org.apache.cayenne.map.EntityResolver applyDBLayerDefaults
INFO: added runtime complimentary DbRelationship from DELETE_RULE_TEST3 to DELETE_RULE_TEST1
Sep 26, 2011 4:48:13 PM org.apache.cayenne.map.EntityResolver applyObjectLayerDefaults
INFO: added runtime complimentary ObjRelationship from FlattenedTest3 to FlattenedTest1
Sep 26, 2011 4:48:13 PM org.apache.cayenne.map.EntityResolver applyObjectLayerDefaults
INFO: added runtime complimentary ObjRelationship from FlattenedTest4 to FlattenedTest1
Sep 26, 2011 4:48:13 PM org.apache.cayenne.log.CommonsJdbcEventLogger logBeginTransaction
INFO: --- transaction started.
Sep 26, 2011 4:48:13 PM org.apache.cayenne.log.CommonsJdbcEventLogger logQuery
INFO: SELECT NEXT_ID FROM AUTO_PK_SUPPORT WHERE TABLE_NAME = 'MASTER'
Sep 26, 2011 4:48:13 PM org.apache.cayenne.log.CommonsJdbcEventLogger logSelectCount
INFO: === returned 1 row. - took 1 ms.
Sep 26, 2011 4:48:13 PM org.apache.cayenne.log.CommonsJdbcEventLogger logQuery
INFO: UPDATE AUTO_PK_SUPPORT SET NEXT_ID = NEXT_ID + 20 WHERE TABLE_NAME = 'MASTER'
Sep 26, 2011 4:48:13 PM org.apache.cayenne.log.CommonsJdbcEventLogger logUpdateCount
INFO: === updated 1 row.
Sep 26, 2011 4:48:13 PM org.apache.cayenne.log.CommonsJdbcEventLogger logQuery
INFO: INSERT INTO MASTER (ID, NAME) VALUES (?, ?)
Sep 26, 2011 4:48:13 PM org.apache.cayenne.log.CommonsJdbcEventLogger logQueryParameters
INFO: [bind: 1->ID:200, 2->NAME:'X']
Sep 26, 2011 4:48:13 PM org.apache.cayenne.log.CommonsJdbcEventLogger logUpdateCount
INFO: === updated 1 row.
Sep 26, 2011 4:48:13 PM org.apache.cayenne.log.CommonsJdbcEventLogger logCommitTransaction
INFO: +++ transaction committed.
Sep 26, 2011 4:48:13 PM org.apache.cayenne.log.CommonsJdbcEventLogger logBeginTransaction
INFO: --- transaction started.
Sep 26, 2011 4:48:13 PM org.apache.cayenne.log.CommonsJdbcEventLogger logQuery
INFO: UPDATE MASTER SET NAME = ? WHERE ID = ?
Sep 26, 2011 4:48:13 PM org.apache.cayenne.log.CommonsJdbcEventLogger logQueryParameters
INFO: [bind: 1->NAME:'Y', 2->ID:200]
Sep 26, 2011 4:48:13 PM org.apache.cayenne.log.CommonsJdbcEventLogger logUpdateCount
INFO: === updated 1 row.
Sep 26, 2011 4:48:13 PM org.apache.cayenne.log.CommonsJdbcEventLogger logCommitTransaction
INFO: +++ transaction committed.
Sep 26, 2011 4:48:14 PM org.apache.cayenne.configuration.XMLDataChannelDescriptorLoader load
INFO: Loading XML configuration resource from <https://builds.apache.org/job/Cayenne-trunk/./cayenneTestConnection=derby,collationCi=true,jdk=JDK%201.6%20(latest),label=Ubuntu/ws/trunk/framework/cayenne-jdk1.5-unpublished/target/test-classes/cayenne-relationships.xml>
Sep 26, 2011 4:48:14 PM org.apache.cayenne.map.EntityResolver applyDBLayerDefaults
INFO: added runtime complimentary DbRelationship from DELETE_RULE_TEST3 to DELETE_RULE_TEST1
Sep 26, 2011 4:48:14 PM org.apache.cayenne.map.EntityResolver applyObjectLayerDefaults
INFO: added runtime complimentary ObjRelationship from FlattenedTest3 to FlattenedTest1
Sep 26, 2011 4:48:14 PM org.apache.cayenne.map.EntityResolver applyObjectLayerDefaults
INFO: added runtime complimentary ObjRelationship from FlattenedTest4 to FlattenedTest1
Sep 26, 2011 4:48:14 PM org.apache.cayenne.log.CommonsJdbcEventLogger logBeginTransaction
INFO: --- transaction started.
Sep 26, 2011 4:48:14 PM org.apache.cayenne.log.CommonsJdbcEventLogger logQuery
INFO: SELECT NEXT_ID FROM AUTO_PK_SUPPORT WHERE TABLE_NAME = 'CHILD'
Sep 26, 2011 4:48:14 PM org.apache.cayenne.log.CommonsJdbcEventLogger logSelectCount
INFO: === returned 1 row. - took 0 ms.
Sep 26, 2011 4:48:14 PM org.apache.cayenne.log.CommonsJdbcEventLogger logQuery
INFO: UPDATE AUTO_PK_SUPPORT SET NEXT_ID = NEXT_ID + 20 WHERE TABLE_NAME = 'CHILD'
Sep 26, 2011 4:48:14 PM org.apache.cayenne.log.CommonsJdbcEventLogger logUpdateCount
INFO: === updated 1 row.
Sep 26, 2011 4:48:14 PM org.apache.cayenne.log.CommonsJdbcEventLogger logQuery
INFO: INSERT INTO MASTER (ID, NAME) VALUES (?, ?)
Sep 26, 2011 4:48:14 PM org.apache.cayenne.log.CommonsJdbcEventLogger logQueryParameters
INFO: [bind: 1->ID:201, 2->NAME:'X']
Sep 26, 2011 4:48:14 PM org.apache.cayenne.log.CommonsJdbcEventLogger logUpdateCount
INFO: === updated 1 row.
Sep 26, 2011 4:48:14 PM org.apache.cayenne.log.CommonsJdbcEventLogger logQueryParameters
INFO: [bind: 1->ID:202, 2->NAME:'Y']
Sep 26, 2011 4:48:14 PM org.apache.cayenne.log.CommonsJdbcEventLogger logUpdateCount
INFO: === updated 1 row.
Sep 26, 2011 4:48:14 PM org.apache.cayenne.log.CommonsJdbcEventLogger logQuery
INFO: INSERT INTO CHILD (ID, MASTER_ID) VALUES (?, ?)
Sep 26, 2011 4:48:14 PM org.apache.cayenne.log.CommonsJdbcEventLogger logQueryParameters
INFO: [bind: 1->ID:200, 2->MASTER_ID:201]
Sep 26, 2011 4:48:14 PM org.apache.cayenne.log.CommonsJdbcEventLogger logUpdateCount
INFO: === updated 1 row.
Sep 26, 2011 4:48:14 PM org.apache.cayenne.log.CommonsJdbcEventLogger logCommitTransaction
INFO: +++ transaction committed.
Sep 26, 2011 4:48:14 PM org.apache.cayenne.log.CommonsJdbcEventLogger logBeginTransaction
INFO: --- transaction started.
Sep 26, 2011 4:48:14 PM org.apache.cayenne.log.CommonsJdbcEventLogger logQuery
INFO: UPDATE CHILD SET MASTER_ID = ? WHERE ID = ?
Sep 26, 2011 4:48:14 PM org.apache.cayenne.log.CommonsJdbcEventLogger logQueryParameters
INFO: [bind: 1->MASTER_ID:202, 2->ID:200]
Sep 26, 2011 4:48:14 PM org.apache.cayenne.log.CommonsJdbcEventLogger logUpdateCount
INFO: === updated 1 row.
Sep 26, 2011 4:48:14 PM org.apache.cayenne.log.CommonsJdbcEventLogger logCommitTransaction
INFO: +++ transaction committed.
Sep 26, 2011 4:48:14 PM org.apache.cayenne.configuration.XMLDataChannelDescriptorLoader load
INFO: Loading XML configuration resource from <https://builds.apache.org/job/Cayenne-trunk/./cayenneTestConnection=derby,collationCi=true,jdk=JDK%201.6%20(latest),label=Ubuntu/ws/trunk/framework/cayenne-jdk1.5-unpublished/target/test-classes/cayenne-relationships.xml>
Sep 26, 2011 4:48:14 PM org.apache.cayenne.map.EntityResolver applyDBLayerDefaults
INFO: added runtime complimentary DbRelationship from DELETE_RULE_TEST3 to DELETE_RULE_TEST1
Sep 26, 2011 4:48:14 PM org.apache.cayenne.map.EntityResolver applyObjectLayerDefaults
INFO: added runtime complimentary ObjRelationship from FlattenedTest3 to FlattenedTest1
Sep 26, 2011 4:48:14 PM org.apache.cayenne.map.EntityResolver applyObjectLayerDefaults
INFO: added runtime complimentary ObjRelationship from FlattenedTest4 to FlattenedTest1
Sep 26, 2011 4:48:14 PM org.apache.cayenne.log.CommonsJdbcEventLogger logBeginTransaction
INFO: --- transaction started.
Sep 26, 2011 4:48:14 PM org.apache.cayenne.log.CommonsJdbcEventLogger logQuery
INFO: INSERT INTO MASTER (ID, NAME) VALUES (?, ?)
Sep 26, 2011 4:48:14 PM org.apache.cayenne.log.CommonsJdbcEventLogger logQueryParameters
INFO: [bind: 1->ID:203, 2->NAME:'X']
Sep 26, 2011 4:48:14 PM org.apache.cayenne.log.CommonsJdbcEventLogger logUpdateCount
INFO: === updated 1 row.
Sep 26, 2011 4:48:14 PM org.apache.cayenne.log.CommonsJdbcEventLogger logQuery
INFO: INSERT INTO CHILD (ID, MASTER_ID) VALUES (?, ?)
Sep 26, 2011 4:48:14 PM org.apache.cayenne.log.CommonsJdbcEventLogger logQueryParameters
INFO: [bind: 1->ID:201, 2->MASTER_ID:203]
Sep 26, 2011 4:48:14 PM org.apache.cayenne.log.CommonsJdbcEventLogger logUpdateCount
INFO: === updated 1 row.
Sep 26, 2011 4:48:14 PM org.apache.cayenne.log.CommonsJdbcEventLogger logQueryParameters
INFO: [bind: 1->ID:202, 2->MASTER_ID:NULL]
Sep 26, 2011 4:48:14 PM org.apache.cayenne.log.CommonsJdbcEventLogger logUpdateCount
INFO: === updated 1 row.
Sep 26, 2011 4:48:14 PM org.apache.cayenne.log.CommonsJdbcEventLogger logCommitTransaction
INFO: +++ transaction committed.
Sep 26, 2011 4:48:14 PM org.apache.cayenne.log.CommonsJdbcEventLogger logBeginTransaction
INFO: --- transaction started.
Sep 26, 2011 4:48:14 PM org.apache.cayenne.log.CommonsJdbcEventLogger logQuery
INFO: UPDATE CHILD SET MASTER_ID = ? WHERE ID = ?
Sep 26, 2011 4:48:14 PM org.apache.cayenne.log.CommonsJdbcEventLogger logQueryParameters
INFO: [bind: 1->MASTER_ID:203, 2->ID:202]
Sep 26, 2011 4:48:14 PM org.apache.cayenne.log.CommonsJdbcEventLogger logUpdateCount
INFO: === updated 1 row.
Sep 26, 2011 4:48:14 PM org.apache.cayenne.log.CommonsJdbcEventLogger logCommitTransaction
INFO: +++ transaction committed.
Sep 26, 2011 4:48:14 PM org.apache.cayenne.log.CommonsJdbcEventLogger logBeginTransaction
INFO: --- transaction started.
Sep 26, 2011 4:48:14 PM org.apache.cayenne.log.CommonsJdbcEventLogger logQuery
INFO: SELECT t0.MASTER_ID, t0.ID FROM CHILD t0 WHERE t0.MASTER_ID = ? [bind: 1->MASTER_ID:203]
Sep 26, 2011 4:48:14 PM org.apache.cayenne.log.CommonsJdbcEventLogger logSelectCount
INFO: === returned 2 rows. - took 0 ms.
Sep 26, 2011 4:48:14 PM org.apache.cayenne.log.CommonsJdbcEventLogger logCommitTransaction
INFO: +++ transaction committed.
Tests run: 3, Failures: 0, Errors: 0, Skipped: 0, Time elapsed: 0.987 sec
Running org.apache.cayenne.DataRowTest
Tests run: 2, Failures: 0, Errors: 0, Skipped: 0, Time elapsed: 0.001 sec
Running org.apache.cayenne.access.types.EnumTypeTest
Tests run: 7, Failures: 0, Errors: 0, Skipped: 0, Time elapsed: 0.002 sec
Results :
Failed tests:
testSelectNotLikeIgnoreCaseSingleWildcardMatch(org.apache.cayenne.query.SelectQueryTest)
testSelectLikeIgnoreCaseObjects1(org.apache.cayenne.query.SelectQueryTest)
Tests run: 2095, Failures: 2, Errors: 0, Skipped: 0
[INFO] ------------------------------------------------------------------------
[INFO] Reactor Summary:
[INFO]
[INFO] Cayenne ........................................... SUCCESS [0.212s]
[INFO] Common Unit Test Utilities ........................ SUCCESS [1.418s]
[INFO] Cayenne Internal Build Plugin ..................... SUCCESS [1.354s]
[INFO] Cayenne Internal Documentation Build Plugin ....... SUCCESS [1.740s]
[INFO] Cayenne Build Tools Parent ........................ SUCCESS [0.004s]
[INFO] Cayenne License and Notice Bundle ................. SUCCESS [0.688s]
[INFO] Cayenne Dependency Injection Container ............ SUCCESS [2.514s]
[INFO] Cayenne Java 1.5 Unpublished ...................... FAILURE [8:11.585s]
[INFO] Cayenne WebObjects Compatibility Library .......... SKIPPED
[INFO] Cayenne Aggregated Server Jar ..................... SKIPPED
[INFO] Cayenne Aggregated Client Jar ..................... SKIPPED
[INFO] Cayenne Project ................................... SKIPPED
[INFO] Cayenne Tools ..................................... SKIPPED
[INFO] Library: cayenne-lifecycle ........................ SKIPPED
[INFO] Cayenne Maven Plugin .............................. SKIPPED
[INFO] Cayenne Framework Aggregator Project .............. SKIPPED
[INFO] Cayenne Integration Tests Parent .................. SKIPPED
[INFO] Integration Tests - Cayenne Runtime ............... SKIPPED
[INFO] Integration Tests - Cayenne Tools ................. SKIPPED
[INFO] Cayenne Modeler ................................... SKIPPED
[INFO] Cayenne Modeler Maven Plugin ...................... SKIPPED
[INFO] Cayenne Modeler Parent ............................ SKIPPED
[INFO] Cayenne Tutorial .................................. SKIPPED
[INFO] Cayenne ROP Server Tutorial ....................... SKIPPED
[INFO] Cayenne ROP Client Tutorial ....................... SKIPPED
[INFO] Cayenne Tutorials ................................. SKIPPED
[INFO] Cayenne Documentation ............................. SKIPPED
[INFO] Cayenne Documenation Parent ....................... SKIPPED
[INFO] ------------------------------------------------------------------------
[INFO] BUILD FAILURE
[INFO] ------------------------------------------------------------------------
[INFO] Total time: 8:20.347s
[INFO] Finished at: Mon Sep 26 16:48:15 UTC 2011
[INFO] Final Memory: 50M/442M
[INFO] ------------------------------------------------------------------------
[ERROR] Failed to execute goal org.apache.maven.plugins:maven-surefire-plugin:2.5:test (default-test) on project cayenne-jdk1.5-unpublished: There are test failures.
[ERROR]
[ERROR] Please refer to <https://builds.apache.org/job/Cayenne-trunk/./cayenneTestConnection=derby,collationCi=true,jdk=JDK%201.6%20(latest),label=Ubuntu/ws/trunk/framework/cayenne-jdk1.5-unpublished/target/surefire-reports> for the individual test results.
[ERROR] -> [Help 1]
org.apache.maven.lifecycle.LifecycleExecutionException: Failed to execute goal org.apache.maven.plugins:maven-surefire-plugin:2.5:test (default-test) on project cayenne-jdk1.5-unpublished: There are test failures.
Please refer to <https://builds.apache.org/job/Cayenne-trunk/./cayenneTestConnection=derby,collationCi=true,jdk=JDK%201.6%20(latest),label=Ubuntu/ws/trunk/framework/cayenne-jdk1.5-unpublished/target/surefire-reports> for the individual test results.
at org.apache.maven.lifecycle.internal.MojoExecutor.execute(MojoExecutor.java:213)
at org.apache.maven.lifecycle.internal.MojoExecutor.execute(MojoExecutor.java:153)
at org.apache.maven.lifecycle.internal.MojoExecutor.execute(MojoExecutor.java:145)
at org.apache.maven.lifecycle.internal.LifecycleModuleBuilder.buildProject(LifecycleModuleBuilder.java:84)
at org.apache.maven.lifecycle.internal.LifecycleModuleBuilder.buildProject(LifecycleModuleBuilder.java:59)
at org.apache.maven.lifecycle.internal.LifecycleStarter.singleThreadedBuild(LifecycleStarter.java:183)
at org.apache.maven.lifecycle.internal.LifecycleStarter.execute(LifecycleStarter.java:161)
at org.apache.maven.DefaultMaven.doExecute(DefaultMaven.java:319)
at org.apache.maven.DefaultMaven.execute(DefaultMaven.java:156)
at org.apache.maven.cli.MavenCli.execute(MavenCli.java:537)
at org.apache.maven.cli.MavenCli.doMain(MavenCli.java:196)
at org.apache.maven.cli.MavenCli.main(MavenCli.java:141)
at sun.reflect.NativeMethodAccessorImpl.invoke0(Native Method)
at sun.reflect.NativeMethodAccessorImpl.invoke(NativeMethodAccessorImpl.java:39)
at sun.reflect.DelegatingMethodAccessorImpl.invoke(DelegatingMethodAccessorImpl.java:25)
at java.lang.reflect.Method.invoke(Method.java:597)
at org.codehaus.plexus.classworlds.launcher.Launcher.launchEnhanced(Launcher.java:290)
at org.codehaus.plexus.classworlds.launcher.Launcher.launch(Launcher.java:230)
at org.codehaus.plexus.classworlds.launcher.Launcher.mainWithExitCode(Launcher.java:409)
at org.codehaus.plexus.classworlds.launcher.Launcher.main(Launcher.java:352)
Caused by: org.apache.maven.plugin.MojoFailureException: There are test failures.
Please refer to <https://builds.apache.org/job/Cayenne-trunk/./cayenneTestConnection=derby,collationCi=true,jdk=JDK%201.6%20(latest),label=Ubuntu/ws/trunk/framework/cayenne-jdk1.5-unpublished/target/surefire-reports> for the individual test results.
at org.apache.maven.plugin.surefire.SurefirePlugin.execute(SurefirePlugin.java:629)
at org.apache.maven.plugin.DefaultBuildPluginManager.executeMojo(DefaultBuildPluginManager.java:101)
at org.apache.maven.lifecycle.internal.MojoExecutor.execute(MojoExecutor.java:209)
... 19 more
[ERROR]
[ERROR] Re-run Maven using the -X switch to enable full debug logging.
[ERROR]
[ERROR] For more information about the errors and possible solutions, please read the following articles:
[ERROR] [Help 1] http://cwiki.apache.org/confluence/display/MAVEN/MojoFailureException
[ERROR]
[ERROR] After correcting the problems, you can resume the build with the command
[ERROR] mvn <goals> -rf :cayenne-jdk1.5-unpublished
Build step 'Invoke top-level Maven targets' marked build as failure
Archiving artifacts
Build failed in Jenkins: Cayenne-trunk » derby,true,JDK 1.6 (latest),Ubuntu #587
Posted by Apache Jenkins Server <je...@builds.apache.org>.
See <https://builds.apache.org/job/Cayenne-trunk/./cayenneTestConnection=derby,collationCi=true,jdk=JDK%201.6%20(latest),label=Ubuntu/587/changes>
Changes:
[dkazimirchyk] CAY-1595 EHCache implementation of Provider<QueryCache>
release notes
------------------------------------------
[...truncated 85311 lines...]
INFO: delete from ARTIST
Sep 26, 2011 8:38:22 AM org.apache.cayenne.test.jdbc.UtilityLogger log
INFO: delete from PAINTING
Sep 26, 2011 8:38:22 AM org.apache.cayenne.test.jdbc.UtilityLogger log
INFO: INSERT INTO ARTIST (ARTIST_ID, ARTIST_NAME) VALUES (?, ?)
Sep 26, 2011 8:38:22 AM org.apache.cayenne.test.jdbc.UtilityLogger log
INFO: INSERT INTO PAINTING (PAINTING_ID, PAINTING_TITLE, ARTIST_ID, ESTIMATED_PRICE) VALUES (?, ?, ?, ?)
Sep 26, 2011 8:38:22 AM org.apache.cayenne.log.CommonsJdbcEventLogger logBeginTransaction
INFO: --- transaction started.
Sep 26, 2011 8:38:22 AM org.apache.cayenne.log.CommonsJdbcEventLogger logQuery
INFO: SELECT t0.DATE_OF_BIRTH, t0.ARTIST_ID, t0.ARTIST_NAME FROM ARTIST t0
Sep 26, 2011 8:38:22 AM org.apache.cayenne.log.CommonsJdbcEventLogger logSelectCount
INFO: === returned 1 row. - took 1 ms.
Sep 26, 2011 8:38:22 AM org.apache.cayenne.log.CommonsJdbcEventLogger logCommitTransaction
INFO: +++ transaction committed.
Sep 26, 2011 8:38:22 AM org.apache.cayenne.test.jdbc.UtilityLogger log
INFO: update ARTIST set ARTIST_NAME = ? where ARTIST_ID = ?
Sep 26, 2011 8:38:22 AM org.apache.cayenne.log.CommonsJdbcEventLogger logBeginTransaction
INFO: --- transaction started.
Sep 26, 2011 8:38:22 AM org.apache.cayenne.log.CommonsJdbcEventLogger logQuery
INFO: SELECT t0.DATE_OF_BIRTH, t0.ARTIST_ID, t0.ARTIST_NAME FROM ARTIST t0
Sep 26, 2011 8:38:22 AM org.apache.cayenne.log.CommonsJdbcEventLogger logSelectCount
INFO: === returned 1 row. - took 0 ms.
Sep 26, 2011 8:38:22 AM org.apache.cayenne.log.CommonsJdbcEventLogger logCommitTransaction
INFO: +++ transaction committed.
Sep 26, 2011 8:38:22 AM org.apache.cayenne.configuration.XMLDataChannelDescriptorLoader load
INFO: Loading XML configuration resource from <https://builds.apache.org/job/Cayenne-trunk/./cayenneTestConnection=derby,collationCi=true,jdk=JDK%201.6%20(latest),label=Ubuntu/ws/trunk/framework/cayenne-jdk1.5-unpublished/target/test-classes/cayenne-relationships.xml>
Sep 26, 2011 8:38:22 AM org.apache.cayenne.map.EntityResolver applyDBLayerDefaults
INFO: added runtime complimentary DbRelationship from DELETE_RULE_TEST3 to DELETE_RULE_TEST1
Sep 26, 2011 8:38:22 AM org.apache.cayenne.map.EntityResolver applyObjectLayerDefaults
INFO: added runtime complimentary ObjRelationship from FlattenedTest3 to FlattenedTest1
Sep 26, 2011 8:38:22 AM org.apache.cayenne.map.EntityResolver applyObjectLayerDefaults
INFO: added runtime complimentary ObjRelationship from FlattenedTest4 to FlattenedTest1
Sep 26, 2011 8:38:22 AM org.apache.cayenne.log.CommonsJdbcEventLogger logBeginTransaction
INFO: --- transaction started.
Sep 26, 2011 8:38:22 AM org.apache.cayenne.log.CommonsJdbcEventLogger logQuery
INFO: SELECT NEXT_ID FROM AUTO_PK_SUPPORT WHERE TABLE_NAME = 'MASTER'
Sep 26, 2011 8:38:22 AM org.apache.cayenne.log.CommonsJdbcEventLogger logSelectCount
INFO: === returned 1 row. - took 0 ms.
Sep 26, 2011 8:38:22 AM org.apache.cayenne.log.CommonsJdbcEventLogger logQuery
INFO: UPDATE AUTO_PK_SUPPORT SET NEXT_ID = NEXT_ID + 20 WHERE TABLE_NAME = 'MASTER'
Sep 26, 2011 8:38:22 AM org.apache.cayenne.log.CommonsJdbcEventLogger logUpdateCount
INFO: === updated 1 row.
Sep 26, 2011 8:38:22 AM org.apache.cayenne.log.CommonsJdbcEventLogger logQuery
INFO: INSERT INTO MASTER (ID, NAME) VALUES (?, ?)
Sep 26, 2011 8:38:22 AM org.apache.cayenne.log.CommonsJdbcEventLogger logQueryParameters
INFO: [bind: 1->ID:200, 2->NAME:'X']
Sep 26, 2011 8:38:22 AM org.apache.cayenne.log.CommonsJdbcEventLogger logUpdateCount
INFO: === updated 1 row.
Sep 26, 2011 8:38:22 AM org.apache.cayenne.log.CommonsJdbcEventLogger logCommitTransaction
INFO: +++ transaction committed.
Sep 26, 2011 8:38:22 AM org.apache.cayenne.log.CommonsJdbcEventLogger logBeginTransaction
INFO: --- transaction started.
Sep 26, 2011 8:38:22 AM org.apache.cayenne.log.CommonsJdbcEventLogger logQuery
INFO: UPDATE MASTER SET NAME = ? WHERE ID = ?
Sep 26, 2011 8:38:22 AM org.apache.cayenne.log.CommonsJdbcEventLogger logQueryParameters
INFO: [bind: 1->NAME:'Y', 2->ID:200]
Sep 26, 2011 8:38:22 AM org.apache.cayenne.log.CommonsJdbcEventLogger logUpdateCount
INFO: === updated 1 row.
Sep 26, 2011 8:38:22 AM org.apache.cayenne.log.CommonsJdbcEventLogger logCommitTransaction
INFO: +++ transaction committed.
Sep 26, 2011 8:38:22 AM org.apache.cayenne.configuration.XMLDataChannelDescriptorLoader load
INFO: Loading XML configuration resource from <https://builds.apache.org/job/Cayenne-trunk/./cayenneTestConnection=derby,collationCi=true,jdk=JDK%201.6%20(latest),label=Ubuntu/ws/trunk/framework/cayenne-jdk1.5-unpublished/target/test-classes/cayenne-relationships.xml>
Sep 26, 2011 8:38:22 AM org.apache.cayenne.map.EntityResolver applyDBLayerDefaults
INFO: added runtime complimentary DbRelationship from DELETE_RULE_TEST3 to DELETE_RULE_TEST1
Sep 26, 2011 8:38:22 AM org.apache.cayenne.map.EntityResolver applyObjectLayerDefaults
INFO: added runtime complimentary ObjRelationship from FlattenedTest3 to FlattenedTest1
Sep 26, 2011 8:38:22 AM org.apache.cayenne.map.EntityResolver applyObjectLayerDefaults
INFO: added runtime complimentary ObjRelationship from FlattenedTest4 to FlattenedTest1
Sep 26, 2011 8:38:22 AM org.apache.cayenne.log.CommonsJdbcEventLogger logBeginTransaction
INFO: --- transaction started.
Sep 26, 2011 8:38:22 AM org.apache.cayenne.log.CommonsJdbcEventLogger logQuery
INFO: SELECT NEXT_ID FROM AUTO_PK_SUPPORT WHERE TABLE_NAME = 'CHILD'
Sep 26, 2011 8:38:22 AM org.apache.cayenne.log.CommonsJdbcEventLogger logSelectCount
INFO: === returned 1 row. - took 0 ms.
Sep 26, 2011 8:38:22 AM org.apache.cayenne.log.CommonsJdbcEventLogger logQuery
INFO: UPDATE AUTO_PK_SUPPORT SET NEXT_ID = NEXT_ID + 20 WHERE TABLE_NAME = 'CHILD'
Sep 26, 2011 8:38:22 AM org.apache.cayenne.log.CommonsJdbcEventLogger logUpdateCount
INFO: === updated 1 row.
Sep 26, 2011 8:38:22 AM org.apache.cayenne.log.CommonsJdbcEventLogger logQuery
INFO: INSERT INTO MASTER (ID, NAME) VALUES (?, ?)
Sep 26, 2011 8:38:22 AM org.apache.cayenne.log.CommonsJdbcEventLogger logQueryParameters
INFO: [bind: 1->ID:201, 2->NAME:'Y']
Sep 26, 2011 8:38:22 AM org.apache.cayenne.log.CommonsJdbcEventLogger logUpdateCount
INFO: === updated 1 row.
Sep 26, 2011 8:38:22 AM org.apache.cayenne.log.CommonsJdbcEventLogger logQueryParameters
INFO: [bind: 1->ID:202, 2->NAME:'X']
Sep 26, 2011 8:38:22 AM org.apache.cayenne.log.CommonsJdbcEventLogger logUpdateCount
INFO: === updated 1 row.
Sep 26, 2011 8:38:22 AM org.apache.cayenne.log.CommonsJdbcEventLogger logQuery
INFO: INSERT INTO CHILD (ID, MASTER_ID) VALUES (?, ?)
Sep 26, 2011 8:38:22 AM org.apache.cayenne.log.CommonsJdbcEventLogger logQueryParameters
INFO: [bind: 1->ID:200, 2->MASTER_ID:202]
Sep 26, 2011 8:38:22 AM org.apache.cayenne.log.CommonsJdbcEventLogger logUpdateCount
INFO: === updated 1 row.
Sep 26, 2011 8:38:22 AM org.apache.cayenne.log.CommonsJdbcEventLogger logCommitTransaction
INFO: +++ transaction committed.
Sep 26, 2011 8:38:22 AM org.apache.cayenne.log.CommonsJdbcEventLogger logBeginTransaction
INFO: --- transaction started.
Sep 26, 2011 8:38:22 AM org.apache.cayenne.log.CommonsJdbcEventLogger logQuery
INFO: UPDATE CHILD SET MASTER_ID = ? WHERE ID = ?
Sep 26, 2011 8:38:22 AM org.apache.cayenne.log.CommonsJdbcEventLogger logQueryParameters
INFO: [bind: 1->MASTER_ID:201, 2->ID:200]
Sep 26, 2011 8:38:22 AM org.apache.cayenne.log.CommonsJdbcEventLogger logUpdateCount
INFO: === updated 1 row.
Sep 26, 2011 8:38:22 AM org.apache.cayenne.log.CommonsJdbcEventLogger logCommitTransaction
INFO: +++ transaction committed.
Sep 26, 2011 8:38:22 AM org.apache.cayenne.configuration.XMLDataChannelDescriptorLoader load
INFO: Loading XML configuration resource from <https://builds.apache.org/job/Cayenne-trunk/./cayenneTestConnection=derby,collationCi=true,jdk=JDK%201.6%20(latest),label=Ubuntu/ws/trunk/framework/cayenne-jdk1.5-unpublished/target/test-classes/cayenne-relationships.xml>
Sep 26, 2011 8:38:22 AM org.apache.cayenne.map.EntityResolver applyDBLayerDefaults
INFO: added runtime complimentary DbRelationship from DELETE_RULE_TEST3 to DELETE_RULE_TEST1
Sep 26, 2011 8:38:22 AM org.apache.cayenne.map.EntityResolver applyObjectLayerDefaults
INFO: added runtime complimentary ObjRelationship from FlattenedTest3 to FlattenedTest1
Sep 26, 2011 8:38:22 AM org.apache.cayenne.map.EntityResolver applyObjectLayerDefaults
INFO: added runtime complimentary ObjRelationship from FlattenedTest4 to FlattenedTest1
Sep 26, 2011 8:38:22 AM org.apache.cayenne.log.CommonsJdbcEventLogger logBeginTransaction
INFO: --- transaction started.
Sep 26, 2011 8:38:22 AM org.apache.cayenne.log.CommonsJdbcEventLogger logQuery
INFO: INSERT INTO MASTER (ID, NAME) VALUES (?, ?)
Sep 26, 2011 8:38:22 AM org.apache.cayenne.log.CommonsJdbcEventLogger logQueryParameters
INFO: [bind: 1->ID:203, 2->NAME:'X']
Sep 26, 2011 8:38:22 AM org.apache.cayenne.log.CommonsJdbcEventLogger logUpdateCount
INFO: === updated 1 row.
Sep 26, 2011 8:38:22 AM org.apache.cayenne.log.CommonsJdbcEventLogger logQuery
INFO: INSERT INTO CHILD (ID, MASTER_ID) VALUES (?, ?)
Sep 26, 2011 8:38:22 AM org.apache.cayenne.log.CommonsJdbcEventLogger logQueryParameters
INFO: [bind: 1->ID:201, 2->MASTER_ID:203]
Sep 26, 2011 8:38:22 AM org.apache.cayenne.log.CommonsJdbcEventLogger logUpdateCount
INFO: === updated 1 row.
Sep 26, 2011 8:38:22 AM org.apache.cayenne.log.CommonsJdbcEventLogger logQueryParameters
INFO: [bind: 1->ID:202, 2->MASTER_ID:NULL]
Sep 26, 2011 8:38:22 AM org.apache.cayenne.log.CommonsJdbcEventLogger logUpdateCount
INFO: === updated 1 row.
Sep 26, 2011 8:38:22 AM org.apache.cayenne.log.CommonsJdbcEventLogger logCommitTransaction
INFO: +++ transaction committed.
Sep 26, 2011 8:38:22 AM org.apache.cayenne.log.CommonsJdbcEventLogger logBeginTransaction
INFO: --- transaction started.
Sep 26, 2011 8:38:22 AM org.apache.cayenne.log.CommonsJdbcEventLogger logQuery
INFO: UPDATE CHILD SET MASTER_ID = ? WHERE ID = ?
Sep 26, 2011 8:38:22 AM org.apache.cayenne.log.CommonsJdbcEventLogger logQueryParameters
INFO: [bind: 1->MASTER_ID:203, 2->ID:202]
Sep 26, 2011 8:38:22 AM org.apache.cayenne.log.CommonsJdbcEventLogger logUpdateCount
INFO: === updated 1 row.
Sep 26, 2011 8:38:22 AM org.apache.cayenne.log.CommonsJdbcEventLogger logCommitTransaction
INFO: +++ transaction committed.
Sep 26, 2011 8:38:23 AM org.apache.cayenne.log.CommonsJdbcEventLogger logBeginTransaction
INFO: --- transaction started.
Sep 26, 2011 8:38:23 AM org.apache.cayenne.log.CommonsJdbcEventLogger logQuery
INFO: SELECT t0.MASTER_ID, t0.ID FROM CHILD t0 WHERE t0.MASTER_ID = ? [bind: 1->MASTER_ID:203]
Sep 26, 2011 8:38:23 AM org.apache.cayenne.log.CommonsJdbcEventLogger logSelectCount
INFO: === returned 2 rows. - took 0 ms.
Sep 26, 2011 8:38:23 AM org.apache.cayenne.log.CommonsJdbcEventLogger logCommitTransaction
INFO: +++ transaction committed.
Tests run: 3, Failures: 0, Errors: 0, Skipped: 0, Time elapsed: 1.016 sec
Running org.apache.cayenne.DataRowTest
Tests run: 2, Failures: 0, Errors: 0, Skipped: 0, Time elapsed: 0.002 sec
Running org.apache.cayenne.access.types.EnumTypeTest
Tests run: 7, Failures: 0, Errors: 0, Skipped: 0, Time elapsed: 0.002 sec
Results :
Failed tests:
testSelectNotLikeIgnoreCaseSingleWildcardMatch(org.apache.cayenne.query.SelectQueryTest)
testSelectLikeIgnoreCaseObjects1(org.apache.cayenne.query.SelectQueryTest)
Tests run: 2095, Failures: 2, Errors: 0, Skipped: 0
[INFO] ------------------------------------------------------------------------
[INFO] Reactor Summary:
[INFO]
[INFO] Cayenne ........................................... SUCCESS [0.231s]
[INFO] Common Unit Test Utilities ........................ SUCCESS [1.385s]
[INFO] Cayenne Internal Build Plugin ..................... SUCCESS [1.204s]
[INFO] Cayenne Internal Documentation Build Plugin ....... SUCCESS [1.930s]
[INFO] Cayenne Build Tools Parent ........................ SUCCESS [0.005s]
[INFO] Cayenne License and Notice Bundle ................. SUCCESS [0.657s]
[INFO] Cayenne Dependency Injection Container ............ SUCCESS [2.436s]
[INFO] Cayenne Java 1.5 Unpublished ...................... FAILURE [8:25.339s]
[INFO] Cayenne WebObjects Compatibility Library .......... SKIPPED
[INFO] Cayenne Aggregated Server Jar ..................... SKIPPED
[INFO] Cayenne Aggregated Client Jar ..................... SKIPPED
[INFO] Cayenne Project ................................... SKIPPED
[INFO] Cayenne Tools ..................................... SKIPPED
[INFO] Library: cayenne-lifecycle ........................ SKIPPED
[INFO] Cayenne Maven Plugin .............................. SKIPPED
[INFO] Cayenne Framework Aggregator Project .............. SKIPPED
[INFO] Cayenne Integration Tests Parent .................. SKIPPED
[INFO] Integration Tests - Cayenne Runtime ............... SKIPPED
[INFO] Integration Tests - Cayenne Tools ................. SKIPPED
[INFO] Cayenne Modeler ................................... SKIPPED
[INFO] Cayenne Modeler Maven Plugin ...................... SKIPPED
[INFO] Cayenne Modeler Parent ............................ SKIPPED
[INFO] Cayenne Tutorial .................................. SKIPPED
[INFO] Cayenne ROP Server Tutorial ....................... SKIPPED
[INFO] Cayenne ROP Client Tutorial ....................... SKIPPED
[INFO] Cayenne Tutorials ................................. SKIPPED
[INFO] Cayenne Documentation ............................. SKIPPED
[INFO] Cayenne Documenation Parent ....................... SKIPPED
[INFO] ------------------------------------------------------------------------
[INFO] BUILD FAILURE
[INFO] ------------------------------------------------------------------------
[INFO] Total time: 8:33.885s
[INFO] Finished at: Mon Sep 26 08:38:23 UTC 2011
[INFO] Final Memory: 45M/365M
[INFO] ------------------------------------------------------------------------
[ERROR] Failed to execute goal org.apache.maven.plugins:maven-surefire-plugin:2.5:test (default-test) on project cayenne-jdk1.5-unpublished: There are test failures.
[ERROR]
[ERROR] Please refer to <https://builds.apache.org/job/Cayenne-trunk/./cayenneTestConnection=derby,collationCi=true,jdk=JDK%201.6%20(latest),label=Ubuntu/ws/trunk/framework/cayenne-jdk1.5-unpublished/target/surefire-reports> for the individual test results.
[ERROR] -> [Help 1]
org.apache.maven.lifecycle.LifecycleExecutionException: Failed to execute goal org.apache.maven.plugins:maven-surefire-plugin:2.5:test (default-test) on project cayenne-jdk1.5-unpublished: There are test failures.
Please refer to <https://builds.apache.org/job/Cayenne-trunk/./cayenneTestConnection=derby,collationCi=true,jdk=JDK%201.6%20(latest),label=Ubuntu/ws/trunk/framework/cayenne-jdk1.5-unpublished/target/surefire-reports> for the individual test results.
at org.apache.maven.lifecycle.internal.MojoExecutor.execute(MojoExecutor.java:213)
at org.apache.maven.lifecycle.internal.MojoExecutor.execute(MojoExecutor.java:153)
at org.apache.maven.lifecycle.internal.MojoExecutor.execute(MojoExecutor.java:145)
at org.apache.maven.lifecycle.internal.LifecycleModuleBuilder.buildProject(LifecycleModuleBuilder.java:84)
at org.apache.maven.lifecycle.internal.LifecycleModuleBuilder.buildProject(LifecycleModuleBuilder.java:59)
at org.apache.maven.lifecycle.internal.LifecycleStarter.singleThreadedBuild(LifecycleStarter.java:183)
at org.apache.maven.lifecycle.internal.LifecycleStarter.execute(LifecycleStarter.java:161)
at org.apache.maven.DefaultMaven.doExecute(DefaultMaven.java:319)
at org.apache.maven.DefaultMaven.execute(DefaultMaven.java:156)
at org.apache.maven.cli.MavenCli.execute(MavenCli.java:537)
at org.apache.maven.cli.MavenCli.doMain(MavenCli.java:196)
at org.apache.maven.cli.MavenCli.main(MavenCli.java:141)
at sun.reflect.NativeMethodAccessorImpl.invoke0(Native Method)
at sun.reflect.NativeMethodAccessorImpl.invoke(NativeMethodAccessorImpl.java:39)
at sun.reflect.DelegatingMethodAccessorImpl.invoke(DelegatingMethodAccessorImpl.java:25)
at java.lang.reflect.Method.invoke(Method.java:597)
at org.codehaus.plexus.classworlds.launcher.Launcher.launchEnhanced(Launcher.java:290)
at org.codehaus.plexus.classworlds.launcher.Launcher.launch(Launcher.java:230)
at org.codehaus.plexus.classworlds.launcher.Launcher.mainWithExitCode(Launcher.java:409)
at org.codehaus.plexus.classworlds.launcher.Launcher.main(Launcher.java:352)
Caused by: org.apache.maven.plugin.MojoFailureException: There are test failures.
Please refer to <https://builds.apache.org/job/Cayenne-trunk/./cayenneTestConnection=derby,collationCi=true,jdk=JDK%201.6%20(latest),label=Ubuntu/ws/trunk/framework/cayenne-jdk1.5-unpublished/target/surefire-reports> for the individual test results.
at org.apache.maven.plugin.surefire.SurefirePlugin.execute(SurefirePlugin.java:629)
at org.apache.maven.plugin.DefaultBuildPluginManager.executeMojo(DefaultBuildPluginManager.java:101)
at org.apache.maven.lifecycle.internal.MojoExecutor.execute(MojoExecutor.java:209)
... 19 more
[ERROR]
[ERROR] Re-run Maven using the -X switch to enable full debug logging.
[ERROR]
[ERROR] For more information about the errors and possible solutions, please read the following articles:
[ERROR] [Help 1] http://cwiki.apache.org/confluence/display/MAVEN/MojoFailureException
[ERROR]
[ERROR] After correcting the problems, you can resume the build with the command
[ERROR] mvn <goals> -rf :cayenne-jdk1.5-unpublished
Build step 'Invoke top-level Maven targets' marked build as failure
Archiving artifacts
Build failed in Jenkins: Cayenne-trunk » derby,true,JDK 1.6 (latest),Ubuntu #586
Posted by Apache Jenkins Server <je...@builds.apache.org>.
See <https://builds.apache.org/job/Cayenne-trunk/./cayenneTestConnection=derby,collationCi=true,jdk=JDK%201.6%20(latest),label=Ubuntu/586/changes>
Changes:
[aadamchik] empty dir
[aadamchik] empty dir
[aadamchik] empty dir
[aadamchik] empty dir
[aadamchik] empty dir
[aadamchik] empty dir
[aadamchik] empty dir
------------------------------------------
[...truncated 85311 lines...]
INFO: delete from PAINTING
Sep 19, 2011 7:37:11 AM org.apache.cayenne.test.jdbc.UtilityLogger log
INFO: INSERT INTO ARTIST (ARTIST_ID, ARTIST_NAME) VALUES (?, ?)
Sep 19, 2011 7:37:11 AM org.apache.cayenne.test.jdbc.UtilityLogger log
INFO: INSERT INTO PAINTING (PAINTING_ID, PAINTING_TITLE, ARTIST_ID, ESTIMATED_PRICE) VALUES (?, ?, ?, ?)
Sep 19, 2011 7:37:11 AM org.apache.cayenne.log.CommonsJdbcEventLogger logBeginTransaction
INFO: --- transaction started.
Sep 19, 2011 7:37:11 AM org.apache.cayenne.log.CommonsJdbcEventLogger logQuery
INFO: SELECT t0.DATE_OF_BIRTH, t0.ARTIST_ID, t0.ARTIST_NAME FROM ARTIST t0
Sep 19, 2011 7:37:11 AM org.apache.cayenne.log.CommonsJdbcEventLogger logSelectCount
INFO: === returned 1 row. - took 1 ms.
Sep 19, 2011 7:37:11 AM org.apache.cayenne.log.CommonsJdbcEventLogger logCommitTransaction
INFO: +++ transaction committed.
Sep 19, 2011 7:37:11 AM org.apache.cayenne.test.jdbc.UtilityLogger log
INFO: update ARTIST set ARTIST_NAME = ? where ARTIST_ID = ?
Sep 19, 2011 7:37:11 AM org.apache.cayenne.log.CommonsJdbcEventLogger logBeginTransaction
INFO: --- transaction started.
Sep 19, 2011 7:37:11 AM org.apache.cayenne.log.CommonsJdbcEventLogger logQuery
INFO: SELECT t0.DATE_OF_BIRTH, t0.ARTIST_ID, t0.ARTIST_NAME FROM ARTIST t0
Sep 19, 2011 7:37:11 AM org.apache.cayenne.log.CommonsJdbcEventLogger logSelectCount
INFO: === returned 1 row. - took 1 ms.
Sep 19, 2011 7:37:11 AM org.apache.cayenne.log.CommonsJdbcEventLogger logCommitTransaction
INFO: +++ transaction committed.
Tests run: 4, Failures: 0, Errors: 0, Skipped: 0, Time elapsed: 0.198 sec
Running org.apache.cayenne.access.NestedDataContextParentPeerEventsTest
Sep 19, 2011 7:37:11 AM org.apache.cayenne.configuration.XMLDataChannelDescriptorLoader load
INFO: Loading XML configuration resource from file:/x1/jenkins/jenkins-slave/workspace/Cayenne-trunk/cayenneTestConnection/derby/collationCi/true/jdk/JDK%201.6%20(latest)/label/Ubuntu/trunk/framework/cayenne-jdk1.5-unpublished/target/test-classes/cayenne-relationships.xml
Sep 19, 2011 7:37:11 AM org.apache.cayenne.map.EntityResolver applyDBLayerDefaults
INFO: added runtime complimentary DbRelationship from DELETE_RULE_TEST3 to DELETE_RULE_TEST1
Sep 19, 2011 7:37:11 AM org.apache.cayenne.map.EntityResolver applyObjectLayerDefaults
INFO: added runtime complimentary ObjRelationship from FlattenedTest3 to FlattenedTest1
Sep 19, 2011 7:37:11 AM org.apache.cayenne.map.EntityResolver applyObjectLayerDefaults
INFO: added runtime complimentary ObjRelationship from FlattenedTest4 to FlattenedTest1
Sep 19, 2011 7:37:11 AM org.apache.cayenne.log.CommonsJdbcEventLogger logBeginTransaction
INFO: --- transaction started.
Sep 19, 2011 7:37:11 AM org.apache.cayenne.log.CommonsJdbcEventLogger logQuery
INFO: SELECT NEXT_ID FROM AUTO_PK_SUPPORT WHERE TABLE_NAME = 'MASTER'
Sep 19, 2011 7:37:11 AM org.apache.cayenne.log.CommonsJdbcEventLogger logSelectCount
INFO: === returned 1 row. - took 0 ms.
Sep 19, 2011 7:37:11 AM org.apache.cayenne.log.CommonsJdbcEventLogger logQuery
INFO: UPDATE AUTO_PK_SUPPORT SET NEXT_ID = NEXT_ID + 20 WHERE TABLE_NAME = 'MASTER'
Sep 19, 2011 7:37:11 AM org.apache.cayenne.log.CommonsJdbcEventLogger logUpdateCount
INFO: === updated 1 row.
Sep 19, 2011 7:37:11 AM org.apache.cayenne.log.CommonsJdbcEventLogger logQuery
INFO: INSERT INTO MASTER (ID, NAME) VALUES (?, ?)
Sep 19, 2011 7:37:11 AM org.apache.cayenne.log.CommonsJdbcEventLogger logQueryParameters
INFO: [bind: 1->ID:200, 2->NAME:'X']
Sep 19, 2011 7:37:11 AM org.apache.cayenne.log.CommonsJdbcEventLogger logUpdateCount
INFO: === updated 1 row.
Sep 19, 2011 7:37:11 AM org.apache.cayenne.log.CommonsJdbcEventLogger logCommitTransaction
INFO: +++ transaction committed.
Sep 19, 2011 7:37:11 AM org.apache.cayenne.log.CommonsJdbcEventLogger logBeginTransaction
INFO: --- transaction started.
Sep 19, 2011 7:37:11 AM org.apache.cayenne.log.CommonsJdbcEventLogger logQuery
INFO: UPDATE MASTER SET NAME = ? WHERE ID = ?
Sep 19, 2011 7:37:11 AM org.apache.cayenne.log.CommonsJdbcEventLogger logQueryParameters
INFO: [bind: 1->NAME:'Y', 2->ID:200]
Sep 19, 2011 7:37:11 AM org.apache.cayenne.log.CommonsJdbcEventLogger logUpdateCount
INFO: === updated 1 row.
Sep 19, 2011 7:37:11 AM org.apache.cayenne.log.CommonsJdbcEventLogger logCommitTransaction
INFO: +++ transaction committed.
Sep 19, 2011 7:37:11 AM org.apache.cayenne.configuration.XMLDataChannelDescriptorLoader load
INFO: Loading XML configuration resource from file:/x1/jenkins/jenkins-slave/workspace/Cayenne-trunk/cayenneTestConnection/derby/collationCi/true/jdk/JDK%201.6%20(latest)/label/Ubuntu/trunk/framework/cayenne-jdk1.5-unpublished/target/test-classes/cayenne-relationships.xml
Sep 19, 2011 7:37:11 AM org.apache.cayenne.map.EntityResolver applyDBLayerDefaults
INFO: added runtime complimentary DbRelationship from DELETE_RULE_TEST3 to DELETE_RULE_TEST1
Sep 19, 2011 7:37:11 AM org.apache.cayenne.map.EntityResolver applyObjectLayerDefaults
INFO: added runtime complimentary ObjRelationship from FlattenedTest3 to FlattenedTest1
Sep 19, 2011 7:37:11 AM org.apache.cayenne.map.EntityResolver applyObjectLayerDefaults
INFO: added runtime complimentary ObjRelationship from FlattenedTest4 to FlattenedTest1
Sep 19, 2011 7:37:11 AM org.apache.cayenne.log.CommonsJdbcEventLogger logBeginTransaction
INFO: --- transaction started.
Sep 19, 2011 7:37:11 AM org.apache.cayenne.log.CommonsJdbcEventLogger logQuery
INFO: SELECT NEXT_ID FROM AUTO_PK_SUPPORT WHERE TABLE_NAME = 'CHILD'
Sep 19, 2011 7:37:11 AM org.apache.cayenne.log.CommonsJdbcEventLogger logSelectCount
INFO: === returned 1 row. - took 0 ms.
Sep 19, 2011 7:37:11 AM org.apache.cayenne.log.CommonsJdbcEventLogger logQuery
INFO: UPDATE AUTO_PK_SUPPORT SET NEXT_ID = NEXT_ID + 20 WHERE TABLE_NAME = 'CHILD'
Sep 19, 2011 7:37:11 AM org.apache.cayenne.log.CommonsJdbcEventLogger logUpdateCount
INFO: === updated 1 row.
Sep 19, 2011 7:37:11 AM org.apache.cayenne.log.CommonsJdbcEventLogger logQuery
INFO: INSERT INTO MASTER (ID, NAME) VALUES (?, ?)
Sep 19, 2011 7:37:11 AM org.apache.cayenne.log.CommonsJdbcEventLogger logQueryParameters
INFO: [bind: 1->ID:201, 2->NAME:'X']
Sep 19, 2011 7:37:11 AM org.apache.cayenne.log.CommonsJdbcEventLogger logUpdateCount
INFO: === updated 1 row.
Sep 19, 2011 7:37:11 AM org.apache.cayenne.log.CommonsJdbcEventLogger logQueryParameters
INFO: [bind: 1->ID:202, 2->NAME:'Y']
Sep 19, 2011 7:37:11 AM org.apache.cayenne.log.CommonsJdbcEventLogger logUpdateCount
INFO: === updated 1 row.
Sep 19, 2011 7:37:11 AM org.apache.cayenne.log.CommonsJdbcEventLogger logQuery
INFO: INSERT INTO CHILD (ID, MASTER_ID) VALUES (?, ?)
Sep 19, 2011 7:37:11 AM org.apache.cayenne.log.CommonsJdbcEventLogger logQueryParameters
INFO: [bind: 1->ID:200, 2->MASTER_ID:201]
Sep 19, 2011 7:37:11 AM org.apache.cayenne.log.CommonsJdbcEventLogger logUpdateCount
INFO: === updated 1 row.
Sep 19, 2011 7:37:11 AM org.apache.cayenne.log.CommonsJdbcEventLogger logCommitTransaction
INFO: +++ transaction committed.
Sep 19, 2011 7:37:11 AM org.apache.cayenne.log.CommonsJdbcEventLogger logBeginTransaction
INFO: --- transaction started.
Sep 19, 2011 7:37:11 AM org.apache.cayenne.log.CommonsJdbcEventLogger logQuery
INFO: UPDATE CHILD SET MASTER_ID = ? WHERE ID = ?
Sep 19, 2011 7:37:11 AM org.apache.cayenne.log.CommonsJdbcEventLogger logQueryParameters
INFO: [bind: 1->MASTER_ID:202, 2->ID:200]
Sep 19, 2011 7:37:11 AM org.apache.cayenne.log.CommonsJdbcEventLogger logUpdateCount
INFO: === updated 1 row.
Sep 19, 2011 7:37:11 AM org.apache.cayenne.log.CommonsJdbcEventLogger logCommitTransaction
INFO: +++ transaction committed.
Sep 19, 2011 7:37:12 AM org.apache.cayenne.configuration.XMLDataChannelDescriptorLoader load
INFO: Loading XML configuration resource from file:/x1/jenkins/jenkins-slave/workspace/Cayenne-trunk/cayenneTestConnection/derby/collationCi/true/jdk/JDK%201.6%20(latest)/label/Ubuntu/trunk/framework/cayenne-jdk1.5-unpublished/target/test-classes/cayenne-relationships.xml
Sep 19, 2011 7:37:12 AM org.apache.cayenne.map.EntityResolver applyDBLayerDefaults
INFO: added runtime complimentary DbRelationship from DELETE_RULE_TEST3 to DELETE_RULE_TEST1
Sep 19, 2011 7:37:12 AM org.apache.cayenne.map.EntityResolver applyObjectLayerDefaults
INFO: added runtime complimentary ObjRelationship from FlattenedTest3 to FlattenedTest1
Sep 19, 2011 7:37:12 AM org.apache.cayenne.map.EntityResolver applyObjectLayerDefaults
INFO: added runtime complimentary ObjRelationship from FlattenedTest4 to FlattenedTest1
Sep 19, 2011 7:37:12 AM org.apache.cayenne.log.CommonsJdbcEventLogger logBeginTransaction
INFO: --- transaction started.
Sep 19, 2011 7:37:12 AM org.apache.cayenne.log.CommonsJdbcEventLogger logQuery
INFO: INSERT INTO MASTER (ID, NAME) VALUES (?, ?)
Sep 19, 2011 7:37:12 AM org.apache.cayenne.log.CommonsJdbcEventLogger logQueryParameters
INFO: [bind: 1->ID:203, 2->NAME:'X']
Sep 19, 2011 7:37:12 AM org.apache.cayenne.log.CommonsJdbcEventLogger logUpdateCount
INFO: === updated 1 row.
Sep 19, 2011 7:37:12 AM org.apache.cayenne.log.CommonsJdbcEventLogger logQuery
INFO: INSERT INTO CHILD (ID, MASTER_ID) VALUES (?, ?)
Sep 19, 2011 7:37:12 AM org.apache.cayenne.log.CommonsJdbcEventLogger logQueryParameters
INFO: [bind: 1->ID:201, 2->MASTER_ID:203]
Sep 19, 2011 7:37:12 AM org.apache.cayenne.log.CommonsJdbcEventLogger logUpdateCount
INFO: === updated 1 row.
Sep 19, 2011 7:37:12 AM org.apache.cayenne.log.CommonsJdbcEventLogger logQueryParameters
INFO: [bind: 1->ID:202, 2->MASTER_ID:NULL]
Sep 19, 2011 7:37:12 AM org.apache.cayenne.log.CommonsJdbcEventLogger logUpdateCount
INFO: === updated 1 row.
Sep 19, 2011 7:37:12 AM org.apache.cayenne.log.CommonsJdbcEventLogger logCommitTransaction
INFO: +++ transaction committed.
Sep 19, 2011 7:37:12 AM org.apache.cayenne.log.CommonsJdbcEventLogger logBeginTransaction
INFO: --- transaction started.
Sep 19, 2011 7:37:12 AM org.apache.cayenne.log.CommonsJdbcEventLogger logQuery
INFO: UPDATE CHILD SET MASTER_ID = ? WHERE ID = ?
Sep 19, 2011 7:37:12 AM org.apache.cayenne.log.CommonsJdbcEventLogger logQueryParameters
INFO: [bind: 1->MASTER_ID:203, 2->ID:202]
Sep 19, 2011 7:37:12 AM org.apache.cayenne.log.CommonsJdbcEventLogger logUpdateCount
INFO: === updated 1 row.
Sep 19, 2011 7:37:12 AM org.apache.cayenne.log.CommonsJdbcEventLogger logCommitTransaction
INFO: +++ transaction committed.
Sep 19, 2011 7:37:12 AM org.apache.cayenne.log.CommonsJdbcEventLogger logBeginTransaction
INFO: --- transaction started.
Sep 19, 2011 7:37:12 AM org.apache.cayenne.log.CommonsJdbcEventLogger logQuery
INFO: SELECT t0.MASTER_ID, t0.ID FROM CHILD t0 WHERE t0.MASTER_ID = ? [bind: 1->MASTER_ID:203]
Sep 19, 2011 7:37:12 AM org.apache.cayenne.log.CommonsJdbcEventLogger logSelectCount
INFO: === returned 2 rows. - took 0 ms.
Sep 19, 2011 7:37:12 AM org.apache.cayenne.log.CommonsJdbcEventLogger logCommitTransaction
INFO: +++ transaction committed.
Tests run: 3, Failures: 0, Errors: 0, Skipped: 0, Time elapsed: 0.984 sec
Running org.apache.cayenne.DataRowTest
Tests run: 2, Failures: 0, Errors: 0, Skipped: 0, Time elapsed: 0.002 sec
Running org.apache.cayenne.access.types.EnumTypeTest
Tests run: 7, Failures: 0, Errors: 0, Skipped: 0, Time elapsed: 0.003 sec
Results :
Failed tests:
testSelectNotLikeIgnoreCaseSingleWildcardMatch(org.apache.cayenne.query.SelectQueryTest)
testSelectLikeIgnoreCaseObjects1(org.apache.cayenne.query.SelectQueryTest)
Tests run: 2095, Failures: 2, Errors: 0, Skipped: 0
[INFO] ------------------------------------------------------------------------
[INFO] Reactor Summary:
[INFO]
[INFO] Cayenne ........................................... SUCCESS [0.166s]
[INFO] Common Unit Test Utilities ........................ SUCCESS [1.078s]
[INFO] Cayenne Internal Build Plugin ..................... SUCCESS [0.900s]
[INFO] Cayenne Internal Documentation Build Plugin ....... SUCCESS [1.278s]
[INFO] Cayenne Build Tools Parent ........................ SUCCESS [0.007s]
[INFO] Cayenne License and Notice Bundle ................. SUCCESS [0.554s]
[INFO] Cayenne Dependency Injection Container ............ SUCCESS [2.049s]
[INFO] Cayenne Java 1.5 Unpublished ...................... FAILURE [2:26.276s]
[INFO] Cayenne WebObjects Compatibility Library .......... SKIPPED
[INFO] Cayenne Aggregated Server Jar ..................... SKIPPED
[INFO] Cayenne Aggregated Client Jar ..................... SKIPPED
[INFO] Cayenne Project ................................... SKIPPED
[INFO] Cayenne Tools ..................................... SKIPPED
[INFO] Library: cayenne-lifecycle ........................ SKIPPED
[INFO] Cayenne Maven Plugin .............................. SKIPPED
[INFO] Cayenne Framework Aggregator Project .............. SKIPPED
[INFO] Cayenne Integration Tests Parent .................. SKIPPED
[INFO] Integration Tests - Cayenne Runtime ............... SKIPPED
[INFO] Integration Tests - Cayenne Tools ................. SKIPPED
[INFO] Cayenne Modeler ................................... SKIPPED
[INFO] Cayenne Modeler Maven Plugin ...................... SKIPPED
[INFO] Cayenne Modeler Parent ............................ SKIPPED
[INFO] Cayenne Tutorial .................................. SKIPPED
[INFO] Cayenne ROP Server Tutorial ....................... SKIPPED
[INFO] Cayenne ROP Client Tutorial ....................... SKIPPED
[INFO] Cayenne Tutorials ................................. SKIPPED
[INFO] Cayenne Documentation ............................. SKIPPED
[INFO] Cayenne Documenation Parent ....................... SKIPPED
[INFO] ------------------------------------------------------------------------
[INFO] BUILD FAILURE
[INFO] ------------------------------------------------------------------------
[INFO] Total time: 2:32.798s
[INFO] Finished at: Mon Sep 19 07:37:12 UTC 2011
[INFO] Final Memory: 45M/373M
[INFO] ------------------------------------------------------------------------
[ERROR] Failed to execute goal org.apache.maven.plugins:maven-surefire-plugin:2.5:test (default-test) on project cayenne-jdk1.5-unpublished: There are test failures.
[ERROR]
[ERROR] Please refer to /x1/jenkins/jenkins-slave/workspace/Cayenne-trunk/cayenneTestConnection/derby/collationCi/true/jdk/JDK 1.6 (latest)/label/Ubuntu/trunk/framework/cayenne-jdk1.5-unpublished/target/surefire-reports for the individual test results.
[ERROR] -> [Help 1]
org.apache.maven.lifecycle.LifecycleExecutionException: Failed to execute goal org.apache.maven.plugins:maven-surefire-plugin:2.5:test (default-test) on project cayenne-jdk1.5-unpublished: There are test failures.
Please refer to /x1/jenkins/jenkins-slave/workspace/Cayenne-trunk/cayenneTestConnection/derby/collationCi/true/jdk/JDK 1.6 (latest)/label/Ubuntu/trunk/framework/cayenne-jdk1.5-unpublished/target/surefire-reports for the individual test results.
at org.apache.maven.lifecycle.internal.MojoExecutor.execute(MojoExecutor.java:213)
at org.apache.maven.lifecycle.internal.MojoExecutor.execute(MojoExecutor.java:153)
at org.apache.maven.lifecycle.internal.MojoExecutor.execute(MojoExecutor.java:145)
at org.apache.maven.lifecycle.internal.LifecycleModuleBuilder.buildProject(LifecycleModuleBuilder.java:84)
at org.apache.maven.lifecycle.internal.LifecycleModuleBuilder.buildProject(LifecycleModuleBuilder.java:59)
at org.apache.maven.lifecycle.internal.LifecycleStarter.singleThreadedBuild(LifecycleStarter.java:183)
at org.apache.maven.lifecycle.internal.LifecycleStarter.execute(LifecycleStarter.java:161)
at org.apache.maven.DefaultMaven.doExecute(DefaultMaven.java:319)
at org.apache.maven.DefaultMaven.execute(DefaultMaven.java:156)
at org.apache.maven.cli.MavenCli.execute(MavenCli.java:534)
at org.apache.maven.cli.MavenCli.doMain(MavenCli.java:196)
at org.apache.maven.cli.MavenCli.main(MavenCli.java:141)
at sun.reflect.NativeMethodAccessorImpl.invoke0(Native Method)
at sun.reflect.NativeMethodAccessorImpl.invoke(NativeMethodAccessorImpl.java:39)
at sun.reflect.DelegatingMethodAccessorImpl.invoke(DelegatingMethodAccessorImpl.java:25)
at java.lang.reflect.Method.invoke(Method.java:597)
at org.codehaus.plexus.classworlds.launcher.Launcher.launchEnhanced(Launcher.java:290)
at org.codehaus.plexus.classworlds.launcher.Launcher.launch(Launcher.java:230)
at org.codehaus.plexus.classworlds.launcher.Launcher.mainWithExitCode(Launcher.java:409)
at org.codehaus.plexus.classworlds.launcher.Launcher.main(Launcher.java:352)
Caused by: org.apache.maven.plugin.MojoFailureException: There are test failures.
Please refer to /x1/jenkins/jenkins-slave/workspace/Cayenne-trunk/cayenneTestConnection/derby/collationCi/true/jdk/JDK 1.6 (latest)/label/Ubuntu/trunk/framework/cayenne-jdk1.5-unpublished/target/surefire-reports for the individual test results.
at org.apache.maven.plugin.surefire.SurefirePlugin.execute(SurefirePlugin.java:629)
at org.apache.maven.plugin.DefaultBuildPluginManager.executeMojo(DefaultBuildPluginManager.java:107)
at org.apache.maven.lifecycle.internal.MojoExecutor.execute(MojoExecutor.java:209)
... 19 more
[ERROR]
[ERROR] Re-run Maven using the -X switch to enable full debug logging.
[ERROR]
[ERROR] For more information about the errors and possible solutions, please read the following articles:
[ERROR] [Help 1] http://cwiki.apache.org/confluence/display/MAVEN/MojoFailureException
[ERROR]
[ERROR] After correcting the problems, you can resume the build with the command
[ERROR] mvn <goals> -rf :cayenne-jdk1.5-unpublished
Build step 'Invoke top-level Maven targets' marked build as failure
Archiving artifacts