You are viewing a plain text version of this content. The canonical link for it is here.
Posted to builds@solr.apache.org by Apache Jenkins Server <je...@builds.apache.org> on 2026/01/23 20:57:21 UTC
[JENKINS] Solr » Solr-Lint-10.x - Build # 99 - Still Failing!
Build: https://ci-builds.apache.org/job/Solr/job/Solr-Lint-10.x/99/
No tests ran.
Build Log:
[...truncated 1145 lines...]
BUILD FAILED in 10m 48s
629 actionable tasks: 629 executed
Publishing build scan...
https://develocity.apache.org/s/wnddys7pai73o
Build step 'Invoke Gradle script' changed build result to FAILURE
Build step 'Invoke Gradle script' marked build as failure
Email was triggered for: Failure - Any
Sending email for trigger: Failure - Any
[JENKINS] Solr » Solr-Lint-10.x - Build # 103 - Still Failing!
Posted by Apache Jenkins Server <je...@builds.apache.org>.
Build: https://ci-builds.apache.org/job/Solr/job/Solr-Lint-10.x/103/
No tests ran.
Build Log:
[...truncated 1145 lines...]
BUILD FAILED in 10m 13s
629 actionable tasks: 629 executed
Publishing Build Scan to Develocity...
https://develocity.apache.org/s/awrj33o63pro2
Build step 'Invoke Gradle script' changed build result to FAILURE
Build step 'Invoke Gradle script' marked build as failure
Email was triggered for: Failure - Any
Sending email for trigger: Failure - Any
[JENKINS] Solr » Solr-Lint-10.x - Build # 102 - Still Failing!
Posted by Apache Jenkins Server <je...@builds.apache.org>.
Build: https://ci-builds.apache.org/job/Solr/job/Solr-Lint-10.x/102/
No tests ran.
Build Log:
[...truncated 1145 lines...]
BUILD FAILED in 10m 50s
629 actionable tasks: 629 executed
Publishing Build Scan to Develocity...
https://develocity.apache.org/s/grc5imkoolmae
Build step 'Invoke Gradle script' changed build result to FAILURE
Build step 'Invoke Gradle script' marked build as failure
Email was triggered for: Failure - Any
Sending email for trigger: Failure - Any
[JENKINS] Solr » Solr-Lint-10.x - Build # 101 - Still Failing!
Posted by Apache Jenkins Server <je...@builds.apache.org>.
Build: https://ci-builds.apache.org/job/Solr/job/Solr-Lint-10.x/101/
No tests ran.
Build Log:
[...truncated 1146 lines...]
BUILD FAILED in 10m 36s
629 actionable tasks: 629 executed
Publishing Build Scan to Develocity...
https://develocity.apache.org/s/jago56kenww3c
Build step 'Invoke Gradle script' changed build result to FAILURE
Build step 'Invoke Gradle script' marked build as failure
Email was triggered for: Failure - Any
Sending email for trigger: Failure - Any
[JENKINS] Solr » Solr-Lint-10.x - Build # 100 - Still Failing!
Posted by Apache Jenkins Server <je...@builds.apache.org>.
Build: https://ci-builds.apache.org/job/Solr/job/Solr-Lint-10.x/100/
No tests ran.
Build Log:
[...truncated 1145 lines...]
BUILD FAILED in 10m 12s
629 actionable tasks: 629 executed
Publishing Build Scan to Develocity...
https://develocity.apache.org/s/bl23rbu3drcwo
Build step 'Invoke Gradle script' changed build result to FAILURE
Build step 'Invoke Gradle script' marked build as failure
Email was triggered for: Failure - Any
Sending email for trigger: Failure - Any