You are viewing a plain text version of this content. The canonical link for it is here.
Posted to builds@hbase.apache.org by ap...@apache.org on 2013/09/16 07:55:04 UTC

Build failed in Jenkins: hbase-0.96-hadoop2 #104

See <http://jenkins-public.iridiant.net/job/hbase-0.96-hadoop2/104/changes>

Changes:

[jxiang] HBASE-9547 Master could fail start if region server with system table is down

------------------------------------------
[...truncated 5444 lines...]
Tests run: 1, Failures: 0, Errors: 0, Skipped: 0, Time elapsed: 14.553 sec
Running org.apache.hadoop.hbase.filter.TestFilterWithScanLimits
Tests run: 1, Failures: 0, Errors: 0, Skipped: 0, Time elapsed: 14.706 sec
Running org.apache.hadoop.hbase.filter.TestColumnRangeFilter
Tests run: 1, Failures: 0, Errors: 0, Skipped: 0, Time elapsed: 22.046 sec
Running org.apache.hadoop.hbase.master.TestClusterStatusPublisher
Tests run: 3, Failures: 0, Errors: 0, Skipped: 0, Time elapsed: 1.065 sec
Running org.apache.hadoop.hbase.util.TestHBaseFsck
Tests run: 37, Failures: 0, Errors: 0, Skipped: 1, Time elapsed: 211.248 sec
Running org.apache.hadoop.hbase.filter.TestFuzzyRowAndColumnRangeFilter
Tests run: 1, Failures: 0, Errors: 0, Skipped: 0, Time elapsed: 16.057 sec
Running org.apache.hadoop.hbase.master.snapshot.TestSnapshotFileCache
Tests run: 4, Failures: 0, Errors: 0, Skipped: 0, Time elapsed: 8.104 sec
Running org.apache.hadoop.hbase.thrift2.TestThriftHBaseServiceHandler
Running org.apache.hadoop.hbase.master.TestMasterStatusServlet
Tests run: 4, Failures: 0, Errors: 0, Skipped: 0, Time elapsed: 4.6 sec
Tests run: 19, Failures: 0, Errors: 0, Skipped: 0, Time elapsed: 17.174 sec
Running org.apache.hadoop.hbase.master.TestOpenedRegionHandler
Tests run: 2, Failures: 0, Errors: 0, Skipped: 0, Time elapsed: 17.585 sec
Running org.apache.hadoop.hbase.master.TestMasterTransitions
Tests run: 3, Failures: 0, Errors: 0, Skipped: 3, Time elapsed: 20.721 sec
Running org.apache.hadoop.hbase.master.TestDeadServer
Tests run: 3, Failures: 0, Errors: 0, Skipped: 0, Time elapsed: 1.001 sec
Running org.apache.hadoop.hbase.master.TestZKBasedOpenCloseRegion
Tests run: 4, Failures: 0, Errors: 0, Skipped: 0, Time elapsed: 23.122 sec
Running org.apache.hadoop.hbase.master.TestAssignmentManagerOnCluster
Tests run: 11, Failures: 0, Errors: 0, Skipped: 0, Time elapsed: 36.018 sec
Running org.apache.hadoop.hbase.master.TestAssignmentManager
Tests run: 17, Failures: 0, Errors: 0, Skipped: 0, Time elapsed: 9.627 sec
Running org.apache.hadoop.hbase.master.TestMasterShutdown
Tests run: 2, Failures: 0, Errors: 0, Skipped: 0, Time elapsed: 25.498 sec
Running org.apache.hadoop.hbase.master.TestMaster
Tests run: 4, Failures: 0, Errors: 0, Skipped: 0, Time elapsed: 23.197 sec
Running org.apache.hadoop.hbase.master.handler.TestTableDeleteFamilyHandler
Tests run: 1, Failures: 0, Errors: 0, Skipped: 0, Time elapsed: 21.209 sec
Running org.apache.hadoop.hbase.master.handler.TestTableDescriptorModification
Tests run: 3, Failures: 0, Errors: 0, Skipped: 0, Time elapsed: 17.696 sec
Running org.apache.hadoop.hbase.master.handler.TestCreateTableHandler
Tests run: 3, Failures: 0, Errors: 0, Skipped: 0, Time elapsed: 33.75 sec
Running org.apache.hadoop.hbase.master.TestMasterRestartAfterDisablingTable
Tests run: 1, Failures: 0, Errors: 0, Skipped: 0, Time elapsed: 18.109 sec
Running org.apache.hadoop.hbase.master.TestRestartCluster
Tests run: 2, Failures: 0, Errors: 0, Skipped: 0, Time elapsed: 32.477 sec
Running org.apache.hadoop.hbase.master.TestMasterMetrics
Tests run: 2, Failures: 0, Errors: 0, Skipped: 0, Time elapsed: 28.462 sec
Running org.apache.hadoop.hbase.master.TestRegionPlacement
Tests run: 4, Failures: 0, Errors: 0, Skipped: 0, Time elapsed: 38.405 sec
Running org.apache.hadoop.hbase.master.cleaner.TestHFileCleaner
Tests run: 3, Failures: 0, Errors: 0, Skipped: 0, Time elapsed: 8.248 sec
Running org.apache.hadoop.hbase.master.cleaner.TestLogsCleaner
Tests run: 1, Failures: 0, Errors: 0, Skipped: 0, Time elapsed: 13.627 sec
Running org.apache.hadoop.hbase.master.TestMasterFailover
Tests run: 4, Failures: 0, Errors: 0, Skipped: 0, Time elapsed: 55.483 sec
Running org.apache.hadoop.hbase.master.TestHMasterRPCException
Tests run: 1, Failures: 0, Errors: 0, Skipped: 0, Time elapsed: 9.059 sec
Running org.apache.hadoop.hbase.master.TestMasterFailoverBalancerPersistence
Tests run: 1, Failures: 0, Errors: 0, Skipped: 0, Time elapsed: 21.101 sec
Running org.apache.hadoop.hbase.master.cleaner.TestSnapshotFromMaster
Tests run: 4, Failures: 0, Errors: 0, Skipped: 0, Time elapsed: 34.281 sec
Running org.apache.hadoop.hbase.client.TestAdmin
Tests run: 44, Failures: 0, Errors: 0, Skipped: 0, Time elapsed: 581.523 sec
Running org.apache.hadoop.hbase.master.TestMasterFileSystem
Tests run: 2, Failures: 0, Errors: 0, Skipped: 0, Time elapsed: 14.849 sec
Running org.apache.hadoop.hbase.master.TestMasterMetricsWrapper
Tests run: 1, Failures: 0, Errors: 0, Skipped: 0, Time elapsed: 16.937 sec
Running org.apache.hadoop.hbase.master.balancer.TestBaseLoadBalancer
Tests run: 3, Failures: 0, Errors: 0, Skipped: 0, Time elapsed: 2.572 sec
Running org.apache.hadoop.hbase.master.balancer.TestDefaultLoadBalancer
Tests run: 1, Failures: 0, Errors: 0, Skipped: 0, Time elapsed: 4.891 sec
Running org.apache.hadoop.hbase.master.TestTableLockManager
Tests run: 5, Failures: 0, Errors: 0, Skipped: 0, Time elapsed: 116.757 sec
Running org.apache.hadoop.hbase.master.TestRollingRestart
Tests run: 1, Failures: 0, Errors: 0, Skipped: 0, Time elapsed: 37.193 sec
Running org.apache.hadoop.hbase.master.TestActiveMasterManager
Tests run: 2, Failures: 0, Errors: 0, Skipped: 0, Time elapsed: 3.83 sec
Running org.apache.hadoop.hbase.master.TestMasterNoCluster
Tests run: 4, Failures: 0, Errors: 0, Skipped: 0, Time elapsed: 13.216 sec
Running org.apache.hadoop.hbase.security.access.TestAccessControlFilter
Tests run: 1, Failures: 0, Errors: 0, Skipped: 0, Time elapsed: 14.5 sec
Running org.apache.hadoop.hbase.master.TestSplitLogManager
Tests run: 14, Failures: 0, Errors: 0, Skipped: 0, Time elapsed: 87.303 sec
Running org.apache.hadoop.hbase.TestZooKeeper
Tests run: 10, Failures: 0, Errors: 0, Skipped: 0, Time elapsed: 42.293 sec
Running org.apache.hadoop.hbase.security.access.TestTablePermissions
Tests run: 7, Failures: 0, Errors: 0, Skipped: 0, Time elapsed: 31.281 sec
Running org.apache.hadoop.hbase.security.access.TestZKPermissionsWatcher
Tests run: 1, Failures: 0, Errors: 0, Skipped: 0, Time elapsed: 15.331 sec
Running org.apache.hadoop.hbase.security.token.TestTokenAuthentication
Tests run: 2, Failures: 0, Errors: 0, Skipped: 0, Time elapsed: 5.798 sec
Running org.apache.hadoop.hbase.security.token.TestZKSecretWatcher
Tests run: 1, Failures: 0, Errors: 0, Skipped: 0, Time elapsed: 18.109 sec
Running org.apache.hadoop.hbase.TestDrainingServer
Tests run: 2, Failures: 0, Errors: 0, Skipped: 0, Time elapsed: 20.861 sec
Running org.apache.hadoop.hbase.master.balancer.TestStochasticLoadBalancer
Tests run: 13, Failures: 0, Errors: 0, Skipped: 0, Time elapsed: 150.447 sec
Running org.apache.hadoop.hbase.security.access.TestAccessController
Tests run: 39, Failures: 0, Errors: 0, Skipped: 0, Time elapsed: 85.39 sec
Running org.apache.hadoop.hbase.TestMultiVersions
Tests run: 3, Failures: 0, Errors: 0, Skipped: 0, Time elapsed: 23.108 sec
Running org.apache.hadoop.hbase.master.TestDistributedLogSplitting
Running org.apache.hadoop.hbase.TestClusterBootOrder
Tests run: 2, Failures: 0, Errors: 0, Skipped: 0, Time elapsed: 34.856 sec
Running org.apache.hadoop.hbase.ipc.TestHBaseClient
Tests run: 1, Failures: 0, Errors: 0, Skipped: 0, Time elapsed: 1.772 sec
Tests run: 14, Failures: 0, Errors: 0, Skipped: 0, Time elapsed: 202.069 sec
Running org.apache.hadoop.hbase.ipc.TestProtoBufRpc
Tests run: 1, Failures: 0, Errors: 0, Skipped: 0, Time elapsed: 6.516 sec
Running org.apache.hadoop.hbase.catalog.TestCatalogTracker
Tests run: 7, Failures: 0, Errors: 0, Skipped: 0, Time elapsed: 5.178 sec
Running org.apache.hadoop.hbase.ipc.TestDelayedRpc
Tests run: 4, Failures: 0, Errors: 0, Skipped: 0, Time elapsed: 6.895 sec
Running org.apache.hadoop.hbase.catalog.TestMetaReaderEditorNoCluster
Tests run: 2, Failures: 0, Errors: 0, Skipped: 0, Time elapsed: 8.124 sec
Running org.apache.hadoop.hbase.TestFullLogReconstruction
Tests run: 1, Failures: 0, Errors: 0, Skipped: 0, Time elapsed: 41.948 sec
Running org.apache.hadoop.hbase.catalog.TestMetaReaderEditor
Tests run: 5, Failures: 0, Errors: 0, Skipped: 0, Time elapsed: 29.7 sec
Running org.apache.hadoop.hbase.catalog.TestMetaMigrationConvertingToPB
Tests run: 3, Failures: 0, Errors: 0, Skipped: 0, Time elapsed: 25.716 sec
Running org.apache.hadoop.hbase.TestNamespace
Tests run: 8, Failures: 0, Errors: 0, Skipped: 1, Time elapsed: 21.27 sec
Running org.apache.hadoop.hbase.TestIOFencing
Tests run: 2, Failures: 0, Errors: 0, Skipped: 0, Time elapsed: 97.383 sec

Results :

Failed tests:   testExceptionFromCoprocessorDuringPut(org.apache.hadoop.hbase.coprocessor.TestRegionServerCoprocessorExceptionWithAbort): The put should have failed, as the coprocessor is buggy
  testMultiCohortWithMemberTimeoutDuringPrepare(org.apache.hadoop.hbase.procedure.TestZKProcedure): (..)

Tests run: 1538, Failures: 2, Errors: 0, Skipped: 21

[JENKINS] Recording test results
[INFO] ------------------------------------------------------------------------
[INFO] Reactor Summary:
[INFO] 
[INFO] HBase ............................................. SUCCESS [16.725s]
[INFO] HBase - Common .................................... SUCCESS [41.038s]
[INFO] HBase - Protocol .................................. SUCCESS [20.992s]
[INFO] HBase - Client .................................... SUCCESS [30.112s]
[INFO] HBase - Hadoop Compatibility ...................... SUCCESS [5.672s]
[INFO] HBase - Hadoop Two Compatibility .................. SUCCESS [17.923s]
[INFO] HBase - Prefix Tree ............................... SUCCESS [5.407s]
[INFO] HBase - Server .................................... FAILURE [57:42.750s]
[INFO] HBase - Integration Tests ......................... SKIPPED
[INFO] HBase - Examples .................................. SKIPPED
[INFO] HBase - Assembly .................................. SKIPPED
[INFO] ------------------------------------------------------------------------
[INFO] BUILD FAILURE
[INFO] ------------------------------------------------------------------------
[INFO] Total time: 1:00:14.668s
[INFO] Finished at: Mon Sep 16 05:54:58 UTC 2013
[INFO] Final Memory: 44M/719M
[INFO] ------------------------------------------------------------------------
[JENKINS] Archiving <http://jenkins-public.iridiant.net/job/hbase-0.96-hadoop2/ws/hbase-hadoop2-compat/pom.xml> to /var/lib/jenkins/jobs/hbase-0.96-hadoop2/modules/org.apache.hbase$hbase-hadoop2-compat/builds/2013-09-16_04-54-39/archive/org.apache.hbase/hbase-hadoop2-compat/0.96.0/hbase-hadoop2-compat-0.96.0.pom
[JENKINS] Archiving <http://jenkins-public.iridiant.net/job/hbase-0.96-hadoop2/ws/hbase-common/pom.xml> to /var/lib/jenkins/jobs/hbase-0.96-hadoop2/modules/org.apache.hbase$hbase-common/builds/2013-09-16_04-54-39/archive/org.apache.hbase/hbase-common/0.96.0/hbase-common-0.96.0.pom
[JENKINS] Archiving <http://jenkins-public.iridiant.net/job/hbase-0.96-hadoop2/ws/hbase-hadoop-compat/pom.xml> to /var/lib/jenkins/jobs/hbase-0.96-hadoop2/modules/org.apache.hbase$hbase-hadoop-compat/builds/2013-09-16_04-54-39/archive/org.apache.hbase/hbase-hadoop-compat/0.96.0/hbase-hadoop-compat-0.96.0.pom
[JENKINS] Archiving <http://jenkins-public.iridiant.net/job/hbase-0.96-hadoop2/ws/hbase-examples/pom.xml> to /var/lib/jenkins/jobs/hbase-0.96-hadoop2/modules/org.apache.hbase$hbase-examples/builds/2013-09-16_04-54-39/archive/org.apache.hbase/hbase-examples/0.96.0/hbase-examples-0.96.0.pom
[JENKINS] Archiving <http://jenkins-public.iridiant.net/job/hbase-0.96-hadoop2/ws/hbase-it/pom.xml> to /var/lib/jenkins/jobs/hbase-0.96-hadoop2/modules/org.apache.hbase$hbase-it/builds/2013-09-16_04-54-39/archive/org.apache.hbase/hbase-it/0.96.0/hbase-it-0.96.0.pom
[JENKINS] Archiving <http://jenkins-public.iridiant.net/job/hbase-0.96-hadoop2/ws/pom.xml> to /var/lib/jenkins/jobs/hbase-0.96-hadoop2/modules/org.apache.hbase$hbase/builds/2013-09-16_04-54-38/archive/org.apache.hbase/hbase/0.96.0/hbase-0.96.0.pom
[JENKINS] Archiving <http://jenkins-public.iridiant.net/job/hbase-0.96-hadoop2/ws/hbase-assembly/pom.xml> to /var/lib/jenkins/jobs/hbase-0.96-hadoop2/modules/org.apache.hbase$hbase-assembly/builds/2013-09-16_04-54-39/archive/org.apache.hbase/hbase-assembly/0.96.0/hbase-assembly-0.96.0.pom
[JENKINS] Archiving <http://jenkins-public.iridiant.net/job/hbase-0.96-hadoop2/ws/hbase-client/pom.xml> to /var/lib/jenkins/jobs/hbase-0.96-hadoop2/modules/org.apache.hbase$hbase-client/builds/2013-09-16_04-54-39/archive/org.apache.hbase/hbase-client/0.96.0/hbase-client-0.96.0.pom
[JENKINS] Archiving <http://jenkins-public.iridiant.net/job/hbase-0.96-hadoop2/ws/hbase-prefix-tree/pom.xml> to /var/lib/jenkins/jobs/hbase-0.96-hadoop2/modules/org.apache.hbase$hbase-prefix-tree/builds/2013-09-16_04-54-39/archive/org.apache.hbase/hbase-prefix-tree/0.96.0/hbase-prefix-tree-0.96.0.pom
[JENKINS] Archiving <http://jenkins-public.iridiant.net/job/hbase-0.96-hadoop2/ws/hbase-protocol/pom.xml> to /var/lib/jenkins/jobs/hbase-0.96-hadoop2/modules/org.apache.hbase$hbase-protocol/builds/2013-09-16_04-54-39/archive/org.apache.hbase/hbase-protocol/0.96.0/hbase-protocol-0.96.0.pom
[JENKINS] Archiving <http://jenkins-public.iridiant.net/job/hbase-0.96-hadoop2/ws/hbase-server/pom.xml> to /var/lib/jenkins/jobs/hbase-0.96-hadoop2/modules/org.apache.hbase$hbase-server/builds/2013-09-16_04-54-38/archive/org.apache.hbase/hbase-server/0.96.0/hbase-server-0.96.0.pom
Waiting for Jenkins to finish collecting data
mavenExecutionResult exceptions not empty
message : Failed to execute goal org.apache.maven.plugins:maven-surefire-plugin:2.12-TRUNK-HBASE-2:test (secondPartTestsExecution) on project hbase-server: There are test failures.

Please refer to <http://jenkins-public.iridiant.net/job/hbase-0.96-hadoop2/ws/hbase-server/target/surefire-reports> for the individual test results.
cause : There are test failures.

Please refer to <http://jenkins-public.iridiant.net/job/hbase-0.96-hadoop2/ws/hbase-server/target/surefire-reports> for the individual test results.
Stack trace : 
org.apache.maven.lifecycle.LifecycleExecutionException: Failed to execute goal org.apache.maven.plugins:maven-surefire-plugin:2.12-TRUNK-HBASE-2:test (secondPartTestsExecution) on project hbase-server: There are test failures.

Please refer to <http://jenkins-public.iridiant.net/job/hbase-0.96-hadoop2/ws/hbase-server/target/surefire-reports> for the individual test results.
	at org.apache.maven.lifecycle.internal.MojoExecutor.execute(MojoExecutor.java:213)
	at org.apache.maven.lifecycle.internal.MojoExecutor.execute(MojoExecutor.java:153)
	at org.apache.maven.lifecycle.internal.MojoExecutor.execute(MojoExecutor.java:145)
	at org.apache.maven.lifecycle.internal.LifecycleModuleBuilder.buildProject(LifecycleModuleBuilder.java:84)
	at org.apache.maven.lifecycle.internal.LifecycleModuleBuilder.buildProject(LifecycleModuleBuilder.java:59)
	at org.apache.maven.lifecycle.internal.LifecycleStarter.singleThreadedBuild(LifecycleStarter.java:183)
	at org.apache.maven.lifecycle.internal.LifecycleStarter.execute(LifecycleStarter.java:161)
	at org.apache.maven.DefaultMaven.doExecute(DefaultMaven.java:320)
	at org.apache.maven.DefaultMaven.execute(DefaultMaven.java:156)
	at org.jvnet.hudson.maven3.launcher.Maven3Launcher.main(Maven3Launcher.java:79)
	at sun.reflect.NativeMethodAccessorImpl.invoke0(Native Method)
	at sun.reflect.NativeMethodAccessorImpl.invoke(NativeMethodAccessorImpl.java:39)
	at sun.reflect.DelegatingMethodAccessorImpl.invoke(DelegatingMethodAccessorImpl.java:25)
	at java.lang.reflect.Method.invoke(Method.java:597)
	at org.codehaus.plexus.classworlds.launcher.Launcher.launchStandard(Launcher.java:329)
	at org.codehaus.plexus.classworlds.launcher.Launcher.launch(Launcher.java:239)
	at org.jvnet.hudson.maven3.agent.Maven3Main.launch(Maven3Main.java:158)
	at hudson.maven.Maven3Builder.call(Maven3Builder.java:100)
	at hudson.maven.Maven3Builder.call(Maven3Builder.java:66)
	at hudson.remoting.UserRequest.perform(UserRequest.java:118)
	at hudson.remoting.UserRequest.perform(UserRequest.java:48)
	at hudson.remoting.Request$2.run(Request.java:326)
	at hudson.remoting.InterceptingExecutorService$1.call(InterceptingExecutorService.java:72)
	at java.util.concurrent.FutureTask$Sync.innerRun(FutureTask.java:303)
	at java.util.concurrent.FutureTask.run(FutureTask.java:138)
	at java.util.concurrent.ThreadPoolExecutor$Worker.runTask(ThreadPoolExecutor.java:895)
	at java.util.concurrent.ThreadPoolExecutor$Worker.run(ThreadPoolExecutor.java:918)
	at java.lang.Thread.run(Thread.java:662)
Caused by: org.apache.maven.plugin.MojoFailureException: There are test failures.

Please refer to <http://jenkins-public.iridiant.net/job/hbase-0.96-hadoop2/ws/hbase-server/target/surefire-reports> for the individual test results.
	at org.apache.maven.plugin.surefire.SurefireHelper.reportExecution(SurefireHelper.java:87)
	at org.apache.maven.plugin.surefire.SurefirePlugin.writeSummary(SurefirePlugin.java:651)
	at org.apache.maven.plugin.surefire.SurefirePlugin.handleSummary(SurefirePlugin.java:625)
	at org.apache.maven.plugin.surefire.AbstractSurefireMojo.executeAfterPreconditionsChecked(AbstractSurefireMojo.java:137)
	at org.apache.maven.plugin.surefire.AbstractSurefireMojo.execute(AbstractSurefireMojo.java:98)
	at org.apache.maven.plugin.DefaultBuildPluginManager.executeMojo(DefaultBuildPluginManager.java:101)
	at org.apache.maven.lifecycle.internal.MojoExecutor.execute(MojoExecutor.java:209)
	... 27 more
channel stopped
Performing Post build task...
Match found for :.* : True
Logical operation result is TRUE
Running script  :   ZOMBIE_TESTS_COUNT=`jps | grep surefirebooter | wc -l`
  if [[ $ZOMBIE_TESTS_COUNT != 0 ]] ; then
    ZOMBIE_TESTS_COUNT=`jps | grep surefirebooter | wc -l`
    if [[ $ZOMBIE_TESTS_COUNT != 0 ]] ; then
      echo "There are $ZOMBIE_TESTS_COUNT zombie tests, they should have been killed by surefire but survived"
      echo "************ BEGIN zombies jstack extract"
      ZB_STACK=`jps | grep surefirebooter | cut -d ' ' -f 1 | xargs -n 1 jstack | grep ".test" | grep "\.java"`
      jps | grep surefirebooter | cut -d ' ' -f 1 | xargs -n 1 jstack
      echo "************ END  zombies jstack extract"
      JIRA_COMMENT="$JIRA_COMMENT

     {color:red}-1 core zombie tests{color}.  There are ${ZOMBIE_TESTS_COUNT} zombie test(s): ${ZB_STACK}"
      BAD=1
      jps | grep surefirebooter | cut -d ' ' -f 1 | xargs kill -9
    else
      echo "We're ok: there is no zombie test, but some tests took some time to stop"
    fi
  else
    echo "We're ok: there is no zombie test"
  fi
[hbase-0.96-hadoop2] $ /bin/bash -xe /tmp/hudson5392752828834430396.sh
++ jps
++ grep surefirebooter
++ wc -l
+ ZOMBIE_TESTS_COUNT=0
+ [[ 0 != 0 ]]
+ echo 'We'\''re ok: there is no zombie test'
We're ok: there is no zombie test
POST BUILD TASK : SUCCESS
END OF POST BUILD TASK : 0

Jenkins build is back to normal : hbase-0.96-hadoop2 #105

Posted by ap...@apache.org.
See <http://jenkins-public.iridiant.net/job/hbase-0.96-hadoop2/105/changes>