You are viewing a plain text version of this content. The canonical link for it is here.
Posted to notifications@maven.apache.org by Apache Jenkins Server <je...@builds.apache.org> on 2021/08/15 11:47:19 UTC

Build unstable in Jenkins: Maven » Maven TLP » maven-dependency-plugin » mrm-1.3.0 #2

See https://ci-maven.apache.org/job/Maven/job/maven-box/job/maven-dependency-plugin/job/mrm-1.3.0/2/

Changes:

* add oss snapshot repo

7 tests failed.
FAILED:  org.apache.maven.plugins.dependency.TestGetMojo.linux-jdk8-m3.2.x_build / Build linux-jdk8-m3.2.x_build / testRemoteRepositoriesAuthentication

Stack Trace:
java.lang.NullPointerException
	at org.apache.maven.plugins.dependency.TestGetMojo.testRemoteRepositoriesAuthentication(TestGetMojo.java:133)


FAILED:  org.apache.maven.plugins.dependency.TestGetMojo.linux-jdk16-m3.6.x_build / Build linux-jdk16-m3.6.x_build / testRemoteRepositoriesAuthentication

Error Message:
Cannot invoke "org.eclipse.aether.graph.DependencyNode.accept(org.eclipse.aether.graph.DependencyVisitor)" because the return value of "org.eclipse.aether.resolution.DependencyResult.getRoot()" is null

Stack Trace:
java.lang.NullPointerException: Cannot invoke "org.eclipse.aether.graph.DependencyNode.accept(org.eclipse.aether.graph.DependencyVisitor)" because the return value of "org.eclipse.aether.resolution.DependencyResult.getRoot()" is null
	at org.apache.maven.plugins.dependency.TestGetMojo.testRemoteRepositoriesAuthentication(TestGetMojo.java:133)


FAILED:  org.apache.maven.plugins.dependency.TestGetMojo.linux-jdk11-m3.6.x_build / Build linux-jdk11-m3.6.x_build / testRemoteRepositoriesAuthentication

Stack Trace:
java.lang.NullPointerException
	at org.apache.maven.plugins.dependency.TestGetMojo.testRemoteRepositoriesAuthentication(TestGetMojo.java:133)


FAILED:  org.apache.maven.plugins.dependency.TestGetMojo.linux-jdk8-m3.6.x_build / Build linux-jdk8-m3.6.x_build / testRemoteRepositoriesAuthentication

Stack Trace:
java.lang.NullPointerException
	at org.apache.maven.plugins.dependency.TestGetMojo.testRemoteRepositoriesAuthentication(TestGetMojo.java:133)


FAILED:  org.apache.maven.plugins.dependency.TestGetMojo.linux-jdk8-m3.3.x_build / Build linux-jdk8-m3.3.x_build / testRemoteRepositoriesAuthentication

Stack Trace:
java.lang.NullPointerException
	at org.apache.maven.plugins.dependency.TestGetMojo.testRemoteRepositoriesAuthentication(TestGetMojo.java:133)


FAILED:  org.apache.maven.plugins.dependency.TestGetMojo.linux-jdk17-m3.6.x_build / Build linux-jdk17-m3.6.x_build / testRemoteRepositoriesAuthentication

Error Message:
Cannot invoke "org.eclipse.aether.graph.DependencyNode.accept(org.eclipse.aether.graph.DependencyVisitor)" because the return value of "org.eclipse.aether.resolution.DependencyResult.getRoot()" is null

Stack Trace:
java.lang.NullPointerException: Cannot invoke "org.eclipse.aether.graph.DependencyNode.accept(org.eclipse.aether.graph.DependencyVisitor)" because the return value of "org.eclipse.aether.resolution.DependencyResult.getRoot()" is null
	at org.apache.maven.plugins.dependency.TestGetMojo.testRemoteRepositoriesAuthentication(TestGetMojo.java:133)


FAILED:  org.apache.maven.plugins.dependency.TestGetMojo.linux-jdk8-m3.5.x_build / Build linux-jdk8-m3.5.x_build / testRemoteRepositoriesAuthentication

Stack Trace:
java.lang.NullPointerException
	at org.apache.maven.plugins.dependency.TestGetMojo.testRemoteRepositoriesAuthentication(TestGetMojo.java:133)




Build log:
[...truncated 18806 lines...]
[INFO] run post-build script verify.groovy
[INFO]           unpack-dependencies\pom.xml ...................... SUCCESS (8.8 s)
[INFO] Building: unpack-dependencies-with-filemappers\pom.xml
[INFO] run post-build script verify.bsh
[INFO]           unpack-cli\pom.xml ............................... SUCCESS (8.0 s)
[INFO] Building: unpack-custom-ear\pom.xml
[INFO] run post-build script verify.bsh
[INFO]           tree-verbose-multimodule\pom.xml ................. SUCCESS (7.9 s)
[INFO] Building: tree-verbose-small\pom.xml
[withMaven] Jenkins Task Scanner Plugin not found, don't display results of source code scanning for 'TODO' and 'FIXME' in pipeline screen.
[withMaven] invokerPublisher - Archive invoker results for Maven artifact MavenArtifact{org.apache.maven.plugins:maven-dependency-plugin:maven-plugin:3.2.1-SNAPSHOT(version: 3.2.1-SNAPSHOT, snapshot:false) } generated by PluginInvocation{org.apache.maven.plugins:maven-invoker-plugin:3.2.1@integration-test  integration-test}: windows-jdk11-m3.6.x_build\target\invoker-reports\*.xml
[INFO] run post-build script verify.bsh
[INFO]           tree-verbose-small\pom.xml ....................... SUCCESS (4.9 s)
[INFO] Building: unpack\pom.xml
[INFO] run post-build script verify.groovy
[INFO]           unpack-dependencies-with-filemappers\pom.xml ..... SUCCESS (8.8 s)
[INFO] Building: unpack-from-remote-repository\pom.xml
[INFO] run pre-build script setup.bsh
[INFO] run post-build script verify.groovy
[INFO]           unpack-custom-ear\pom.xml ........................ SUCCESS (8.2 s)
[INFO] Building: unpack-dependencies\pom.xml
[INFO] run post-build script verify.bsh
[INFO]           unpack\pom.xml ................................... SUCCESS (6.2 s)
[INFO] Building: unpack-cli\pom.xml
[INFO] artifact org.apache.maven.its.dependency.fake-remote-unpack:1.0: checking for updates from central
[INFO] run post-build script verify.bsh
[INFO]           unpack-from-remote-repository\pom.xml ............ SUCCESS (8.6 s)
[INFO] Building: used-dependencies\pom.xml
[INFO] run post-build script verify.bsh
[INFO]           unpack-cli\pom.xml ............................... SUCCESS (4.8 s)
[INFO] Building: unpack-custom-ear\pom.xml
[INFO] run post-build script verify.groovy
[INFO]           unpack-dependencies\pom.xml ...................... SUCCESS (9.1 s)
[INFO] Building: unpack-dependencies-with-filemappers\pom.xml
[INFO] run post-build script verify.groovy
[INFO]           unpack-custom-ear\pom.xml ........................ SUCCESS (5.2 s)
[INFO] Building: unpack-dependencies\pom.xml
[INFO]           used-dependencies\pom.xml ........................ SUCCESS (8.7 s)
[INFO] Building: purge-local-repository-without-pom
[INFO] run pre-build script setup.bsh
[INFO] run post-build script verify.groovy
[INFO]           unpack-dependencies-with-filemappers\pom.xml ..... SUCCESS (9.0 s)
[INFO] Building: unpack-from-remote-repository\pom.xml
[INFO] run pre-build script setup.bsh
[withMaven] Publishers: Generated Artifacts Publisher: 2581 ms, Junit Publisher: 15960 ms, Open Task Scanner Publisher: 11 ms, Invoker Publisher: 62242 ms
[Pipeline] // withMaven
[Pipeline] cleanWs
[WS-CLEANUP] Deleting project workspace...
[WS-CLEANUP] Deferred wipeout is used...
[WS-CLEANUP] done
[Pipeline] }
[Pipeline] // stage
[Pipeline] }
[Pipeline] // ws
[Pipeline] }
[Pipeline] // node
[Pipeline] }
[INFO] run post-build script verify.groovy
[INFO]           unpack-dependencies\pom.xml ...................... SUCCESS (6.6 s)
[INFO] Building: unpack-dependencies-with-filemappers\pom.xml
[INFO] run post-build script verify.groovy
[INFO]           purge-local-repository-without-pom ............... SUCCESS (7.6 s)
[INFO] 
[INFO] --- mrm-maven-plugin:1.3.0-SNAPSHOT:stop (default) @ maven-dependency-plugin ---
[INFO] Stopping Mock Repository Manager on http://localhost:49678
[INFO] Stopped ServerConnector@89c2ae6{HTTP/1.1, (http/1.1)}{0.0.0.0:0}
[INFO] Stopped o.e.j.s.ServletContextHandler@19ff7ac8{/,null,STOPPED}
[INFO] Mock Repository Manager http://localhost:49678 is stopped.
[INFO] 
[INFO] --- maven-checkstyle-plugin:3.0.0:check (checkstyle-check) @ maven-dependency-plugin ---
[INFO] There is 1 error reported by Checkstyle 6.18 with config/maven_checks.xml ruleset.
[INFO] Ignored 1 error, 0 violation remaining.
[INFO] 
[INFO] --- maven-invoker-plugin:3.2.1:verify (integration-test) @ maven-dependency-plugin ---
[INFO] -------------------------------------------------
[INFO] Build Summary:
[INFO]   Passed: 63, Failed: 0, Errors: 0, Skipped: 5
[INFO] -------------------------------------------------
[INFO] ------------------------------------------------------------------------
[INFO] BUILD SUCCESS
[INFO] ------------------------------------------------------------------------
[INFO] Total time: 10:21 min
[INFO] Finished at: 2021-08-15T11:45:26Z
[INFO] ------------------------------------------------------------------------
[INFO] [jenkins-event-spy] Generated F:\jenkins\jenkins-home\82467a7c\workspace\aven-dependency-plugin_mrm-1.3.0@2@tmp\withMaven93b15431\maven-spy-20210815-113500-3504316398174899249172.log
Picked up JAVA_TOOL_OPTIONS: -Dmaven.ext.class.path="f:\jenkins\jenkins-home\82467a7c\workspace\aven-dependency-plugin_mrm-1.3.0@2@tmp\withMaven93b15431\pipeline-maven-spy.jar" -Dorg.jenkinsci.plugins.pipeline.maven.reportsFolder="f:\jenkins\jenkins-home\82467a7c\workspace\aven-dependency-plugin_mrm-1.3.0@2@tmp\withMaven93b15431" 
[Pipeline] }
[Pipeline] // dir
[Pipeline] }
[withMaven] artifactsPublisher - Archive artifact windows-jdk8-m3.5.x_build\pom.xml under org\apache\maven\plugins\maven-dependency-plugin\3.2.1-SNAPSHOT\maven-dependency-plugin-3.2.1-SNAPSHOT.pom
[withMaven] artifactsPublisher - Archive artifact windows-jdk8-m3.5.x_build\target\maven-dependency-plugin-3.2.1-SNAPSHOT.jar under org\apache\maven\plugins\maven-dependency-plugin\3.2.1-SNAPSHOT\maven-dependency-plugin-3.2.1-SNAPSHOT.jar
[Fast Archiver] No prior successful build to compare, so performing full copy of artifacts
[withMaven] junitPublisher - Archive test results for Maven artifact org.apache.maven.plugins:maven-dependency-plugin:maven-plugin:3.2.1-SNAPSHOT generated by maven-surefire-plugin:test (default-test): windows-jdk8-m3.5.x_build\target\surefire-reports\*.xml
Recording test results
[INFO] artifact org.apache.maven.its.dependency.fake-remote-unpack:1.0: checking for updates from central
[INFO] run post-build script verify.bsh
[INFO]           unpack-from-remote-repository\pom.xml ............ SUCCESS (8.7 s)
[INFO] Building: used-dependencies\pom.xml
[withMaven] Jenkins Task Scanner Plugin not found, don't display results of source code scanning for 'TODO' and 'FIXME' in pipeline screen.
[withMaven] invokerPublisher - Archive invoker results for Maven artifact MavenArtifact{org.apache.maven.plugins:maven-dependency-plugin:maven-plugin:3.2.1-SNAPSHOT(version: 3.2.1-SNAPSHOT, snapshot:false) } generated by PluginInvocation{org.apache.maven.plugins:maven-invoker-plugin:3.2.1@integration-test  integration-test}: windows-jdk8-m3.5.x_build\target\invoker-reports\*.xml
[INFO] run post-build script verify.groovy
[INFO]           unpack-dependencies-with-filemappers\pom.xml ..... SUCCESS (8.7 s)
[INFO] Building: unpack-from-remote-repository\pom.xml
[INFO] run pre-build script setup.bsh
[INFO]           used-dependencies\pom.xml ........................ SUCCESS (8.7 s)
[INFO] Building: purge-local-repository-without-pom
[INFO] run pre-build script setup.bsh
[INFO] artifact org.apache.maven.its.dependency.fake-remote-unpack:1.0: checking for updates from central
[INFO] run post-build script verify.bsh
[INFO]           unpack-from-remote-repository\pom.xml ............ SUCCESS (6.5 s)
[INFO] Building: used-dependencies\pom.xml
[INFO]           used-dependencies\pom.xml ........................ SUCCESS (6.1 s)
[INFO] Building: purge-local-repository-without-pom
[INFO] run pre-build script setup.bsh
[INFO] run post-build script verify.groovy
[INFO]           purge-local-repository-without-pom ............... SUCCESS (7.9 s)
[INFO] 
[INFO] --- mrm-maven-plugin:1.3.0-SNAPSHOT:stop (default) @ maven-dependency-plugin ---
[INFO] Stopping Mock Repository Manager on http://localhost:63238
[INFO] Stopped ServerConnector@523ddf1b{HTTP/1.1, (http/1.1)}{0.0.0.0:0}
[INFO] Stopped o.e.j.s.ServletContextHandler@2dd7b78{/,null,STOPPED}
[INFO] Mock Repository Manager http://localhost:63238 is stopped.
[INFO] 
[INFO] --- maven-checkstyle-plugin:3.0.0:check (checkstyle-check) @ maven-dependency-plugin ---
[INFO] There is 1 error reported by Checkstyle 6.18 with config/maven_checks.xml ruleset.
[INFO] Ignored 1 error, 0 violation remaining.
[INFO] 
[INFO] --- maven-invoker-plugin:3.2.1:verify (integration-test) @ maven-dependency-plugin ---
[withMaven] Publishers: Generated Artifacts Publisher: 271 ms, Junit Publisher: 1698 ms, Open Task Scanner Publisher: 6 ms, Invoker Publisher: 17546 ms
[Pipeline] // withMaven
[Pipeline] cleanWs
[WS-CLEANUP] Deleting project workspace...
[WS-CLEANUP] Deferred wipeout is used...
[WS-CLEANUP] done
[Pipeline] }
[Pipeline] // stage
[Pipeline] }
[Pipeline] // ws
[Pipeline] }
[Pipeline] // node
[Pipeline] }
[INFO] -------------------------------------------------
[INFO] Build Summary:
[INFO]   Passed: 63, Failed: 0, Errors: 0, Skipped: 5
[INFO] -------------------------------------------------
[INFO] ------------------------------------------------------------------------
[INFO] BUILD SUCCESS
[INFO] ------------------------------------------------------------------------
[INFO] Total time: 10:39 min
[INFO] Finished at: 2021-08-15T11:45:47+00:00
[INFO] Final Memory: 68M/1254M
[INFO] ------------------------------------------------------------------------
[INFO] [jenkins-event-spy] Generated F:\jenkins\jenkins-home\82467a7c\workspace\aven-dependency-plugin_mrm-1.3.0@2@tmp\withMaven8a1ef855\maven-spy-20210815-113502-6558049205740280133273.log
Picked up JAVA_TOOL_OPTIONS: -Dmaven.ext.class.path="f:\jenkins\jenkins-home\82467a7c\workspace\aven-dependency-plugin_mrm-1.3.0@2@tmp\withMaven8a1ef855\pipeline-maven-spy.jar" -Dorg.jenkinsci.plugins.pipeline.maven.reportsFolder="f:\jenkins\jenkins-home\82467a7c\workspace\aven-dependency-plugin_mrm-1.3.0@2@tmp\withMaven8a1ef855" 
[Pipeline] }
[Pipeline] // dir
[Pipeline] }
[withMaven] artifactsPublisher - Archive artifact windows-jdk8-m3.3.x_build\pom.xml under org\apache\maven\plugins\maven-dependency-plugin\3.2.1-SNAPSHOT\maven-dependency-plugin-3.2.1-SNAPSHOT.pom
[withMaven] artifactsPublisher - Archive artifact windows-jdk8-m3.3.x_build\target\maven-dependency-plugin-3.2.1-SNAPSHOT.jar under org\apache\maven\plugins\maven-dependency-plugin\3.2.1-SNAPSHOT\maven-dependency-plugin-3.2.1-SNAPSHOT.jar
[Fast Archiver] No prior successful build to compare, so performing full copy of artifacts
[withMaven] junitPublisher - Archive test results for Maven artifact org.apache.maven.plugins:maven-dependency-plugin:maven-plugin:3.2.1-SNAPSHOT generated by maven-surefire-plugin:test (default-test): windows-jdk8-m3.3.x_build\target\surefire-reports\*.xml
Recording test results
[INFO] run post-build script verify.groovy
[INFO]           purge-local-repository-without-pom ............... SUCCESS (4.4 s)
[INFO] 
[INFO] --- mrm-maven-plugin:1.3.0-SNAPSHOT:stop (default) @ maven-dependency-plugin ---
[INFO] Stopping Mock Repository Manager on http://localhost:52796
[INFO] Stopped ServerConnector@2d800806{HTTP/1.1, (http/1.1)}{0.0.0.0:0}
[INFO] Stopped o.e.j.s.ServletContextHandler@5cbb147d{/,null,STOPPED}
[INFO] Mock Repository Manager http://localhost:52796 is stopped.
[INFO] 
[INFO] --- maven-checkstyle-plugin:3.0.0:check (checkstyle-check) @ maven-dependency-plugin ---
[withMaven] Jenkins Task Scanner Plugin not found, don't display results of source code scanning for 'TODO' and 'FIXME' in pipeline screen.
[withMaven] invokerPublisher - Archive invoker results for Maven artifact MavenArtifact{org.apache.maven.plugins:maven-dependency-plugin:maven-plugin:3.2.1-SNAPSHOT(version: 3.2.1-SNAPSHOT, snapshot:false) } generated by PluginInvocation{org.apache.maven.plugins:maven-invoker-plugin:3.2.1@integration-test  integration-test}: windows-jdk8-m3.3.x_build\target\invoker-reports\*.xml
[INFO] There is 1 error reported by Checkstyle 6.18 with config/maven_checks.xml ruleset.
[INFO] Ignored 1 error, 0 violation remaining.
[INFO] 
[INFO] --- maven-invoker-plugin:3.2.1:verify (integration-test) @ maven-dependency-plugin ---
[INFO] -------------------------------------------------
[INFO] Build Summary:
[INFO]   Passed: 68, Failed: 0, Errors: 0, Skipped: 0
[INFO] -------------------------------------------------
[INFO] ------------------------------------------------------------------------
[INFO] BUILD SUCCESS
[INFO] ------------------------------------------------------------------------
[INFO] Total time:  07:45 min
[INFO] Finished at: 2021-08-15T04:45:51-07:00
[INFO] ------------------------------------------------------------------------
[INFO] [jenkins-event-spy] Generated F:\jenkins\jenkins-slave\82467a7c\workspace\aven-dependency-plugin_mrm-1.3.0@2@tmp\withMavenb374364e\maven-spy-20210815-043805-32614411200196796506580.log
[Pipeline] }
[Pipeline] // dir
[Pipeline] }
[withMaven] artifactsPublisher - Archive artifact windows-jdk17-m3.6.x_build\pom.xml under org\apache\maven\plugins\maven-dependency-plugin\3.2.1-SNAPSHOT\maven-dependency-plugin-3.2.1-SNAPSHOT.pom
[withMaven] artifactsPublisher - Archive artifact windows-jdk17-m3.6.x_build\target\maven-dependency-plugin-3.2.1-SNAPSHOT.jar under org\apache\maven\plugins\maven-dependency-plugin\3.2.1-SNAPSHOT\maven-dependency-plugin-3.2.1-SNAPSHOT.jar
[Fast Archiver] No prior successful build to compare, so performing full copy of artifacts
[withMaven] junitPublisher - Archive test results for Maven artifact org.apache.maven.plugins:maven-dependency-plugin:maven-plugin:3.2.1-SNAPSHOT generated by maven-surefire-plugin:test (default-test): windows-jdk17-m3.6.x_build\target\surefire-reports\*.xml
Recording test results
[withMaven] Publishers: Generated Artifacts Publisher: 2416 ms, Junit Publisher: 15365 ms, Open Task Scanner Publisher: 1 ms, Invoker Publisher: 60687 ms
[Pipeline] // withMaven
[Pipeline] cleanWs
[WS-CLEANUP] Deleting project workspace...
[WS-CLEANUP] Deferred wipeout is used...
[WS-CLEANUP] done
[Pipeline] }
[Pipeline] // stage
[Pipeline] }
[Pipeline] // ws
[Pipeline] }
[Pipeline] // node
[Pipeline] }
[withMaven] Publishers: Generated Artifacts Publisher: 318 ms, Junit Publisher: 1808 ms, Open Task Scanner Publisher: 1 ms, Invoker Publisher: 24077 ms
[Pipeline] // withMaven
[Pipeline] cleanWs
[WS-CLEANUP] Deleting project workspace...
[WS-CLEANUP] Deferred wipeout is used...
[WS-CLEANUP] done
[Pipeline] }
[Pipeline] // stage
[Pipeline] }
[Pipeline] // ws
[Pipeline] }
[Pipeline] // node
[Pipeline] }
[withMaven] Jenkins Task Scanner Plugin not found, don't display results of source code scanning for 'TODO' and 'FIXME' in pipeline screen.
[withMaven] invokerPublisher - Archive invoker results for Maven artifact MavenArtifact{org.apache.maven.plugins:maven-dependency-plugin:maven-plugin:3.2.1-SNAPSHOT(version: 3.2.1-SNAPSHOT, snapshot:false) } generated by PluginInvocation{org.apache.maven.plugins:maven-invoker-plugin:3.2.1@integration-test  integration-test}: windows-jdk17-m3.6.x_build\target\invoker-reports\*.xml
[withMaven] Publishers: Generated Artifacts Publisher: 2532 ms, Junit Publisher: 17022 ms, Open Task Scanner Publisher: 1 ms, Invoker Publisher: 63315 ms
[Pipeline] // withMaven
[Pipeline] cleanWs
[WS-CLEANUP] Deleting project workspace...
[WS-CLEANUP] Deferred wipeout is used...
[WS-CLEANUP] done
[Pipeline] }
[Pipeline] // stage
[Pipeline] }
[Pipeline] // ws
[Pipeline] }
[Pipeline] // node
[Pipeline] }
[Pipeline] // parallel
[Pipeline] stage
[Pipeline] { (Notifications)
[Pipeline] echo
Build result: UNSTABLE
[Pipeline] jiraIssueSelector
[Pipeline] echo
The authors of changes [olamy].
[Pipeline] echo
Sending email ...
[Pipeline] emailext