You are viewing a plain text version of this content. The canonical link for it is here.
Posted to builds@solr.apache.org by Apache Jenkins Server <je...@builds.apache.org> on 2025/01/08 07:06:21 UTC

[JENKINS] Solr » Solr-reference-guide-9.x - Build # 1022 - Failure!

Build: https://ci-builds.apache.org/job/Solr/job/Solr-reference-guide-9.x/1022/

Log: 
Started by an SCM change
Running as SYSTEM
[EnvInject] - Loading node environment variables.
Building remotely on websites2 (git-websites svn-websites) in workspace /home/jenkins/712657a4/workspace/Solr/Solr-reference-guide-9.x
The recommended git tool is: NONE
No credentials specified
 > git rev-parse --resolve-git-dir /home/jenkins/712657a4/workspace/Solr/Solr-reference-guide-9.x/.git # timeout=10
Fetching changes from the remote Git repository
 > git config remote.origin.url https://gitbox.apache.org/repos/asf/solr.git # timeout=10
Cleaning workspace
 > git rev-parse --verify HEAD # timeout=10
Resetting working tree
 > git reset --hard # timeout=10
 > git clean -fdx # timeout=10
Fetching upstream changes from https://gitbox.apache.org/repos/asf/solr.git
 > git --version # timeout=10
 > git --version # 'git version 2.17.1'
 > git fetch --tags --progress -- https://gitbox.apache.org/repos/asf/solr.git +refs/heads/*:refs/remotes/origin/* # timeout=10
 > git rev-parse refs/remotes/origin/branch_9x^{commit} # timeout=10
Checking out Revision fa52b8b8c91e0d8f10f69259b482cf8849460b9c (refs/remotes/origin/branch_9x)
 > git config core.sparsecheckout # timeout=10
 > git checkout -f fa52b8b8c91e0d8f10f69259b482cf8849460b9c # timeout=10
Commit message: "SOLR-17588 : javabin must support primitive arrays (#2900)"
 > git rev-list --no-walk d040b2ae6ead52186648d45c83cee491c5669949 # timeout=10
No emails were triggered.
[Gradle] - Launching build.
[Solr-reference-guide-9.x] $ /home/jenkins/712657a4/workspace/Solr/Solr-reference-guide-9.x/gradlew checkSite
Downloading gradle-wrapper.jar from https://raw.githubusercontent.com/gradle/gradle/v8.10.2/gradle/wrapper/gradle-wrapper.jar
Generating gradle.properties
To honour the JVM settings for this build a single-use Daemon process will be forked. For more on this, please refer to https://docs.gradle.org/8.10/userguide/gradle_daemon.html#sec:disabling_the_daemon in the Gradle documentation.
Daemon will be stopped at the end of the build 

> Task :buildSrc:compileJava
Note: /home/jenkins/712657a4/workspace/Solr/Solr-reference-guide-9.x/buildSrc/src/main/java/org/apache/lucene/gradle/Checksum.java uses or overrides a deprecated API.
Note: Recompile with -Xlint:deprecation for details.

> Task :buildSrc:compileGroovy NO-SOURCE
> Task :buildSrc:processResources NO-SOURCE
> Task :buildSrc:classes
> Task :buildSrc:jar
> Task :checkJdkInternalsExportedToGradle
> Task :solr-missing-doclet:compileJava
> Task :solr-missing-doclet:processResources NO-SOURCE
> Task :solr-missing-doclet:classes
> Task :solr-missing-doclet:jar
> Task :solr:documentation:collectLuceneJavadocs
> Task :solr:api:compileJava
> Task :solr:api:renderSiteJavadoc
> Task :solr:api:processResources NO-SOURCE
> Task :solr:api:classes

> Task :solr:api:resolve
SLF4J(W): No SLF4J providers were found.
SLF4J(W): Defaulting to no-operation (NOP) logger implementation
SLF4J(W): See https://www.slf4j.org/codes.html#noProviders for further details.

> Task :solr:solrj:openApiGenerate
Cleaned up output directory /home/jenkins/712657a4/workspace/Solr/Solr-reference-guide-9.x/solr/solrj/build/generated/ before code generation (cleanupOutput set to true).
Multiple schemas found in the OAS 'content' section, returning only the first one (application/json)
Multiple schemas found in the OAS 'content' section, returning only the first one (application/json)
Multiple schemas found in the OAS 'content' section, returning only the first one (application/vnd.apache.solr.raw)
Multiple schemas found in the OAS 'content' section, returning only the first one (application/vnd.apache.solr.raw)
Multiple schemas found in the OAS 'content' section, returning only the first one (application/vnd.apache.solr.raw)
Multiple schemas found in the OAS 'content' section, returning only the first one (application/vnd.apache.solr.raw)
################################################################################
# Thanks for using OpenAPI Generator.                                          #
# Please consider donation to help us maintain this project 🙏                 #
# https://opencollective.com/openapi_generator/donate                          #
################################################################################
Successfully generated code to /home/jenkins/712657a4/workspace/Solr/Solr-reference-guide-9.x/solr/solrj/build/generated/

> Task :spotlessInternalRegisterDependencies
> Task :solr:solrj:generatedSpotlessHelper
> Task :solr:solrj:generatedSpotless

> Task :solr:solrj:compileJava FAILED
/home/jenkins/712657a4/workspace/Solr/Solr-reference-guide-9.x/solr/solrj/src/java/org/apache/solr/common/util/JavaBinCodec.java:444: error: ')' expected
    if (val instanceof float[] ff) {
                              ^
/home/jenkins/712657a4/workspace/Solr/Solr-reference-guide-9.x/solr/solrj/src/java/org/apache/solr/common/util/JavaBinCodec.java:444: error: not a statement
    if (val instanceof float[] ff) {
                               ^
/home/jenkins/712657a4/workspace/Solr/Solr-reference-guide-9.x/solr/solrj/src/java/org/apache/solr/common/util/JavaBinCodec.java:444: error: ';' expected
    if (val instanceof float[] ff) {
                                 ^
/home/jenkins/712657a4/workspace/Solr/Solr-reference-guide-9.x/solr/solrj/src/java/org/apache/solr/common/util/JavaBinCodec.java:448: error: ')' expected
    if (val instanceof int[] ii) {
                            ^
/home/jenkins/712657a4/workspace/Solr/Solr-reference-guide-9.x/solr/solrj/src/java/org/apache/solr/common/util/JavaBinCodec.java:448: error: not a statement
    if (val instanceof int[] ii) {
                             ^
/home/jenkins/712657a4/workspace/Solr/Solr-reference-guide-9.x/solr/solrj/src/java/org/apache/solr/common/util/JavaBinCodec.java:448: error: ';' expected
    if (val instanceof int[] ii) {
                               ^
/home/jenkins/712657a4/workspace/Solr/Solr-reference-guide-9.x/solr/solrj/src/java/org/apache/solr/common/util/JavaBinCodec.java:452: error: ')' expected
    if (val instanceof long[] ll) {
                             ^
/home/jenkins/712657a4/workspace/Solr/Solr-reference-guide-9.x/solr/solrj/src/java/org/apache/solr/common/util/JavaBinCodec.java:452: error: not a statement
    if (val instanceof long[] ll) {
                              ^
/home/jenkins/712657a4/workspace/Solr/Solr-reference-guide-9.x/solr/solrj/src/java/org/apache/solr/common/util/JavaBinCodec.java:452: error: ';' expected
    if (val instanceof long[] ll) {
                                ^
/home/jenkins/712657a4/workspace/Solr/Solr-reference-guide-9.x/solr/solrj/src/java/org/apache/solr/common/util/JavaBinCodec.java:456: error: ')' expected
    if (val instanceof double[] dd) {
                               ^
/home/jenkins/712657a4/workspace/Solr/Solr-reference-guide-9.x/solr/solrj/src/java/org/apache/solr/common/util/JavaBinCodec.java:456: error: not a statement
    if (val instanceof double[] dd) {
                                ^
/home/jenkins/712657a4/workspace/Solr/Solr-reference-guide-9.x/solr/solrj/src/java/org/apache/solr/common/util/JavaBinCodec.java:456: error: ';' expected
    if (val instanceof double[] dd) {
                                  ^
/home/jenkins/712657a4/workspace/Solr/Solr-reference-guide-9.x/solr/solrj/src/java/org/apache/solr/common/util/JavaBinCodec.java:460: error: ')' expected
    if (val instanceof short[] ss) {
                              ^
/home/jenkins/712657a4/workspace/Solr/Solr-reference-guide-9.x/solr/solrj/src/java/org/apache/solr/common/util/JavaBinCodec.java:460: error: not a statement
    if (val instanceof short[] ss) {
                               ^
/home/jenkins/712657a4/workspace/Solr/Solr-reference-guide-9.x/solr/solrj/src/java/org/apache/solr/common/util/JavaBinCodec.java:460: error: ';' expected
    if (val instanceof short[] ss) {
                                 ^
/home/jenkins/712657a4/workspace/Solr/Solr-reference-guide-9.x/solr/solrj/src/java/org/apache/solr/common/util/JavaBinCodec.java:464: error: ')' expected
    if (val instanceof boolean[] bb) {
                                ^
/home/jenkins/712657a4/workspace/Solr/Solr-reference-guide-9.x/solr/solrj/src/java/org/apache/solr/common/util/JavaBinCodec.java:464: error: not a statement
    if (val instanceof boolean[] bb) {
                                 ^
/home/jenkins/712657a4/workspace/Solr/Solr-reference-guide-9.x/solr/solrj/src/java/org/apache/solr/common/util/JavaBinCodec.java:464: error: ';' expected
    if (val instanceof boolean[] bb) {
                                   ^
18 errors

> Task :solr:documentation:changesToHtml

FAILURE: Build failed with an exception.

* What went wrong:
Execution failed for task ':solr:solrj:compileJava'.
> Compilation failed; see the compiler error output for details.

* Try:
> Run with --info option to get more log output.

BUILD FAILED in 50s
15 actionable tasks: 15 executed

Publishing build scan...
https://ge.apache.org/s/xq3iexbtw2z3e

Build step 'Invoke Gradle script' changed build result to FAILURE
Build step 'Invoke Gradle script' marked build as failure
SSH: Current build result is [FAILURE], not going to run.
Email was triggered for: Failure - Any
Sending email for trigger: Failure - Any