You are viewing a plain text version of this content. The canonical link for it is here.
Posted to commits@activemq.apache.org by Apache Jenkins Server <je...@builds.apache.org> on 2014/07/14 08:10:25 UTC
Build failed in Jenkins: ActiveMQ-Java7 #385
See <https://builds.apache.org/job/ActiveMQ-Java7/385/>
------------------------------------------
[...truncated 8173 lines...]
[JENKINS] Archiving <https://builds.apache.org/job/ActiveMQ-Java7/ws/activemq-mqtt/pom.xml> to org.apache.activemq/activemq-mqtt/5.11-SNAPSHOT/activemq-mqtt-5.11-SNAPSHOT.pom
[JENKINS] Archiving <https://builds.apache.org/job/ActiveMQ-Java7/ws/activemq-mqtt/target/activemq-mqtt-5.11-SNAPSHOT.jar> to org.apache.activemq/activemq-mqtt/5.11-SNAPSHOT/activemq-mqtt-5.11-SNAPSHOT.jar
[JENKINS] Archiving <https://builds.apache.org/job/ActiveMQ-Java7/ws/activemq-mqtt/target/activemq-mqtt-5.11-SNAPSHOT-sources.jar> to org.apache.activemq/activemq-mqtt/5.11-SNAPSHOT/activemq-mqtt-5.11-SNAPSHOT-sources.jar
Sending artifact delta relative to ActiveMQ-Java7 ? ActiveMQ :: MQTT Protocol #384
Archived 3 artifacts
Archive block size is 32768
Received 0 blocks and 125849 bytes
Compression is 0.0%
Took 1.7 sec
[JENKINS] Archiving <https://builds.apache.org/job/ActiveMQ-Java7/ws/activemq-shiro/pom.xml> to org.apache.activemq/activemq-shiro/5.11-SNAPSHOT/activemq-shiro-5.11-SNAPSHOT.pom
[JENKINS] Archiving <https://builds.apache.org/job/ActiveMQ-Java7/ws/activemq-shiro/target/activemq-shiro-5.11-SNAPSHOT.jar> to org.apache.activemq/activemq-shiro/5.11-SNAPSHOT/activemq-shiro-5.11-SNAPSHOT.jar
[JENKINS] Archiving <https://builds.apache.org/job/ActiveMQ-Java7/ws/activemq-shiro/target/activemq-shiro-5.11-SNAPSHOT-sources.jar> to org.apache.activemq/activemq-shiro/5.11-SNAPSHOT/activemq-shiro-5.11-SNAPSHOT-sources.jar
Sending artifact delta relative to ActiveMQ-Java7 ? ActiveMQ :: Shiro #384
Archived 3 artifacts
Archive block size is 32768
Received 0 blocks and 98808 bytes
Compression is 0.0%
Took 0.18 sec
[JENKINS] Archiving <https://builds.apache.org/job/ActiveMQ-Java7/ws/activemq-console/pom.xml> to org.apache.activemq/activemq-console/5.11-SNAPSHOT/activemq-console-5.11-SNAPSHOT.pom
[JENKINS] Archiving <https://builds.apache.org/job/ActiveMQ-Java7/ws/activemq-console/target/activemq-console-5.11-SNAPSHOT.jar> to org.apache.activemq/activemq-console/5.11-SNAPSHOT/activemq-console-5.11-SNAPSHOT.jar
[JENKINS] Archiving <https://builds.apache.org/job/ActiveMQ-Java7/ws/activemq-console/target/activemq-console-5.11-SNAPSHOT-sources.jar> to org.apache.activemq/activemq-console/5.11-SNAPSHOT/activemq-console-5.11-SNAPSHOT-sources.jar
Sending artifact delta relative to ActiveMQ-Java7 ? ActiveMQ :: Console #384
Archived 3 artifacts
Archive block size is 32768
Received 0 blocks and 325024 bytes
Compression is 0.0%
Took 0.19 sec
[JENKINS] Archiving <https://builds.apache.org/job/ActiveMQ-Java7/ws/activemq-camel/pom.xml> to org.apache.activemq/activemq-camel/5.11-SNAPSHOT/activemq-camel-5.11-SNAPSHOT.pom
[JENKINS] Archiving <https://builds.apache.org/job/ActiveMQ-Java7/ws/activemq-camel/target/activemq-camel-5.11-SNAPSHOT.jar> to org.apache.activemq/activemq-camel/5.11-SNAPSHOT/activemq-camel-5.11-SNAPSHOT.jar
[JENKINS] Archiving <https://builds.apache.org/job/ActiveMQ-Java7/ws/activemq-camel/target/activemq-camel-5.11-SNAPSHOT-sources.jar> to org.apache.activemq/activemq-camel/5.11-SNAPSHOT/activemq-camel-5.11-SNAPSHOT-sources.jar
Sending artifact delta relative to ActiveMQ-Java7 ? ActiveMQ :: Camel #384
Archived 3 artifacts
Archive block size is 32768
Received 0 blocks and 98940 bytes
Compression is 0.0%
Took 0.16 sec
[JENKINS] Archiving <https://builds.apache.org/job/ActiveMQ-Java7/ws/activemq-blueprint/pom.xml> to org.apache.activemq/activemq-blueprint/5.11-SNAPSHOT/activemq-blueprint-5.11-SNAPSHOT.pom
[JENKINS] Archiving <https://builds.apache.org/job/ActiveMQ-Java7/ws/activemq-blueprint/target/activemq-blueprint-5.11-SNAPSHOT.jar> to org.apache.activemq/activemq-blueprint/5.11-SNAPSHOT/activemq-blueprint-5.11-SNAPSHOT.jar
[JENKINS] Archiving <https://builds.apache.org/job/ActiveMQ-Java7/ws/activemq-blueprint/target/activemq-blueprint-5.11-SNAPSHOT-sources.jar> to org.apache.activemq/activemq-blueprint/5.11-SNAPSHOT/activemq-blueprint-5.11-SNAPSHOT-sources.jar
Sending artifact delta relative to ActiveMQ-Java7 ? ActiveMQ :: Blueprint #384
Archived 3 artifacts
Archive block size is 32768
Received 0 blocks and 18127 bytes
Compression is 0.0%
Took 0.17 sec
[JENKINS] Archiving <https://builds.apache.org/job/ActiveMQ-Java7/ws/activemq-client/pom.xml> to org.apache.activemq/activemq-client/5.11-SNAPSHOT/activemq-client-5.11-SNAPSHOT.pom
[JENKINS] Archiving <https://builds.apache.org/job/ActiveMQ-Java7/ws/activemq-client/target/activemq-client-5.11-SNAPSHOT.jar> to org.apache.activemq/activemq-client/5.11-SNAPSHOT/activemq-client-5.11-SNAPSHOT.jar
[JENKINS] Archiving <https://builds.apache.org/job/ActiveMQ-Java7/ws/activemq-client/target/activemq-client-5.11-SNAPSHOT-sources.jar> to org.apache.activemq/activemq-client/5.11-SNAPSHOT/activemq-client-5.11-SNAPSHOT-sources.jar
Sending artifact delta relative to ActiveMQ-Java7 ? ActiveMQ :: Client #384
Archived 3 artifacts
Archive block size is 32768
Received 0 blocks and 2210594 bytes
Compression is 0.0%
Took 2.5 sec
[JENKINS] Archiving <https://builds.apache.org/job/ActiveMQ-Java7/ws/pom.xml> to org.apache.activemq/activemq-parent/5.11-SNAPSHOT/activemq-parent-5.11-SNAPSHOT.pom
Sending artifact delta relative to ActiveMQ-Java7 ? ActiveMQ #384
Archived 1 artifacts
Archive block size is 32768
Received 1 blocks and 25917 bytes
Compression is 55.8%
Took 0.14 sec
[JENKINS] Archiving <https://builds.apache.org/job/ActiveMQ-Java7/ws/activemq-karaf-itest/pom.xml> to org.apache.activemq/activemq-karaf-itest/5.11-SNAPSHOT/activemq-karaf-itest-5.11-SNAPSHOT.pom
[JENKINS] Archiving <https://builds.apache.org/job/ActiveMQ-Java7/ws/activemq-karaf-itest/target/activemq-karaf-itest-5.11-SNAPSHOT.jar> to org.apache.activemq/activemq-karaf-itest/5.11-SNAPSHOT/activemq-karaf-itest-5.11-SNAPSHOT.jar
[JENKINS] Archiving <https://builds.apache.org/job/ActiveMQ-Java7/ws/activemq-karaf-itest/target/activemq-karaf-itest-5.11-SNAPSHOT-sources.jar> to org.apache.activemq/activemq-karaf-itest/5.11-SNAPSHOT/activemq-karaf-itest-5.11-SNAPSHOT-sources.jar
Sending artifact delta relative to ActiveMQ-Java7 ? ActiveMQ :: Karaf Integration Tests #384
Archived 3 artifacts
Archive block size is 32768
Received 0 blocks and 28159 bytes
Compression is 0.0%
Took 0.14 sec
[JENKINS] Archiving <https://builds.apache.org/job/ActiveMQ-Java7/ws/activemq-broker/pom.xml> to org.apache.activemq/activemq-broker/5.11-SNAPSHOT/activemq-broker-5.11-SNAPSHOT.pom
[JENKINS] Archiving <https://builds.apache.org/job/ActiveMQ-Java7/ws/activemq-broker/target/activemq-broker-5.11-SNAPSHOT.jar> to org.apache.activemq/activemq-broker/5.11-SNAPSHOT/activemq-broker-5.11-SNAPSHOT.jar
[JENKINS] Archiving <https://builds.apache.org/job/ActiveMQ-Java7/ws/activemq-broker/target/activemq-broker-5.11-SNAPSHOT-tests.jar> to org.apache.activemq/activemq-broker/5.11-SNAPSHOT/activemq-broker-5.11-SNAPSHOT-tests.jar
[JENKINS] Archiving <https://builds.apache.org/job/ActiveMQ-Java7/ws/activemq-broker/target/activemq-broker-5.11-SNAPSHOT-sources.jar> to org.apache.activemq/activemq-broker/5.11-SNAPSHOT/activemq-broker-5.11-SNAPSHOT-sources.jar
Sending artifact delta relative to ActiveMQ-Java7 ? ActiveMQ :: Broker #384
Archived 4 artifacts
Archive block size is 32768
Received 0 blocks and 1904669 bytes
Compression is 0.0%
Took 2.1 sec
[JENKINS] Archiving <https://builds.apache.org/job/ActiveMQ-Java7/ws/activemq-ra/pom.xml> to org.apache.activemq/activemq-ra/5.11-SNAPSHOT/activemq-ra-5.11-SNAPSHOT.pom
[JENKINS] Archiving <https://builds.apache.org/job/ActiveMQ-Java7/ws/activemq-ra/target/activemq-ra-5.11-SNAPSHOT.jar> to org.apache.activemq/activemq-ra/5.11-SNAPSHOT/activemq-ra-5.11-SNAPSHOT.jar
[JENKINS] Archiving <https://builds.apache.org/job/ActiveMQ-Java7/ws/activemq-ra/target/xbean/activemq-ra.xsd> to org.apache.activemq/activemq-ra/5.11-SNAPSHOT/activemq-ra-5.11-SNAPSHOT.xsd
[JENKINS] Archiving <https://builds.apache.org/job/ActiveMQ-Java7/ws/activemq-ra/target/xbean/activemq-ra.xsd.html> to org.apache.activemq/activemq-ra/5.11-SNAPSHOT/activemq-ra-5.11-SNAPSHOT-schema.html
[JENKINS] Archiving <https://builds.apache.org/job/ActiveMQ-Java7/ws/activemq-ra/target/xbean/activemq-ra.xsd.html> to org.apache.activemq/activemq-ra/5.11-SNAPSHOT/activemq-ra-5.11-SNAPSHOT.xsd.html
[JENKINS] Archiving <https://builds.apache.org/job/ActiveMQ-Java7/ws/activemq-ra/target/activemq-ra-5.11-SNAPSHOT-sources.jar> to org.apache.activemq/activemq-ra/5.11-SNAPSHOT/activemq-ra-5.11-SNAPSHOT-sources.jar
Sending artifact delta relative to ActiveMQ-Java7 ? ActiveMQ :: RA #384
Archived 6 artifacts
Archive block size is 32768
Received 0 blocks and 185226 bytes
Compression is 0.0%
Took 0.22 sec
[JENKINS] Archiving <https://builds.apache.org/job/ActiveMQ-Java7/ws/activemq-spring/pom.xml> to org.apache.activemq/activemq-spring/5.11-SNAPSHOT/activemq-spring-5.11-SNAPSHOT.pom
[JENKINS] Archiving <https://builds.apache.org/job/ActiveMQ-Java7/ws/activemq-spring/target/activemq-spring-5.11-SNAPSHOT.jar> to org.apache.activemq/activemq-spring/5.11-SNAPSHOT/activemq-spring-5.11-SNAPSHOT.jar
[JENKINS] Archiving <https://builds.apache.org/job/ActiveMQ-Java7/ws/activemq-spring/target/classes/activemq.xsd> to org.apache.activemq/activemq-spring/5.11-SNAPSHOT/activemq-spring-5.11-SNAPSHOT.xsd
[JENKINS] Archiving <https://builds.apache.org/job/ActiveMQ-Java7/ws/activemq-spring/target/classes/activemq.xsd.html> to org.apache.activemq/activemq-spring/5.11-SNAPSHOT/activemq-spring-5.11-SNAPSHOT-schema.html
[JENKINS] Archiving <https://builds.apache.org/job/ActiveMQ-Java7/ws/activemq-spring/target/activemq-spring-5.11-SNAPSHOT-sources.jar> to org.apache.activemq/activemq-spring/5.11-SNAPSHOT/activemq-spring-5.11-SNAPSHOT-sources.jar
Sending artifact delta relative to ActiveMQ-Java7 ? ActiveMQ :: Spring #384
Archived 5 artifacts
Archive block size is 32768
Received 21 blocks and 381221 bytes
Compression is 64.4%
Took 2 sec
[JENKINS] Archiving <https://builds.apache.org/job/ActiveMQ-Java7/ws/activemq-all/dependency-reduced-pom.xml> to org.apache.activemq/activemq-all/5.11-SNAPSHOT/activemq-all-5.11-SNAPSHOT.pom
[JENKINS] Archiving <https://builds.apache.org/job/ActiveMQ-Java7/ws/activemq-all/target/activemq-all-5.11-SNAPSHOT.jar> to org.apache.activemq/activemq-all/5.11-SNAPSHOT/activemq-all-5.11-SNAPSHOT.jar
[JENKINS] Archiving <https://builds.apache.org/job/ActiveMQ-Java7/ws/activemq-all/target/activemq-all-5.11-SNAPSHOT-sources.jar> to org.apache.activemq/activemq-all/5.11-SNAPSHOT/activemq-all-5.11-SNAPSHOT-sources.jar
Sending artifact delta relative to ActiveMQ-Java7 ? ActiveMQ :: All JAR bundle #384
Archived 3 artifacts
Archive block size is 32768
Received 1 blocks and 6317331 bytes
Compression is 0.5%
Took 2.9 sec
[JENKINS] Archiving <https://builds.apache.org/job/ActiveMQ-Java7/ws/activemq-kahadb-store/pom.xml> to org.apache.activemq/activemq-kahadb-store/5.11-SNAPSHOT/activemq-kahadb-store-5.11-SNAPSHOT.pom
[JENKINS] Archiving <https://builds.apache.org/job/ActiveMQ-Java7/ws/activemq-kahadb-store/target/activemq-kahadb-store-5.11-SNAPSHOT.jar> to org.apache.activemq/activemq-kahadb-store/5.11-SNAPSHOT/activemq-kahadb-store-5.11-SNAPSHOT.jar
[JENKINS] Archiving <https://builds.apache.org/job/ActiveMQ-Java7/ws/activemq-kahadb-store/target/activemq-kahadb-store-5.11-SNAPSHOT-sources.jar> to org.apache.activemq/activemq-kahadb-store/5.11-SNAPSHOT/activemq-kahadb-store-5.11-SNAPSHOT-sources.jar
Sending artifact delta relative to ActiveMQ-Java7 ? ActiveMQ :: KahaDB Store #384
Archived 3 artifacts
Archive block size is 32768
Received 0 blocks and 887613 bytes
Compression is 0.0%
Took 0.36 sec
[JENKINS] Archiving <https://builds.apache.org/job/ActiveMQ-Java7/ws/activemq-jaas/pom.xml> to org.apache.activemq/activemq-jaas/5.11-SNAPSHOT/activemq-jaas-5.11-SNAPSHOT.pom
[JENKINS] Archiving <https://builds.apache.org/job/ActiveMQ-Java7/ws/activemq-jaas/target/activemq-jaas-5.11-SNAPSHOT.jar> to org.apache.activemq/activemq-jaas/5.11-SNAPSHOT/activemq-jaas-5.11-SNAPSHOT.jar
[JENKINS] Archiving <https://builds.apache.org/job/ActiveMQ-Java7/ws/activemq-jaas/target/activemq-jaas-5.11-SNAPSHOT-sources.jar> to org.apache.activemq/activemq-jaas/5.11-SNAPSHOT/activemq-jaas-5.11-SNAPSHOT-sources.jar
Sending artifact delta relative to ActiveMQ-Java7 ? ActiveMQ :: JAAS #384
Archived 3 artifacts
Archive block size is 32768
Received 0 blocks and 64183 bytes
Compression is 0.0%
Took 0.1 sec
[JENKINS] Archiving <https://builds.apache.org/job/ActiveMQ-Java7/ws/activemq-tooling/pom.xml> to org.apache.activemq.tooling/activemq-tooling/5.11-SNAPSHOT/activemq-tooling-5.11-SNAPSHOT.pom
Sending artifact delta relative to ActiveMQ-Java7 ? ActiveMQ :: Tooling #384
Archived 1 artifacts
Archive block size is 32768
Received 0 blocks and 1679 bytes
Compression is 0.0%
Took 78 ms
[JENKINS] Archiving <https://builds.apache.org/job/ActiveMQ-Java7/ws/activemq-partition/pom.xml> to org.apache.activemq/activemq-partition/5.11-SNAPSHOT/activemq-partition-5.11-SNAPSHOT.pom
[JENKINS] Archiving <https://builds.apache.org/job/ActiveMQ-Java7/ws/activemq-partition/target/activemq-partition-5.11-SNAPSHOT.jar> to org.apache.activemq/activemq-partition/5.11-SNAPSHOT/activemq-partition-5.11-SNAPSHOT.jar
[JENKINS] Archiving <https://builds.apache.org/job/ActiveMQ-Java7/ws/activemq-partition/target/activemq-partition-5.11-SNAPSHOT-sources.jar> to org.apache.activemq/activemq-partition/5.11-SNAPSHOT/activemq-partition-5.11-SNAPSHOT-sources.jar
Sending artifact delta relative to ActiveMQ-Java7 ? ActiveMQ :: Partition Management #384
Archived 3 artifacts
Archive block size is 32768
Received 0 blocks and 46326 bytes
Compression is 0.0%
Took 0.17 sec
[JENKINS] Archiving <https://builds.apache.org/job/ActiveMQ-Java7/ws/activemq-web/pom.xml> to org.apache.activemq/activemq-web/5.11-SNAPSHOT/activemq-web-5.11-SNAPSHOT.pom
[JENKINS] Archiving <https://builds.apache.org/job/ActiveMQ-Java7/ws/activemq-web/target/activemq-web-5.11-SNAPSHOT.jar> to org.apache.activemq/activemq-web/5.11-SNAPSHOT/activemq-web-5.11-SNAPSHOT.jar
[JENKINS] Archiving <https://builds.apache.org/job/ActiveMQ-Java7/ws/activemq-web/target/activemq-web-5.11-SNAPSHOT-sources.jar> to org.apache.activemq/activemq-web/5.11-SNAPSHOT/activemq-web-5.11-SNAPSHOT-sources.jar
Sending artifact delta relative to ActiveMQ-Java7 ? ActiveMQ :: Web #384
Archived 3 artifacts
Archive block size is 32768
Received 0 blocks and 211733 bytes
Compression is 0.0%
Took 0.2 sec
[JENKINS] Archiving <https://builds.apache.org/job/ActiveMQ-Java7/ws/activemq-leveldb-store/pom.xml> to org.apache.activemq/activemq-leveldb-store/5.11-SNAPSHOT/activemq-leveldb-store-5.11-SNAPSHOT.pom
[JENKINS] Archiving <https://builds.apache.org/job/ActiveMQ-Java7/ws/activemq-leveldb-store/target/activemq-leveldb-store-5.11-SNAPSHOT.jar> to org.apache.activemq/activemq-leveldb-store/5.11-SNAPSHOT/activemq-leveldb-store-5.11-SNAPSHOT.jar
[JENKINS] Archiving <https://builds.apache.org/job/ActiveMQ-Java7/ws/activemq-leveldb-store/target/activemq-leveldb-store-5.11-SNAPSHOT-sources.jar> to org.apache.activemq/activemq-leveldb-store/5.11-SNAPSHOT/activemq-leveldb-store-5.11-SNAPSHOT-sources.jar
Sending artifact delta relative to ActiveMQ-Java7 ? ActiveMQ :: LevelDB Store #384
Archived 3 artifacts
Archive block size is 32768
Received 0 blocks and 1086482 bytes
Compression is 0.0%
Took 0.63 sec
[JENKINS] Archiving <https://builds.apache.org/job/ActiveMQ-Java7/ws/activemq-fileserver/pom.xml> to org.apache.activemq/activemq-fileserver/5.11-SNAPSHOT/activemq-fileserver-5.11-SNAPSHOT.pom
[JENKINS] Archiving <https://builds.apache.org/job/ActiveMQ-Java7/ws/activemq-fileserver/target/activemq-fileserver-5.11-SNAPSHOT.war> to org.apache.activemq/activemq-fileserver/5.11-SNAPSHOT/activemq-fileserver-5.11-SNAPSHOT.war
[JENKINS] Archiving <https://builds.apache.org/job/ActiveMQ-Java7/ws/activemq-fileserver/target/activemq-fileserver-5.11-SNAPSHOT-sources.jar> to org.apache.activemq/activemq-fileserver/5.11-SNAPSHOT/activemq-fileserver-5.11-SNAPSHOT-sources.jar
Sending artifact delta relative to ActiveMQ-Java7 ? ActiveMQ :: File Server #384
Archived 3 artifacts
Archive block size is 32768
Received 0 blocks and 58361 bytes
Compression is 0.0%
Took 1.5 sec
[JENKINS] Archiving <https://builds.apache.org/job/ActiveMQ-Java7/ws/activemq-karaf/pom.xml> to org.apache.activemq/activemq-karaf/5.11-SNAPSHOT/activemq-karaf-5.11-SNAPSHOT.pom
[JENKINS] Archiving <https://builds.apache.org/job/ActiveMQ-Java7/ws/activemq-karaf/target/activemq-karaf-5.11-SNAPSHOT.jar> to org.apache.activemq/activemq-karaf/5.11-SNAPSHOT/activemq-karaf-5.11-SNAPSHOT.jar
[JENKINS] Archiving <https://builds.apache.org/job/ActiveMQ-Java7/ws/activemq-karaf/target/classes/features.xml> to org.apache.activemq/activemq-karaf/5.11-SNAPSHOT/activemq-karaf-5.11-SNAPSHOT-features.xml
[JENKINS] Archiving <https://builds.apache.org/job/ActiveMQ-Java7/ws/activemq-karaf/target/classes/features-core.xml> to org.apache.activemq/activemq-karaf/5.11-SNAPSHOT/activemq-karaf-5.11-SNAPSHOT-features-core.xml
[JENKINS] Archiving <https://builds.apache.org/job/ActiveMQ-Java7/ws/activemq-karaf/target/classes/activemq.xml> to org.apache.activemq/activemq-karaf/5.11-SNAPSHOT/activemq-karaf-5.11-SNAPSHOT-activemq.xml
[JENKINS] Archiving <https://builds.apache.org/job/ActiveMQ-Java7/ws/activemq-karaf/target/classes/org.apache.activemq.server-default.cfg> to org.apache.activemq/activemq-karaf/5.11-SNAPSHOT/activemq-karaf-5.11-SNAPSHOT-activemq.cfg
[JENKINS] Archiving <https://builds.apache.org/job/ActiveMQ-Java7/ws/activemq-karaf/target/classes/org.apache.activemq.webconsole.cfg> to org.apache.activemq/activemq-karaf/5.11-SNAPSHOT/activemq-karaf-5.11-SNAPSHOT-activemq-webconsole.cfg
[JENKINS] Archiving <https://builds.apache.org/job/ActiveMQ-Java7/ws/activemq-karaf/target/activemq-karaf-5.11-SNAPSHOT-sources.jar> to org.apache.activemq/activemq-karaf/5.11-SNAPSHOT/activemq-karaf-5.11-SNAPSHOT-sources.jar
Sending artifact delta relative to ActiveMQ-Java7 ? ActiveMQ :: Apache Karaf #384
Archived 8 artifacts
Archive block size is 32768
Received 0 blocks and 69196 bytes
Compression is 0.0%
Took 0.15 sec
[JENKINS] Archiving <https://builds.apache.org/job/ActiveMQ-Java7/ws/activemq-http/pom.xml> to org.apache.activemq/activemq-http/5.11-SNAPSHOT/activemq-http-5.11-SNAPSHOT.pom
[JENKINS] Archiving <https://builds.apache.org/job/ActiveMQ-Java7/ws/activemq-http/target/activemq-http-5.11-SNAPSHOT.jar> to org.apache.activemq/activemq-http/5.11-SNAPSHOT/activemq-http-5.11-SNAPSHOT.jar
[JENKINS] Archiving <https://builds.apache.org/job/ActiveMQ-Java7/ws/activemq-http/target/activemq-http-5.11-SNAPSHOT-sources.jar> to org.apache.activemq/activemq-http/5.11-SNAPSHOT/activemq-http-5.11-SNAPSHOT-sources.jar
Sending artifact delta relative to ActiveMQ-Java7 ? ActiveMQ :: HTTP Protocol Support #384
Archived 3 artifacts
Archive block size is 32768
Received 0 blocks and 150780 bytes
Compression is 0.0%
Took 0.13 sec
Sending e-mails to: commits@activemq.apache.org
Sending e-mails to: commits@activemq.apache.org
Sending e-mails to: commits@activemq.apache.org
Sending e-mails to: commits@activemq.apache.org
Sending e-mails to: commits@activemq.apache.org
Sending e-mails to: commits@activemq.apache.org
channel stopped
[locks-and-latches] Releasing all the locks
[locks-and-latches] All the locks released
Maven RedeployPublisher use remote ubuntu-1 maven settings from : /home/jenkins/.m2/settings.xml
[ERROR] uniqueVersion == false is not anymore supported in maven 3
[INFO] Deployment in https://repository.apache.org/content/repositories/snapshots (id=,uniqueVersion=false)
Deploying the main artifact activemq-all-5.11-SNAPSHOT.jar
Downloading: https://repository.apache.org/content/repositories/snapshots/org/apache/activemq/activemq-all/5.11-SNAPSHOT/maven-metadata.xml
Downloaded: https://repository.apache.org/content/repositories/snapshots/org/apache/activemq/activemq-all/5.11-SNAPSHOT/maven-metadata.xml (781 B at 0.4 KB/sec)
Uploading: https://repository.apache.org/content/repositories/snapshots/org/apache/activemq/activemq-all/5.11-SNAPSHOT/activemq-all-5.11-20140714.061024-33.jar
Uploading: https://repository.apache.org/content/repositories/snapshots/org/apache/activemq/activemq-all/5.11-SNAPSHOT/activemq-all-5.11-20140714.061024-33.pom
ERROR: Failed to deploy artifacts: Could not transfer artifact org.apache.activemq:activemq-all:jar:5.11-20140714.061024-33 from/to (https://repository.apache.org/content/repositories/snapshots): Failed to transfer file: https://repository.apache.org/content/repositories/snapshots/org/apache/activemq/activemq-all/5.11-SNAPSHOT/activemq-all-5.11-20140714.061024-33.jar. Return code is: 401, ReasonPhrase: Unauthorized.
org.apache.maven.artifact.deployer.ArtifactDeploymentException: Failed to deploy artifacts: Could not transfer artifact org.apache.activemq:activemq-all:jar:5.11-20140714.061024-33 from/to (https://repository.apache.org/content/repositories/snapshots): Failed to transfer file: https://repository.apache.org/content/repositories/snapshots/org/apache/activemq/activemq-all/5.11-SNAPSHOT/activemq-all-5.11-20140714.061024-33.jar. Return code is: 401, ReasonPhrase: Unauthorized.
at org.apache.maven.artifact.deployer.DefaultArtifactDeployer.deploy(DefaultArtifactDeployer.java:143)
at hudson.maven.reporters.MavenArtifactRecord.deploy(MavenArtifactRecord.java:193)
at hudson.maven.RedeployPublisher.perform(RedeployPublisher.java:176)
at hudson.tasks.BuildStepMonitor$1.perform(BuildStepMonitor.java:20)
at hudson.model.AbstractBuild$AbstractBuildExecution.perform(AbstractBuild.java:804)
at hudson.model.AbstractBuild$AbstractBuildExecution.performAllBuildSteps(AbstractBuild.java:776)
at hudson.maven.MavenModuleSetBuild$MavenModuleSetBuildExecution.post2(MavenModuleSetBuild.java:1040)
at hudson.model.AbstractBuild$AbstractBuildExecution.post(AbstractBuild.java:725)
at hudson.model.Run.execute(Run.java:1701)
at hudson.maven.MavenModuleSetBuild.run(MavenModuleSetBuild.java:529)
at hudson.model.ResourceController.execute(ResourceController.java:88)
at hudson.model.Executor.run(Executor.java:231)
Caused by: org.eclipse.aether.deployment.DeploymentException: Failed to deploy artifacts: Could not transfer artifact org.apache.activemq:activemq-all:jar:5.11-20140714.061024-33 from/to (https://repository.apache.org/content/repositories/snapshots): Failed to transfer file: https://repository.apache.org/content/repositories/snapshots/org/apache/activemq/activemq-all/5.11-SNAPSHOT/activemq-all-5.11-20140714.061024-33.jar. Return code is: 401, ReasonPhrase: Unauthorized.
at org.eclipse.aether.internal.impl.DefaultDeployer.deploy(DefaultDeployer.java:341)
at org.eclipse.aether.internal.impl.DefaultDeployer.deploy(DefaultDeployer.java:269)
at org.eclipse.aether.internal.impl.DefaultRepositorySystem.deploy(DefaultRepositorySystem.java:413)
at org.apache.maven.artifact.deployer.DefaultArtifactDeployer.deploy(DefaultArtifactDeployer.java:139)
... 11 more
Caused by: org.eclipse.aether.transfer.ArtifactTransferException: Could not transfer artifact org.apache.activemq:activemq-all:jar:5.11-20140714.061024-33 from/to (https://repository.apache.org/content/repositories/snapshots): Failed to transfer file: https://repository.apache.org/content/repositories/snapshots/org/apache/activemq/activemq-all/5.11-SNAPSHOT/activemq-all-5.11-20140714.061024-33.jar. Return code is: 401, ReasonPhrase: Unauthorized.
at org.eclipse.aether.connector.wagon.WagonRepositoryConnector$6.wrap(WagonRepositoryConnector.java:1016)
at org.eclipse.aether.connector.wagon.WagonRepositoryConnector$6.wrap(WagonRepositoryConnector.java:1004)
at org.eclipse.aether.connector.wagon.WagonRepositoryConnector$PutTask.run(WagonRepositoryConnector.java:895)
at org.eclipse.aether.connector.wagon.WagonRepositoryConnector.put(WagonRepositoryConnector.java:522)
at org.eclipse.aether.internal.impl.DefaultDeployer.deploy(DefaultDeployer.java:335)
... 14 more
Caused by: org.apache.maven.wagon.TransferFailedException: Failed to transfer file: https://repository.apache.org/content/repositories/snapshots/org/apache/activemq/activemq-all/5.11-SNAPSHOT/activemq-all-5.11-20140714.061024-33.jar. Return code is: 401, ReasonPhrase: Unauthorized.
at org.apache.maven.wagon.shared.http4.AbstractHttpClientWagon.put(AbstractHttpClientWagon.java:626)
at org.apache.maven.wagon.shared.http4.AbstractHttpClientWagon.put(AbstractHttpClientWagon.java:524)
at org.apache.maven.wagon.shared.http4.AbstractHttpClientWagon.put(AbstractHttpClientWagon.java:505)
at org.apache.maven.wagon.shared.http4.AbstractHttpClientWagon.put(AbstractHttpClientWagon.java:485)
at org.eclipse.aether.connector.wagon.WagonRepositoryConnector$PutTask.run(WagonRepositoryConnector.java:871)
... 16 more
[INFO] Deployment failed after 2.8 sec
Build step 'Deploy artifacts to Maven repository' changed build result to FAILURE
Build failed in Jenkins: ActiveMQ-Java7 #394
Posted by Apache Jenkins Server <je...@builds.apache.org>.
See <https://builds.apache.org/job/ActiveMQ-Java7/394/changes>
Changes:
[gtully] https://issues.apache.org/jira/browse/AMQ-5264 add useSessionArgs attribute to allow transacted session creation - where user does demarcation using plain jms api. Default behaviour is to only allow container local or xa transaction demarcation
[tabish121] https://issues.apache.org/jira/browse/AMQ-4818
------------------------------------------
[...truncated 2791 lines...]
Compression is 0.0%
Took 2 sec
[JENKINS] Archiving <https://builds.apache.org/job/ActiveMQ-Java7/ws/activemq-itests-spring31/pom.xml> to org.apache.activemq/activemq-itests-spring31/5.11-SNAPSHOT/activemq-itests-spring31-5.11-SNAPSHOT.pom
Sending artifact delta relative to ActiveMQ-Java7 ? ActiveMQ :: Integration Test :: Spring 3.1 #393
Archived 1 artifacts
Archive block size is 32768
Received 0 blocks and 3005 bytes
Compression is 0.0%
Took 0.14 sec
[JENKINS] Archiving <https://builds.apache.org/job/ActiveMQ-Java7/ws/assembly/pom.xml> to org.apache.activemq/apache-activemq/5.11-SNAPSHOT/apache-activemq-5.11-SNAPSHOT.pom
Sending artifact delta relative to ActiveMQ-Java7 ? ActiveMQ :: Assembly #392
Archived 1 artifacts
Archive block size is 32768
Received 0 blocks and 18450 bytes
Compression is 0.0%
Took 5.9 sec
[JENKINS] Archiving <https://builds.apache.org/job/ActiveMQ-Java7/ws/activemq-jms-pool/pom.xml> to org.apache.activemq/activemq-jms-pool/5.11-SNAPSHOT/activemq-jms-pool-5.11-SNAPSHOT.pom
[JENKINS] Archiving <https://builds.apache.org/job/ActiveMQ-Java7/ws/activemq-jms-pool/target/activemq-jms-pool-5.11-SNAPSHOT.jar> to org.apache.activemq/activemq-jms-pool/5.11-SNAPSHOT/activemq-jms-pool-5.11-SNAPSHOT.jar
[JENKINS] Archiving <https://builds.apache.org/job/ActiveMQ-Java7/ws/activemq-jms-pool/target/activemq-jms-pool-5.11-SNAPSHOT-sources.jar> to org.apache.activemq/activemq-jms-pool/5.11-SNAPSHOT/activemq-jms-pool-5.11-SNAPSHOT-sources.jar
Sending artifact delta relative to ActiveMQ-Java7 ? ActiveMQ :: Generic JMS Pool #393
Archived 3 artifacts
Archive block size is 32768
Received 0 blocks and 93941 bytes
Compression is 0.0%
Took 0.32 sec
[JENKINS] Archiving <https://builds.apache.org/job/ActiveMQ-Java7/ws/activemq-log4j-appender/pom.xml> to org.apache.activemq/activemq-log4j-appender/5.11-SNAPSHOT/activemq-log4j-appender-5.11-SNAPSHOT.pom
[JENKINS] Archiving <https://builds.apache.org/job/ActiveMQ-Java7/ws/activemq-log4j-appender/target/activemq-log4j-appender-5.11-SNAPSHOT.jar> to org.apache.activemq/activemq-log4j-appender/5.11-SNAPSHOT/activemq-log4j-appender-5.11-SNAPSHOT.jar
[JENKINS] Archiving <https://builds.apache.org/job/ActiveMQ-Java7/ws/activemq-log4j-appender/target/activemq-log4j-appender-5.11-SNAPSHOT-sources.jar> to org.apache.activemq/activemq-log4j-appender/5.11-SNAPSHOT/activemq-log4j-appender-5.11-SNAPSHOT-sources.jar
Sending artifact delta relative to ActiveMQ-Java7 ? ActiveMQ :: Log4j Appender #393
Archived 3 artifacts
Archive block size is 32768
Received 0 blocks and 28379 bytes
Compression is 0.0%
Took 0.14 sec
[JENKINS] Archiving <https://builds.apache.org/job/ActiveMQ-Java7/ws/activemq-runtime-config/pom.xml> to org.apache.activemq/activemq-runtime-config/5.11-SNAPSHOT/activemq-runtime-config-5.11-SNAPSHOT.pom
[JENKINS] Archiving <https://builds.apache.org/job/ActiveMQ-Java7/ws/activemq-runtime-config/target/activemq-runtime-config-5.11-SNAPSHOT.jar> to org.apache.activemq/activemq-runtime-config/5.11-SNAPSHOT/activemq-runtime-config-5.11-SNAPSHOT.jar
[JENKINS] Archiving <https://builds.apache.org/job/ActiveMQ-Java7/ws/activemq-runtime-config/target/activemq-runtime-config-5.11-SNAPSHOT-sources.jar> to org.apache.activemq/activemq-runtime-config/5.11-SNAPSHOT/activemq-runtime-config-5.11-SNAPSHOT-sources.jar
Sending artifact delta relative to ActiveMQ-Java7 ? ActiveMQ :: Runtime Configuration #393
Archived 3 artifacts
Archive block size is 32768
Received 0 blocks and 2375417 bytes
Compression is 0.0%
Took 2.3 sec
[JENKINS] Archiving <https://builds.apache.org/job/ActiveMQ-Java7/ws/activemq-pool/pom.xml> to org.apache.activemq/activemq-pool/5.11-SNAPSHOT/activemq-pool-5.11-SNAPSHOT.pom
[JENKINS] Archiving <https://builds.apache.org/job/ActiveMQ-Java7/ws/activemq-pool/target/activemq-pool-5.11-SNAPSHOT.jar> to org.apache.activemq/activemq-pool/5.11-SNAPSHOT/activemq-pool-5.11-SNAPSHOT.jar
[JENKINS] Archiving <https://builds.apache.org/job/ActiveMQ-Java7/ws/activemq-pool/target/activemq-pool-5.11-SNAPSHOT-sources.jar> to org.apache.activemq/activemq-pool/5.11-SNAPSHOT/activemq-pool-5.11-SNAPSHOT-sources.jar
Sending artifact delta relative to ActiveMQ-Java7 ? ActiveMQ :: Pool #393
Archived 3 artifacts
Archive block size is 32768
Received 0 blocks and 36038 bytes
Compression is 0.0%
Took 0.14 sec
[JENKINS] Archiving <https://builds.apache.org/job/ActiveMQ-Java7/ws/activemq-stomp/pom.xml> to org.apache.activemq/activemq-stomp/5.11-SNAPSHOT/activemq-stomp-5.11-SNAPSHOT.pom
[JENKINS] Archiving <https://builds.apache.org/job/ActiveMQ-Java7/ws/activemq-stomp/target/activemq-stomp-5.11-SNAPSHOT.jar> to org.apache.activemq/activemq-stomp/5.11-SNAPSHOT/activemq-stomp-5.11-SNAPSHOT.jar
[JENKINS] Archiving <https://builds.apache.org/job/ActiveMQ-Java7/ws/activemq-stomp/target/activemq-stomp-5.11-SNAPSHOT-sources.jar> to org.apache.activemq/activemq-stomp/5.11-SNAPSHOT/activemq-stomp-5.11-SNAPSHOT-sources.jar
Sending artifact delta relative to ActiveMQ-Java7 ? ActiveMQ :: STOMP Protocol #393
Archived 3 artifacts
Archive block size is 32768
Received 0 blocks and 173212 bytes
Compression is 0.0%
Took 0.17 sec
[JENKINS] Archiving <https://builds.apache.org/job/ActiveMQ-Java7/ws/activemq-run/dependency-reduced-pom.xml> to org.apache.activemq/activemq-run/5.11-SNAPSHOT/activemq-run-5.11-SNAPSHOT.pom
[JENKINS] Archiving <https://builds.apache.org/job/ActiveMQ-Java7/ws/activemq-run/target/activemq-run-5.11-SNAPSHOT.jar> to org.apache.activemq/activemq-run/5.11-SNAPSHOT/activemq-run-5.11-SNAPSHOT.jar
[JENKINS] Archiving <https://builds.apache.org/job/ActiveMQ-Java7/ws/activemq-run/target/activemq-run-5.11-SNAPSHOT-sources.jar> to org.apache.activemq/activemq-run/5.11-SNAPSHOT/activemq-run-5.11-SNAPSHOT-sources.jar
Sending artifact delta relative to ActiveMQ-Java7 ? ActiveMQ :: Run Jar #393
Archived 3 artifacts
Archive block size is 32768
Received 0 blocks and 24898 bytes
Compression is 0.0%
Took 84 ms
[JENKINS] Archiving <https://builds.apache.org/job/ActiveMQ-Java7/ws/activemq-mqtt/pom.xml> to org.apache.activemq/activemq-mqtt/5.11-SNAPSHOT/activemq-mqtt-5.11-SNAPSHOT.pom
[JENKINS] Archiving <https://builds.apache.org/job/ActiveMQ-Java7/ws/activemq-mqtt/target/activemq-mqtt-5.11-SNAPSHOT.jar> to org.apache.activemq/activemq-mqtt/5.11-SNAPSHOT/activemq-mqtt-5.11-SNAPSHOT.jar
[JENKINS] Archiving <https://builds.apache.org/job/ActiveMQ-Java7/ws/activemq-mqtt/target/activemq-mqtt-5.11-SNAPSHOT-sources.jar> to org.apache.activemq/activemq-mqtt/5.11-SNAPSHOT/activemq-mqtt-5.11-SNAPSHOT-sources.jar
Sending artifact delta relative to ActiveMQ-Java7 ? ActiveMQ :: MQTT Protocol #393
Archived 3 artifacts
Archive block size is 32768
Received 0 blocks and 126125 bytes
Compression is 0.0%
Took 0.23 sec
[JENKINS] Archiving <https://builds.apache.org/job/ActiveMQ-Java7/ws/activemq-shiro/pom.xml> to org.apache.activemq/activemq-shiro/5.11-SNAPSHOT/activemq-shiro-5.11-SNAPSHOT.pom
Sending artifact delta relative to ActiveMQ-Java7 ? ActiveMQ :: Shiro #393
Archived 1 artifacts
Archive block size is 32768
Received 0 blocks and 7059 bytes
Compression is 0.0%
Took 0.11 sec
[JENKINS] Archiving <https://builds.apache.org/job/ActiveMQ-Java7/ws/activemq-console/pom.xml> to org.apache.activemq/activemq-console/5.11-SNAPSHOT/activemq-console-5.11-SNAPSHOT.pom
[JENKINS] Archiving <https://builds.apache.org/job/ActiveMQ-Java7/ws/activemq-console/target/activemq-console-5.11-SNAPSHOT.jar> to org.apache.activemq/activemq-console/5.11-SNAPSHOT/activemq-console-5.11-SNAPSHOT.jar
[JENKINS] Archiving <https://builds.apache.org/job/ActiveMQ-Java7/ws/activemq-console/target/activemq-console-5.11-SNAPSHOT-sources.jar> to org.apache.activemq/activemq-console/5.11-SNAPSHOT/activemq-console-5.11-SNAPSHOT-sources.jar
Sending artifact delta relative to ActiveMQ-Java7 ? ActiveMQ :: Console #393
Archived 3 artifacts
Archive block size is 32768
Received 0 blocks and 325129 bytes
Compression is 0.0%
Took 2.5 sec
[JENKINS] Archiving <https://builds.apache.org/job/ActiveMQ-Java7/ws/activemq-camel/pom.xml> to org.apache.activemq/activemq-camel/5.11-SNAPSHOT/activemq-camel-5.11-SNAPSHOT.pom
Sending artifact delta relative to ActiveMQ-Java7 ? ActiveMQ :: Camel #393
Archived 1 artifacts
Archive block size is 32768
Received 0 blocks and 6843 bytes
Compression is 0.0%
Took 0.11 sec
[JENKINS] Archiving <https://builds.apache.org/job/ActiveMQ-Java7/ws/activemq-blueprint/pom.xml> to org.apache.activemq/activemq-blueprint/5.11-SNAPSHOT/activemq-blueprint-5.11-SNAPSHOT.pom
[JENKINS] Archiving <https://builds.apache.org/job/ActiveMQ-Java7/ws/activemq-blueprint/target/activemq-blueprint-5.11-SNAPSHOT.jar> to org.apache.activemq/activemq-blueprint/5.11-SNAPSHOT/activemq-blueprint-5.11-SNAPSHOT.jar
[JENKINS] Archiving <https://builds.apache.org/job/ActiveMQ-Java7/ws/activemq-blueprint/target/activemq-blueprint-5.11-SNAPSHOT-sources.jar> to org.apache.activemq/activemq-blueprint/5.11-SNAPSHOT/activemq-blueprint-5.11-SNAPSHOT-sources.jar
Sending artifact delta relative to ActiveMQ-Java7 ? ActiveMQ :: Blueprint #393
Archived 3 artifacts
Archive block size is 32768
Received 0 blocks and 18126 bytes
Compression is 0.0%
Took 2.3 sec
[JENKINS] Archiving <https://builds.apache.org/job/ActiveMQ-Java7/ws/activemq-client/pom.xml> to org.apache.activemq/activemq-client/5.11-SNAPSHOT/activemq-client-5.11-SNAPSHOT.pom
[JENKINS] Archiving <https://builds.apache.org/job/ActiveMQ-Java7/ws/activemq-client/target/activemq-client-5.11-SNAPSHOT.jar> to org.apache.activemq/activemq-client/5.11-SNAPSHOT/activemq-client-5.11-SNAPSHOT.jar
[JENKINS] Archiving <https://builds.apache.org/job/ActiveMQ-Java7/ws/activemq-client/target/activemq-client-5.11-SNAPSHOT-sources.jar> to org.apache.activemq/activemq-client/5.11-SNAPSHOT/activemq-client-5.11-SNAPSHOT-sources.jar
Sending artifact delta relative to ActiveMQ-Java7 ? ActiveMQ :: Client #393
Archived 3 artifacts
Archive block size is 32768
Received 0 blocks and 2211093 bytes
Compression is 0.0%
Took 3 sec
[JENKINS] Archiving <https://builds.apache.org/job/ActiveMQ-Java7/ws/pom.xml> to org.apache.activemq/activemq-parent/5.11-SNAPSHOT/activemq-parent-5.11-SNAPSHOT.pom
Sending artifact delta relative to ActiveMQ-Java7 ? ActiveMQ #393
Archived 1 artifacts
Archive block size is 32768
Received 1 blocks and 26405 bytes
Compression is 55.4%
Took 98 ms
[JENKINS] Archiving <https://builds.apache.org/job/ActiveMQ-Java7/ws/activemq-karaf-itest/pom.xml> to org.apache.activemq/activemq-karaf-itest/5.11-SNAPSHOT/activemq-karaf-itest-5.11-SNAPSHOT.pom
Sending artifact delta relative to ActiveMQ-Java7 ? ActiveMQ :: Karaf Integration Tests #393
Archived 1 artifacts
Archive block size is 32768
Received 0 blocks and 9809 bytes
Compression is 0.0%
Took 84 ms
[JENKINS] Archiving <https://builds.apache.org/job/ActiveMQ-Java7/ws/activemq-broker/pom.xml> to org.apache.activemq/activemq-broker/5.11-SNAPSHOT/activemq-broker-5.11-SNAPSHOT.pom
[JENKINS] Archiving <https://builds.apache.org/job/ActiveMQ-Java7/ws/activemq-broker/target/activemq-broker-5.11-SNAPSHOT.jar> to org.apache.activemq/activemq-broker/5.11-SNAPSHOT/activemq-broker-5.11-SNAPSHOT.jar
[JENKINS] Archiving <https://builds.apache.org/job/ActiveMQ-Java7/ws/activemq-broker/target/activemq-broker-5.11-SNAPSHOT-tests.jar> to org.apache.activemq/activemq-broker/5.11-SNAPSHOT/activemq-broker-5.11-SNAPSHOT-tests.jar
[JENKINS] Archiving <https://builds.apache.org/job/ActiveMQ-Java7/ws/activemq-broker/target/activemq-broker-5.11-SNAPSHOT-sources.jar> to org.apache.activemq/activemq-broker/5.11-SNAPSHOT/activemq-broker-5.11-SNAPSHOT-sources.jar
Sending artifact delta relative to ActiveMQ-Java7 ? ActiveMQ :: Broker #393
Archived 4 artifacts
Archive block size is 32768
Received 0 blocks and 1906030 bytes
Compression is 0.0%
Took 2.5 sec
[JENKINS] Archiving <https://builds.apache.org/job/ActiveMQ-Java7/ws/activemq-ra/pom.xml> to org.apache.activemq/activemq-ra/5.11-SNAPSHOT/activemq-ra-5.11-SNAPSHOT.pom
[JENKINS] Archiving <https://builds.apache.org/job/ActiveMQ-Java7/ws/activemq-ra/target/activemq-ra-5.11-SNAPSHOT.jar> to org.apache.activemq/activemq-ra/5.11-SNAPSHOT/activemq-ra-5.11-SNAPSHOT.jar
[JENKINS] Archiving <https://builds.apache.org/job/ActiveMQ-Java7/ws/activemq-ra/target/xbean/activemq-ra.xsd> to org.apache.activemq/activemq-ra/5.11-SNAPSHOT/activemq-ra-5.11-SNAPSHOT.xsd
[JENKINS] Archiving <https://builds.apache.org/job/ActiveMQ-Java7/ws/activemq-ra/target/xbean/activemq-ra.xsd.html> to org.apache.activemq/activemq-ra/5.11-SNAPSHOT/activemq-ra-5.11-SNAPSHOT-schema.html
[JENKINS] Archiving <https://builds.apache.org/job/ActiveMQ-Java7/ws/activemq-ra/target/xbean/activemq-ra.xsd.html> to org.apache.activemq/activemq-ra/5.11-SNAPSHOT/activemq-ra-5.11-SNAPSHOT.xsd.html
[JENKINS] Archiving <https://builds.apache.org/job/ActiveMQ-Java7/ws/activemq-ra/target/activemq-ra-5.11-SNAPSHOT-sources.jar> to org.apache.activemq/activemq-ra/5.11-SNAPSHOT/activemq-ra-5.11-SNAPSHOT-sources.jar
Sending artifact delta relative to ActiveMQ-Java7 ? ActiveMQ :: RA #393
Archived 6 artifacts
Archive block size is 32768
Received 0 blocks and 190274 bytes
Compression is 0.0%
Took 0.15 sec
[JENKINS] Archiving <https://builds.apache.org/job/ActiveMQ-Java7/ws/activemq-spring/pom.xml> to org.apache.activemq/activemq-spring/5.11-SNAPSHOT/activemq-spring-5.11-SNAPSHOT.pom
[JENKINS] Archiving <https://builds.apache.org/job/ActiveMQ-Java7/ws/activemq-spring/target/activemq-spring-5.11-SNAPSHOT.jar> to org.apache.activemq/activemq-spring/5.11-SNAPSHOT/activemq-spring-5.11-SNAPSHOT.jar
[JENKINS] Archiving <https://builds.apache.org/job/ActiveMQ-Java7/ws/activemq-spring/target/classes/activemq.xsd> to org.apache.activemq/activemq-spring/5.11-SNAPSHOT/activemq-spring-5.11-SNAPSHOT.xsd
[JENKINS] Archiving <https://builds.apache.org/job/ActiveMQ-Java7/ws/activemq-spring/target/classes/activemq.xsd.html> to org.apache.activemq/activemq-spring/5.11-SNAPSHOT/activemq-spring-5.11-SNAPSHOT-schema.html
[JENKINS] Archiving <https://builds.apache.org/job/ActiveMQ-Java7/ws/activemq-spring/target/activemq-spring-5.11-SNAPSHOT-sources.jar> to org.apache.activemq/activemq-spring/5.11-SNAPSHOT/activemq-spring-5.11-SNAPSHOT-sources.jar
Sending artifact delta relative to ActiveMQ-Java7 ? ActiveMQ :: Spring #393
Archived 5 artifacts
Archive block size is 32768
Received 21 blocks and 382479 bytes
Compression is 64.3%
Took 2.5 sec
[JENKINS] Archiving <https://builds.apache.org/job/ActiveMQ-Java7/ws/activemq-all/pom.xml> to org.apache.activemq/activemq-all/5.11-SNAPSHOT/activemq-all-5.11-SNAPSHOT.pom
Sending artifact delta relative to ActiveMQ-Java7 ? ActiveMQ :: All JAR bundle #393
Archived 1 artifacts
Archive block size is 32768
Received 0 blocks and 15390 bytes
Compression is 0.0%
Took 0.22 sec
[JENKINS] Archiving <https://builds.apache.org/job/ActiveMQ-Java7/ws/activemq-kahadb-store/pom.xml> to org.apache.activemq/activemq-kahadb-store/5.11-SNAPSHOT/activemq-kahadb-store-5.11-SNAPSHOT.pom
[JENKINS] Archiving <https://builds.apache.org/job/ActiveMQ-Java7/ws/activemq-kahadb-store/target/activemq-kahadb-store-5.11-SNAPSHOT.jar> to org.apache.activemq/activemq-kahadb-store/5.11-SNAPSHOT/activemq-kahadb-store-5.11-SNAPSHOT.jar
[JENKINS] Archiving <https://builds.apache.org/job/ActiveMQ-Java7/ws/activemq-kahadb-store/target/activemq-kahadb-store-5.11-SNAPSHOT-sources.jar> to org.apache.activemq/activemq-kahadb-store/5.11-SNAPSHOT/activemq-kahadb-store-5.11-SNAPSHOT-sources.jar
Sending artifact delta relative to ActiveMQ-Java7 ? ActiveMQ :: KahaDB Store #393
Archived 3 artifacts
Archive block size is 32768
Received 0 blocks and 887612 bytes
Compression is 0.0%
Took 2.7 sec
[JENKINS] Archiving <https://builds.apache.org/job/ActiveMQ-Java7/ws/activemq-jaas/pom.xml> to org.apache.activemq/activemq-jaas/5.11-SNAPSHOT/activemq-jaas-5.11-SNAPSHOT.pom
[JENKINS] Archiving <https://builds.apache.org/job/ActiveMQ-Java7/ws/activemq-jaas/target/activemq-jaas-5.11-SNAPSHOT.jar> to org.apache.activemq/activemq-jaas/5.11-SNAPSHOT/activemq-jaas-5.11-SNAPSHOT.jar
[JENKINS] Archiving <https://builds.apache.org/job/ActiveMQ-Java7/ws/activemq-jaas/target/activemq-jaas-5.11-SNAPSHOT-sources.jar> to org.apache.activemq/activemq-jaas/5.11-SNAPSHOT/activemq-jaas-5.11-SNAPSHOT-sources.jar
Sending artifact delta relative to ActiveMQ-Java7 ? ActiveMQ :: JAAS #393
Archived 3 artifacts
Archive block size is 32768
Received 0 blocks and 64180 bytes
Compression is 0.0%
Took 2.5 sec
[JENKINS] Archiving <https://builds.apache.org/job/ActiveMQ-Java7/ws/activemq-tooling/pom.xml> to org.apache.activemq.tooling/activemq-tooling/5.11-SNAPSHOT/activemq-tooling-5.11-SNAPSHOT.pom
Sending artifact delta relative to ActiveMQ-Java7 ? ActiveMQ :: Tooling #393
Archived 1 artifacts
Archive block size is 32768
Received 0 blocks and 1679 bytes
Compression is 0.0%
Took 0.11 sec
[JENKINS] Archiving <https://builds.apache.org/job/ActiveMQ-Java7/ws/activemq-partition/pom.xml> to org.apache.activemq/activemq-partition/5.11-SNAPSHOT/activemq-partition-5.11-SNAPSHOT.pom
[JENKINS] Archiving <https://builds.apache.org/job/ActiveMQ-Java7/ws/activemq-partition/target/activemq-partition-5.11-SNAPSHOT.jar> to org.apache.activemq/activemq-partition/5.11-SNAPSHOT/activemq-partition-5.11-SNAPSHOT.jar
[JENKINS] Archiving <https://builds.apache.org/job/ActiveMQ-Java7/ws/activemq-partition/target/activemq-partition-5.11-SNAPSHOT-sources.jar> to org.apache.activemq/activemq-partition/5.11-SNAPSHOT/activemq-partition-5.11-SNAPSHOT-sources.jar
Sending artifact delta relative to ActiveMQ-Java7 ? ActiveMQ :: Partition Management #393
Archived 3 artifacts
Archive block size is 32768
Received 0 blocks and 46540 bytes
Compression is 0.0%
Took 2.5 sec
[JENKINS] Archiving <https://builds.apache.org/job/ActiveMQ-Java7/ws/activemq-web/pom.xml> to org.apache.activemq/activemq-web/5.11-SNAPSHOT/activemq-web-5.11-SNAPSHOT.pom
Sending artifact delta relative to ActiveMQ-Java7 ? ActiveMQ :: Web #393
Archived 1 artifacts
Archive block size is 32768
Received 0 blocks and 4485 bytes
Compression is 0.0%
Took 0.14 sec
[JENKINS] Archiving <https://builds.apache.org/job/ActiveMQ-Java7/ws/activemq-leveldb-store/pom.xml> to org.apache.activemq/activemq-leveldb-store/5.11-SNAPSHOT/activemq-leveldb-store-5.11-SNAPSHOT.pom
[JENKINS] Archiving <https://builds.apache.org/job/ActiveMQ-Java7/ws/activemq-leveldb-store/target/activemq-leveldb-store-5.11-SNAPSHOT.jar> to org.apache.activemq/activemq-leveldb-store/5.11-SNAPSHOT/activemq-leveldb-store-5.11-SNAPSHOT.jar
[JENKINS] Archiving <https://builds.apache.org/job/ActiveMQ-Java7/ws/activemq-leveldb-store/target/activemq-leveldb-store-5.11-SNAPSHOT-sources.jar> to org.apache.activemq/activemq-leveldb-store/5.11-SNAPSHOT/activemq-leveldb-store-5.11-SNAPSHOT-sources.jar
Sending artifact delta relative to ActiveMQ-Java7 ? ActiveMQ :: LevelDB Store #393
Archived 3 artifacts
Archive block size is 32768
Received 0 blocks and 1088234 bytes
Compression is 0.0%
Took 2.9 sec
[JENKINS] Archiving <https://builds.apache.org/job/ActiveMQ-Java7/ws/activemq-fileserver/pom.xml> to org.apache.activemq/activemq-fileserver/5.11-SNAPSHOT/activemq-fileserver-5.11-SNAPSHOT.pom
Sending artifact delta relative to ActiveMQ-Java7 ? ActiveMQ :: File Server #393
Archived 1 artifacts
Archive block size is 32768
Received 0 blocks and 3739 bytes
Compression is 0.0%
Took 2.6 sec
[JENKINS] Archiving <https://builds.apache.org/job/ActiveMQ-Java7/ws/activemq-karaf/pom.xml> to org.apache.activemq/activemq-karaf/5.11-SNAPSHOT/activemq-karaf-5.11-SNAPSHOT.pom
Sending artifact delta relative to ActiveMQ-Java7 ? ActiveMQ :: Apache Karaf #393
Archived 1 artifacts
Archive block size is 32768
Received 0 blocks and 6902 bytes
Compression is 0.0%
Took 0.17 sec
[JENKINS] Archiving <https://builds.apache.org/job/ActiveMQ-Java7/ws/activemq-http/pom.xml> to org.apache.activemq/activemq-http/5.11-SNAPSHOT/activemq-http-5.11-SNAPSHOT.pom
Sending artifact delta relative to ActiveMQ-Java7 ? ActiveMQ :: HTTP Protocol Support #393
Archived 1 artifacts
Archive block size is 32768
Received 0 blocks and 7154 bytes
Compression is 0.0%
Took 0.11 sec
Sending e-mails to: commits@activemq.apache.org
channel stopped
[locks-and-latches] Releasing all the locks
[locks-and-latches] All the locks released
Build failed in Jenkins: ActiveMQ-Java7 #393
Posted by Apache Jenkins Server <je...@builds.apache.org>.
See <https://builds.apache.org/job/ActiveMQ-Java7/393/changes>
Changes:
[gtully] https://issues.apache.org/jira/browse/AMQ-4000 - fix is good enable test so we can close the issue
[tabish121] https://issues.apache.org/jira/browse/AMQ-5233
[dkulp] No point in waiting around for 5 seconds to prove that nothing will be received. 4 minutes off tests.
[dkulp] Change some of the amqp tests to be more event driven reducing the time by several minutes
[tabish121] https://issues.apache.org/jira/browse/AMQ-5253
------------------------------------------
[...truncated 5198 lines...]
Archive block size is 32768
Received 0 blocks and 93941 bytes
Compression is 0.0%
Took 0.15 sec
[JENKINS] Archiving <https://builds.apache.org/job/ActiveMQ-Java7/ws/activemq-log4j-appender/pom.xml> to org.apache.activemq/activemq-log4j-appender/5.11-SNAPSHOT/activemq-log4j-appender-5.11-SNAPSHOT.pom
[JENKINS] Archiving <https://builds.apache.org/job/ActiveMQ-Java7/ws/activemq-log4j-appender/target/activemq-log4j-appender-5.11-SNAPSHOT.jar> to org.apache.activemq/activemq-log4j-appender/5.11-SNAPSHOT/activemq-log4j-appender-5.11-SNAPSHOT.jar
[JENKINS] Archiving <https://builds.apache.org/job/ActiveMQ-Java7/ws/activemq-log4j-appender/target/activemq-log4j-appender-5.11-SNAPSHOT-sources.jar> to org.apache.activemq/activemq-log4j-appender/5.11-SNAPSHOT/activemq-log4j-appender-5.11-SNAPSHOT-sources.jar
Sending artifact delta relative to ActiveMQ-Java7 ? ActiveMQ :: Log4j Appender #392
Archived 3 artifacts
Archive block size is 32768
Received 0 blocks and 28380 bytes
Compression is 0.0%
Took 0.1 sec
[JENKINS] Archiving <https://builds.apache.org/job/ActiveMQ-Java7/ws/activemq-runtime-config/pom.xml> to org.apache.activemq/activemq-runtime-config/5.11-SNAPSHOT/activemq-runtime-config-5.11-SNAPSHOT.pom
[JENKINS] Archiving <https://builds.apache.org/job/ActiveMQ-Java7/ws/activemq-runtime-config/target/activemq-runtime-config-5.11-SNAPSHOT.jar> to org.apache.activemq/activemq-runtime-config/5.11-SNAPSHOT/activemq-runtime-config-5.11-SNAPSHOT.jar
[JENKINS] Archiving <https://builds.apache.org/job/ActiveMQ-Java7/ws/activemq-runtime-config/target/activemq-runtime-config-5.11-SNAPSHOT-sources.jar> to org.apache.activemq/activemq-runtime-config/5.11-SNAPSHOT/activemq-runtime-config-5.11-SNAPSHOT-sources.jar
Sending artifact delta relative to ActiveMQ-Java7 ? ActiveMQ :: Runtime Configuration #392
Archived 3 artifacts
Archive block size is 32768
Received 0 blocks and 2375109 bytes
Compression is 0.0%
Took 2 sec
[JENKINS] Archiving <https://builds.apache.org/job/ActiveMQ-Java7/ws/activemq-pool/pom.xml> to org.apache.activemq/activemq-pool/5.11-SNAPSHOT/activemq-pool-5.11-SNAPSHOT.pom
[JENKINS] Archiving <https://builds.apache.org/job/ActiveMQ-Java7/ws/activemq-pool/target/activemq-pool-5.11-SNAPSHOT.jar> to org.apache.activemq/activemq-pool/5.11-SNAPSHOT/activemq-pool-5.11-SNAPSHOT.jar
[JENKINS] Archiving <https://builds.apache.org/job/ActiveMQ-Java7/ws/activemq-pool/target/activemq-pool-5.11-SNAPSHOT-sources.jar> to org.apache.activemq/activemq-pool/5.11-SNAPSHOT/activemq-pool-5.11-SNAPSHOT-sources.jar
Sending artifact delta relative to ActiveMQ-Java7 ? ActiveMQ :: Pool #392
Archived 3 artifacts
Archive block size is 32768
Received 0 blocks and 36039 bytes
Compression is 0.0%
Took 76 ms
[JENKINS] Archiving <https://builds.apache.org/job/ActiveMQ-Java7/ws/activemq-stomp/pom.xml> to org.apache.activemq/activemq-stomp/5.11-SNAPSHOT/activemq-stomp-5.11-SNAPSHOT.pom
[JENKINS] Archiving <https://builds.apache.org/job/ActiveMQ-Java7/ws/activemq-stomp/target/activemq-stomp-5.11-SNAPSHOT.jar> to org.apache.activemq/activemq-stomp/5.11-SNAPSHOT/activemq-stomp-5.11-SNAPSHOT.jar
[JENKINS] Archiving <https://builds.apache.org/job/ActiveMQ-Java7/ws/activemq-stomp/target/activemq-stomp-5.11-SNAPSHOT-sources.jar> to org.apache.activemq/activemq-stomp/5.11-SNAPSHOT/activemq-stomp-5.11-SNAPSHOT-sources.jar
Sending artifact delta relative to ActiveMQ-Java7 ? ActiveMQ :: STOMP Protocol #392
Archived 3 artifacts
Archive block size is 32768
Received 0 blocks and 173213 bytes
Compression is 0.0%
Took 0.1 sec
[JENKINS] Archiving <https://builds.apache.org/job/ActiveMQ-Java7/ws/activemq-run/dependency-reduced-pom.xml> to org.apache.activemq/activemq-run/5.11-SNAPSHOT/activemq-run-5.11-SNAPSHOT.pom
[JENKINS] Archiving <https://builds.apache.org/job/ActiveMQ-Java7/ws/activemq-run/target/activemq-run-5.11-SNAPSHOT.jar> to org.apache.activemq/activemq-run/5.11-SNAPSHOT/activemq-run-5.11-SNAPSHOT.jar
[JENKINS] Archiving <https://builds.apache.org/job/ActiveMQ-Java7/ws/activemq-run/target/activemq-run-5.11-SNAPSHOT-sources.jar> to org.apache.activemq/activemq-run/5.11-SNAPSHOT/activemq-run-5.11-SNAPSHOT-sources.jar
Sending artifact delta relative to ActiveMQ-Java7 ? ActiveMQ :: Run Jar #392
Archived 3 artifacts
Archive block size is 32768
Received 0 blocks and 24899 bytes
Compression is 0.0%
Took 70 ms
[JENKINS] Archiving <https://builds.apache.org/job/ActiveMQ-Java7/ws/activemq-mqtt/pom.xml> to org.apache.activemq/activemq-mqtt/5.11-SNAPSHOT/activemq-mqtt-5.11-SNAPSHOT.pom
[JENKINS] Archiving <https://builds.apache.org/job/ActiveMQ-Java7/ws/activemq-mqtt/target/activemq-mqtt-5.11-SNAPSHOT.jar> to org.apache.activemq/activemq-mqtt/5.11-SNAPSHOT/activemq-mqtt-5.11-SNAPSHOT.jar
[JENKINS] Archiving <https://builds.apache.org/job/ActiveMQ-Java7/ws/activemq-mqtt/target/activemq-mqtt-5.11-SNAPSHOT-sources.jar> to org.apache.activemq/activemq-mqtt/5.11-SNAPSHOT/activemq-mqtt-5.11-SNAPSHOT-sources.jar
Sending artifact delta relative to ActiveMQ-Java7 ? ActiveMQ :: MQTT Protocol #392
Archived 3 artifacts
Archive block size is 32768
Received 0 blocks and 126126 bytes
Compression is 0.0%
Took 95 ms
[JENKINS] Archiving <https://builds.apache.org/job/ActiveMQ-Java7/ws/activemq-shiro/pom.xml> to org.apache.activemq/activemq-shiro/5.11-SNAPSHOT/activemq-shiro-5.11-SNAPSHOT.pom
[JENKINS] Archiving <https://builds.apache.org/job/ActiveMQ-Java7/ws/activemq-shiro/target/activemq-shiro-5.11-SNAPSHOT.jar> to org.apache.activemq/activemq-shiro/5.11-SNAPSHOT/activemq-shiro-5.11-SNAPSHOT.jar
[JENKINS] Archiving <https://builds.apache.org/job/ActiveMQ-Java7/ws/activemq-shiro/target/activemq-shiro-5.11-SNAPSHOT-sources.jar> to org.apache.activemq/activemq-shiro/5.11-SNAPSHOT/activemq-shiro-5.11-SNAPSHOT-sources.jar
Sending artifact delta relative to ActiveMQ-Java7 ? ActiveMQ :: Shiro #392
Archived 3 artifacts
Archive block size is 32768
Received 0 blocks and 98807 bytes
Compression is 0.0%
Took 88 ms
[JENKINS] Archiving <https://builds.apache.org/job/ActiveMQ-Java7/ws/activemq-console/pom.xml> to org.apache.activemq/activemq-console/5.11-SNAPSHOT/activemq-console-5.11-SNAPSHOT.pom
[JENKINS] Archiving <https://builds.apache.org/job/ActiveMQ-Java7/ws/activemq-console/target/activemq-console-5.11-SNAPSHOT.jar> to org.apache.activemq/activemq-console/5.11-SNAPSHOT/activemq-console-5.11-SNAPSHOT.jar
[JENKINS] Archiving <https://builds.apache.org/job/ActiveMQ-Java7/ws/activemq-console/target/activemq-console-5.11-SNAPSHOT-sources.jar> to org.apache.activemq/activemq-console/5.11-SNAPSHOT/activemq-console-5.11-SNAPSHOT-sources.jar
Sending artifact delta relative to ActiveMQ-Java7 ? ActiveMQ :: Console #392
Archived 3 artifacts
Archive block size is 32768
Received 0 blocks and 325130 bytes
Compression is 0.0%
Took 1.4 sec
[JENKINS] Archiving <https://builds.apache.org/job/ActiveMQ-Java7/ws/activemq-camel/pom.xml> to org.apache.activemq/activemq-camel/5.11-SNAPSHOT/activemq-camel-5.11-SNAPSHOT.pom
[JENKINS] Archiving <https://builds.apache.org/job/ActiveMQ-Java7/ws/activemq-camel/target/activemq-camel-5.11-SNAPSHOT.jar> to org.apache.activemq/activemq-camel/5.11-SNAPSHOT/activemq-camel-5.11-SNAPSHOT.jar
[JENKINS] Archiving <https://builds.apache.org/job/ActiveMQ-Java7/ws/activemq-camel/target/activemq-camel-5.11-SNAPSHOT-sources.jar> to org.apache.activemq/activemq-camel/5.11-SNAPSHOT/activemq-camel-5.11-SNAPSHOT-sources.jar
Sending artifact delta relative to ActiveMQ-Java7 ? ActiveMQ :: Camel #392
Archived 3 artifacts
Archive block size is 32768
Received 0 blocks and 98943 bytes
Compression is 0.0%
Took 0.12 sec
[JENKINS] Archiving <https://builds.apache.org/job/ActiveMQ-Java7/ws/activemq-blueprint/pom.xml> to org.apache.activemq/activemq-blueprint/5.11-SNAPSHOT/activemq-blueprint-5.11-SNAPSHOT.pom
[JENKINS] Archiving <https://builds.apache.org/job/ActiveMQ-Java7/ws/activemq-blueprint/target/activemq-blueprint-5.11-SNAPSHOT.jar> to org.apache.activemq/activemq-blueprint/5.11-SNAPSHOT/activemq-blueprint-5.11-SNAPSHOT.jar
[JENKINS] Archiving <https://builds.apache.org/job/ActiveMQ-Java7/ws/activemq-blueprint/target/activemq-blueprint-5.11-SNAPSHOT-sources.jar> to org.apache.activemq/activemq-blueprint/5.11-SNAPSHOT/activemq-blueprint-5.11-SNAPSHOT-sources.jar
Sending artifact delta relative to ActiveMQ-Java7 ? ActiveMQ :: Blueprint #392
Archived 3 artifacts
Archive block size is 32768
Received 0 blocks and 18127 bytes
Compression is 0.0%
Took 77 ms
[JENKINS] Archiving <https://builds.apache.org/job/ActiveMQ-Java7/ws/activemq-client/pom.xml> to org.apache.activemq/activemq-client/5.11-SNAPSHOT/activemq-client-5.11-SNAPSHOT.pom
[JENKINS] Archiving <https://builds.apache.org/job/ActiveMQ-Java7/ws/activemq-client/target/activemq-client-5.11-SNAPSHOT.jar> to org.apache.activemq/activemq-client/5.11-SNAPSHOT/activemq-client-5.11-SNAPSHOT.jar
[JENKINS] Archiving <https://builds.apache.org/job/ActiveMQ-Java7/ws/activemq-client/target/activemq-client-5.11-SNAPSHOT-sources.jar> to org.apache.activemq/activemq-client/5.11-SNAPSHOT/activemq-client-5.11-SNAPSHOT-sources.jar
Sending artifact delta relative to ActiveMQ-Java7 ? ActiveMQ :: Client #392
Archived 3 artifacts
Archive block size is 32768
Received 0 blocks and 2211094 bytes
Compression is 0.0%
Took 0.75 sec
[JENKINS] Archiving <https://builds.apache.org/job/ActiveMQ-Java7/ws/pom.xml> to org.apache.activemq/activemq-parent/5.11-SNAPSHOT/activemq-parent-5.11-SNAPSHOT.pom
Sending artifact delta relative to ActiveMQ-Java7 ? ActiveMQ #392
Archived 1 artifacts
Archive block size is 32768
Received 1 blocks and 26405 bytes
Compression is 55.4%
Took 0.19 sec
[JENKINS] Archiving <https://builds.apache.org/job/ActiveMQ-Java7/ws/activemq-karaf-itest/pom.xml> to org.apache.activemq/activemq-karaf-itest/5.11-SNAPSHOT/activemq-karaf-itest-5.11-SNAPSHOT.pom
[JENKINS] Archiving <https://builds.apache.org/job/ActiveMQ-Java7/ws/activemq-karaf-itest/target/activemq-karaf-itest-5.11-SNAPSHOT.jar> to org.apache.activemq/activemq-karaf-itest/5.11-SNAPSHOT/activemq-karaf-itest-5.11-SNAPSHOT.jar
[JENKINS] Archiving <https://builds.apache.org/job/ActiveMQ-Java7/ws/activemq-karaf-itest/target/activemq-karaf-itest-5.11-SNAPSHOT-sources.jar> to org.apache.activemq/activemq-karaf-itest/5.11-SNAPSHOT/activemq-karaf-itest-5.11-SNAPSHOT-sources.jar
Sending artifact delta relative to ActiveMQ-Java7 ? ActiveMQ :: Karaf Integration Tests #392
Archived 3 artifacts
Archive block size is 32768
Received 0 blocks and 28177 bytes
Compression is 0.0%
Took 0.13 sec
[JENKINS] Archiving <https://builds.apache.org/job/ActiveMQ-Java7/ws/activemq-broker/pom.xml> to org.apache.activemq/activemq-broker/5.11-SNAPSHOT/activemq-broker-5.11-SNAPSHOT.pom
[JENKINS] Archiving <https://builds.apache.org/job/ActiveMQ-Java7/ws/activemq-broker/target/activemq-broker-5.11-SNAPSHOT.jar> to org.apache.activemq/activemq-broker/5.11-SNAPSHOT/activemq-broker-5.11-SNAPSHOT.jar
[JENKINS] Archiving <https://builds.apache.org/job/ActiveMQ-Java7/ws/activemq-broker/target/activemq-broker-5.11-SNAPSHOT-tests.jar> to org.apache.activemq/activemq-broker/5.11-SNAPSHOT/activemq-broker-5.11-SNAPSHOT-tests.jar
[JENKINS] Archiving <https://builds.apache.org/job/ActiveMQ-Java7/ws/activemq-broker/target/activemq-broker-5.11-SNAPSHOT-sources.jar> to org.apache.activemq/activemq-broker/5.11-SNAPSHOT/activemq-broker-5.11-SNAPSHOT-sources.jar
Sending artifact delta relative to ActiveMQ-Java7 ? ActiveMQ :: Broker #392
Archived 4 artifacts
Archive block size is 32768
Received 0 blocks and 1905057 bytes
Compression is 0.0%
Took 1.9 sec
[JENKINS] Archiving <https://builds.apache.org/job/ActiveMQ-Java7/ws/activemq-ra/pom.xml> to org.apache.activemq/activemq-ra/5.11-SNAPSHOT/activemq-ra-5.11-SNAPSHOT.pom
[JENKINS] Archiving <https://builds.apache.org/job/ActiveMQ-Java7/ws/activemq-ra/target/activemq-ra-5.11-SNAPSHOT.jar> to org.apache.activemq/activemq-ra/5.11-SNAPSHOT/activemq-ra-5.11-SNAPSHOT.jar
[JENKINS] Archiving <https://builds.apache.org/job/ActiveMQ-Java7/ws/activemq-ra/target/xbean/activemq-ra.xsd> to org.apache.activemq/activemq-ra/5.11-SNAPSHOT/activemq-ra-5.11-SNAPSHOT.xsd
[JENKINS] Archiving <https://builds.apache.org/job/ActiveMQ-Java7/ws/activemq-ra/target/xbean/activemq-ra.xsd.html> to org.apache.activemq/activemq-ra/5.11-SNAPSHOT/activemq-ra-5.11-SNAPSHOT-schema.html
[JENKINS] Archiving <https://builds.apache.org/job/ActiveMQ-Java7/ws/activemq-ra/target/xbean/activemq-ra.xsd.html> to org.apache.activemq/activemq-ra/5.11-SNAPSHOT/activemq-ra-5.11-SNAPSHOT.xsd.html
[JENKINS] Archiving <https://builds.apache.org/job/ActiveMQ-Java7/ws/activemq-ra/target/activemq-ra-5.11-SNAPSHOT-sources.jar> to org.apache.activemq/activemq-ra/5.11-SNAPSHOT/activemq-ra-5.11-SNAPSHOT-sources.jar
Sending artifact delta relative to ActiveMQ-Java7 ? ActiveMQ :: RA #392
Archived 6 artifacts
Archive block size is 32768
Received 0 blocks and 185225 bytes
Compression is 0.0%
Took 0.17 sec
[JENKINS] Archiving <https://builds.apache.org/job/ActiveMQ-Java7/ws/activemq-spring/pom.xml> to org.apache.activemq/activemq-spring/5.11-SNAPSHOT/activemq-spring-5.11-SNAPSHOT.pom
[JENKINS] Archiving <https://builds.apache.org/job/ActiveMQ-Java7/ws/activemq-spring/target/activemq-spring-5.11-SNAPSHOT.jar> to org.apache.activemq/activemq-spring/5.11-SNAPSHOT/activemq-spring-5.11-SNAPSHOT.jar
[JENKINS] Archiving <https://builds.apache.org/job/ActiveMQ-Java7/ws/activemq-spring/target/classes/activemq.xsd> to org.apache.activemq/activemq-spring/5.11-SNAPSHOT/activemq-spring-5.11-SNAPSHOT.xsd
[JENKINS] Archiving <https://builds.apache.org/job/ActiveMQ-Java7/ws/activemq-spring/target/classes/activemq.xsd.html> to org.apache.activemq/activemq-spring/5.11-SNAPSHOT/activemq-spring-5.11-SNAPSHOT-schema.html
[JENKINS] Archiving <https://builds.apache.org/job/ActiveMQ-Java7/ws/activemq-spring/target/activemq-spring-5.11-SNAPSHOT-sources.jar> to org.apache.activemq/activemq-spring/5.11-SNAPSHOT/activemq-spring-5.11-SNAPSHOT-sources.jar
Sending artifact delta relative to ActiveMQ-Java7 ? ActiveMQ :: Spring #392
Archived 5 artifacts
Archive block size is 32768
Received 17 blocks and 513552 bytes
Compression is 52.0%
Took 0.25 sec
[JENKINS] Archiving <https://builds.apache.org/job/ActiveMQ-Java7/ws/activemq-all/dependency-reduced-pom.xml> to org.apache.activemq/activemq-all/5.11-SNAPSHOT/activemq-all-5.11-SNAPSHOT.pom
[JENKINS] Archiving <https://builds.apache.org/job/ActiveMQ-Java7/ws/activemq-all/target/activemq-all-5.11-SNAPSHOT.jar> to org.apache.activemq/activemq-all/5.11-SNAPSHOT/activemq-all-5.11-SNAPSHOT.jar
[JENKINS] Archiving <https://builds.apache.org/job/ActiveMQ-Java7/ws/activemq-all/target/activemq-all-5.11-SNAPSHOT-sources.jar> to org.apache.activemq/activemq-all/5.11-SNAPSHOT/activemq-all-5.11-SNAPSHOT-sources.jar
Sending artifact delta relative to ActiveMQ-Java7 ? ActiveMQ :: All JAR bundle #392
Archived 3 artifacts
Archive block size is 32768
Received 0 blocks and 6352573 bytes
Compression is 0.0%
Took 4.5 sec
[JENKINS] Archiving <https://builds.apache.org/job/ActiveMQ-Java7/ws/activemq-kahadb-store/pom.xml> to org.apache.activemq/activemq-kahadb-store/5.11-SNAPSHOT/activemq-kahadb-store-5.11-SNAPSHOT.pom
[JENKINS] Archiving <https://builds.apache.org/job/ActiveMQ-Java7/ws/activemq-kahadb-store/target/activemq-kahadb-store-5.11-SNAPSHOT.jar> to org.apache.activemq/activemq-kahadb-store/5.11-SNAPSHOT/activemq-kahadb-store-5.11-SNAPSHOT.jar
[JENKINS] Archiving <https://builds.apache.org/job/ActiveMQ-Java7/ws/activemq-kahadb-store/target/activemq-kahadb-store-5.11-SNAPSHOT-sources.jar> to org.apache.activemq/activemq-kahadb-store/5.11-SNAPSHOT/activemq-kahadb-store-5.11-SNAPSHOT-sources.jar
Sending artifact delta relative to ActiveMQ-Java7 ? ActiveMQ :: KahaDB Store #392
Archived 3 artifacts
Archive block size is 32768
Received 0 blocks and 887613 bytes
Compression is 0.0%
Took 0.35 sec
[JENKINS] Archiving <https://builds.apache.org/job/ActiveMQ-Java7/ws/activemq-jaas/pom.xml> to org.apache.activemq/activemq-jaas/5.11-SNAPSHOT/activemq-jaas-5.11-SNAPSHOT.pom
[JENKINS] Archiving <https://builds.apache.org/job/ActiveMQ-Java7/ws/activemq-jaas/target/activemq-jaas-5.11-SNAPSHOT.jar> to org.apache.activemq/activemq-jaas/5.11-SNAPSHOT/activemq-jaas-5.11-SNAPSHOT.jar
[JENKINS] Archiving <https://builds.apache.org/job/ActiveMQ-Java7/ws/activemq-jaas/target/activemq-jaas-5.11-SNAPSHOT-sources.jar> to org.apache.activemq/activemq-jaas/5.11-SNAPSHOT/activemq-jaas-5.11-SNAPSHOT-sources.jar
Sending artifact delta relative to ActiveMQ-Java7 ? ActiveMQ :: JAAS #392
Archived 3 artifacts
Archive block size is 32768
Received 0 blocks and 64183 bytes
Compression is 0.0%
Took 81 ms
[JENKINS] Archiving <https://builds.apache.org/job/ActiveMQ-Java7/ws/activemq-tooling/pom.xml> to org.apache.activemq.tooling/activemq-tooling/5.11-SNAPSHOT/activemq-tooling-5.11-SNAPSHOT.pom
Sending artifact delta relative to ActiveMQ-Java7 ? ActiveMQ :: Tooling #392
Archived 1 artifacts
Archive block size is 32768
Received 0 blocks and 1679 bytes
Compression is 0.0%
Took 68 ms
[JENKINS] Archiving <https://builds.apache.org/job/ActiveMQ-Java7/ws/activemq-partition/pom.xml> to org.apache.activemq/activemq-partition/5.11-SNAPSHOT/activemq-partition-5.11-SNAPSHOT.pom
[JENKINS] Archiving <https://builds.apache.org/job/ActiveMQ-Java7/ws/activemq-partition/target/activemq-partition-5.11-SNAPSHOT.jar> to org.apache.activemq/activemq-partition/5.11-SNAPSHOT/activemq-partition-5.11-SNAPSHOT.jar
[JENKINS] Archiving <https://builds.apache.org/job/ActiveMQ-Java7/ws/activemq-partition/target/activemq-partition-5.11-SNAPSHOT-sources.jar> to org.apache.activemq/activemq-partition/5.11-SNAPSHOT/activemq-partition-5.11-SNAPSHOT-sources.jar
Sending artifact delta relative to ActiveMQ-Java7 ? ActiveMQ :: Partition Management #392
Archived 3 artifacts
Archive block size is 32768
Received 0 blocks and 46541 bytes
Compression is 0.0%
Took 76 ms
[JENKINS] Archiving <https://builds.apache.org/job/ActiveMQ-Java7/ws/activemq-web/pom.xml> to org.apache.activemq/activemq-web/5.11-SNAPSHOT/activemq-web-5.11-SNAPSHOT.pom
[JENKINS] Archiving <https://builds.apache.org/job/ActiveMQ-Java7/ws/activemq-web/target/activemq-web-5.11-SNAPSHOT.jar> to org.apache.activemq/activemq-web/5.11-SNAPSHOT/activemq-web-5.11-SNAPSHOT.jar
[JENKINS] Archiving <https://builds.apache.org/job/ActiveMQ-Java7/ws/activemq-web/target/activemq-web-5.11-SNAPSHOT-sources.jar> to org.apache.activemq/activemq-web/5.11-SNAPSHOT/activemq-web-5.11-SNAPSHOT-sources.jar
Sending artifact delta relative to ActiveMQ-Java7 ? ActiveMQ :: Web #392
Archived 3 artifacts
Archive block size is 32768
Received 0 blocks and 211733 bytes
Compression is 0.0%
Took 1.8 sec
[JENKINS] Archiving <https://builds.apache.org/job/ActiveMQ-Java7/ws/activemq-leveldb-store/pom.xml> to org.apache.activemq/activemq-leveldb-store/5.11-SNAPSHOT/activemq-leveldb-store-5.11-SNAPSHOT.pom
[JENKINS] Archiving <https://builds.apache.org/job/ActiveMQ-Java7/ws/activemq-leveldb-store/target/activemq-leveldb-store-5.11-SNAPSHOT.jar> to org.apache.activemq/activemq-leveldb-store/5.11-SNAPSHOT/activemq-leveldb-store-5.11-SNAPSHOT.jar
[JENKINS] Archiving <https://builds.apache.org/job/ActiveMQ-Java7/ws/activemq-leveldb-store/target/activemq-leveldb-store-5.11-SNAPSHOT-sources.jar> to org.apache.activemq/activemq-leveldb-store/5.11-SNAPSHOT/activemq-leveldb-store-5.11-SNAPSHOT-sources.jar
Sending artifact delta relative to ActiveMQ-Java7 ? ActiveMQ :: LevelDB Store #392
Archived 3 artifacts
Archive block size is 32768
Received 0 blocks and 1088234 bytes
Compression is 0.0%
Took 0.44 sec
[JENKINS] Archiving <https://builds.apache.org/job/ActiveMQ-Java7/ws/activemq-fileserver/pom.xml> to org.apache.activemq/activemq-fileserver/5.11-SNAPSHOT/activemq-fileserver-5.11-SNAPSHOT.pom
[JENKINS] Archiving <https://builds.apache.org/job/ActiveMQ-Java7/ws/activemq-fileserver/target/activemq-fileserver-5.11-SNAPSHOT.war> to org.apache.activemq/activemq-fileserver/5.11-SNAPSHOT/activemq-fileserver-5.11-SNAPSHOT.war
[JENKINS] Archiving <https://builds.apache.org/job/ActiveMQ-Java7/ws/activemq-fileserver/target/activemq-fileserver-5.11-SNAPSHOT-sources.jar> to org.apache.activemq/activemq-fileserver/5.11-SNAPSHOT/activemq-fileserver-5.11-SNAPSHOT-sources.jar
Sending artifact delta relative to ActiveMQ-Java7 ? ActiveMQ :: File Server #392
Archived 3 artifacts
Archive block size is 32768
Received 0 blocks and 58361 bytes
Compression is 0.0%
Took 89 ms
[JENKINS] Archiving <https://builds.apache.org/job/ActiveMQ-Java7/ws/activemq-karaf/pom.xml> to org.apache.activemq/activemq-karaf/5.11-SNAPSHOT/activemq-karaf-5.11-SNAPSHOT.pom
[JENKINS] Archiving <https://builds.apache.org/job/ActiveMQ-Java7/ws/activemq-karaf/target/activemq-karaf-5.11-SNAPSHOT.jar> to org.apache.activemq/activemq-karaf/5.11-SNAPSHOT/activemq-karaf-5.11-SNAPSHOT.jar
[JENKINS] Archiving <https://builds.apache.org/job/ActiveMQ-Java7/ws/activemq-karaf/target/classes/features.xml> to org.apache.activemq/activemq-karaf/5.11-SNAPSHOT/activemq-karaf-5.11-SNAPSHOT-features.xml
[JENKINS] Archiving <https://builds.apache.org/job/ActiveMQ-Java7/ws/activemq-karaf/target/classes/features-core.xml> to org.apache.activemq/activemq-karaf/5.11-SNAPSHOT/activemq-karaf-5.11-SNAPSHOT-features-core.xml
[JENKINS] Archiving <https://builds.apache.org/job/ActiveMQ-Java7/ws/activemq-karaf/target/classes/activemq.xml> to org.apache.activemq/activemq-karaf/5.11-SNAPSHOT/activemq-karaf-5.11-SNAPSHOT-activemq.xml
[JENKINS] Archiving <https://builds.apache.org/job/ActiveMQ-Java7/ws/activemq-karaf/target/classes/org.apache.activemq.server-default.cfg> to org.apache.activemq/activemq-karaf/5.11-SNAPSHOT/activemq-karaf-5.11-SNAPSHOT-activemq.cfg
[JENKINS] Archiving <https://builds.apache.org/job/ActiveMQ-Java7/ws/activemq-karaf/target/classes/org.apache.activemq.webconsole.cfg> to org.apache.activemq/activemq-karaf/5.11-SNAPSHOT/activemq-karaf-5.11-SNAPSHOT-activemq-webconsole.cfg
[JENKINS] Archiving <https://builds.apache.org/job/ActiveMQ-Java7/ws/activemq-karaf/target/activemq-karaf-5.11-SNAPSHOT-sources.jar> to org.apache.activemq/activemq-karaf/5.11-SNAPSHOT/activemq-karaf-5.11-SNAPSHOT-sources.jar
Sending artifact delta relative to ActiveMQ-Java7 ? ActiveMQ :: Apache Karaf #392
Archived 8 artifacts
Archive block size is 32768
Received 0 blocks and 69244 bytes
Compression is 0.0%
Took 1.8 sec
[JENKINS] Archiving <https://builds.apache.org/job/ActiveMQ-Java7/ws/activemq-http/pom.xml> to org.apache.activemq/activemq-http/5.11-SNAPSHOT/activemq-http-5.11-SNAPSHOT.pom
[JENKINS] Archiving <https://builds.apache.org/job/ActiveMQ-Java7/ws/activemq-http/target/activemq-http-5.11-SNAPSHOT.jar> to org.apache.activemq/activemq-http/5.11-SNAPSHOT/activemq-http-5.11-SNAPSHOT.jar
[JENKINS] Archiving <https://builds.apache.org/job/ActiveMQ-Java7/ws/activemq-http/target/activemq-http-5.11-SNAPSHOT-sources.jar> to org.apache.activemq/activemq-http/5.11-SNAPSHOT/activemq-http-5.11-SNAPSHOT-sources.jar
Sending artifact delta relative to ActiveMQ-Java7 ? ActiveMQ :: HTTP Protocol Support #392
Archived 3 artifacts
Archive block size is 32768
Received 0 blocks and 150780 bytes
Compression is 0.0%
Took 0.17 sec
Sending e-mails to: commits@activemq.apache.org
channel stopped
[locks-and-latches] Releasing all the locks
[locks-and-latches] All the locks released
Jenkins build is still unstable: ActiveMQ-Java7 #392
Posted by Apache Jenkins Server <je...@builds.apache.org>.
See <https://builds.apache.org/job/ActiveMQ-Java7/392/>
Jenkins build is still unstable: ActiveMQ-Java7 #391
Posted by Apache Jenkins Server <je...@builds.apache.org>.
See <https://builds.apache.org/job/ActiveMQ-Java7/changes>
Jenkins build is unstable: ActiveMQ-Java7 #390
Posted by Apache Jenkins Server <je...@builds.apache.org>.
See <https://builds.apache.org/job/ActiveMQ-Java7/390/changes>
Build failed in Jenkins: ActiveMQ-Java7 #389
Posted by Apache Jenkins Server <je...@builds.apache.org>.
See <https://builds.apache.org/job/ActiveMQ-Java7/389/changes>
Changes:
[dejan] https://issues.apache.org/jira/browse/AMQ-5105 - problem starting broker with leveldb store
[gtully] https://issues.apache.org/jira/browse/AMQ-5279 - ensure poison on failover redelivery only when delivery is not pending else where
------------------------------------------
[...truncated 29982 lines...]
at java.util.concurrent.FutureTask.run(FutureTask.java:166)
at java.util.concurrent.ThreadPoolExecutor.runWorker(ThreadPoolExecutor.java:1145)
at java.util.concurrent.ThreadPoolExecutor$Worker.run(ThreadPoolExecutor.java:615)
at java.lang.Thread.run(Thread.java:724)
Caused by: org.apache.maven.plugin.MojoExecutionException: Error assembling JAR
at org.apache.maven.plugin.jar.AbstractJarMojo.createArchive(AbstractJarMojo.java:237)
at org.apache.maven.plugin.jar.AbstractJarMojo.execute(AbstractJarMojo.java:255)
at org.apache.maven.plugin.DefaultBuildPluginManager.executeMojo(DefaultBuildPluginManager.java:101)
at org.apache.maven.lifecycle.internal.MojoExecutor.execute(MojoExecutor.java:209)
... 31 more
Caused by: org.codehaus.plexus.archiver.ArchiverException: <https://builds.apache.org/job/ActiveMQ-Java7/ws/activemq-log4j-appender/pom.xml> isn't a file.
at org.codehaus.plexus.archiver.AbstractArchiver.addFile(AbstractArchiver.java:375)
at org.codehaus.plexus.archiver.AbstractArchiver.addFile(AbstractArchiver.java:316)
at org.apache.maven.archiver.MavenArchiver.createArchive(MavenArchiver.java:526)
at org.apache.maven.plugin.jar.AbstractJarMojo.createArchive(AbstractJarMojo.java:230)
... 34 more
[ERROR] Failed to execute goal org.apache.cxf:cxf-xjc-plugin:3.0.1:xsdtojava (compile-xsd) on project activemq-runtime-config: schema_reference.4: Failed to read schema document '<https://builds.apache.org/job/ActiveMQ-Java7/ws/activemq-spring/target/classes/activemq.xsd',> because 1) could not find the document; 2) the document could not be read; 3) the root element of the document is not <xsd:schema>. <https://builds.apache.org/job/ActiveMQ-Java7/ws/activemq-spring/target/classes/activemq.xsd> (No such file or directory) -> [Help 1]
org.apache.maven.lifecycle.LifecycleExecutionException: Failed to execute goal org.apache.cxf:cxf-xjc-plugin:3.0.1:xsdtojava (compile-xsd) on project activemq-runtime-config: schema_reference.4: Failed to read schema document '<https://builds.apache.org/job/ActiveMQ-Java7/ws/activemq-spring/target/classes/activemq.xsd',> because 1) could not find the document; 2) the document could not be read; 3) the root element of the document is not <xsd:schema>.
at org.apache.maven.lifecycle.internal.MojoExecutor.execute(MojoExecutor.java:217)
at org.apache.maven.lifecycle.internal.MojoExecutor.execute(MojoExecutor.java:153)
at org.apache.maven.lifecycle.internal.MojoExecutor.execute(MojoExecutor.java:145)
at org.apache.maven.lifecycle.internal.LifecycleModuleBuilder.buildProject(LifecycleModuleBuilder.java:84)
at org.apache.maven.lifecycle.internal.LifecycleModuleBuilder.buildProject(LifecycleModuleBuilder.java:59)
at org.apache.maven.lifecycle.internal.LifecycleStarter.singleThreadedBuild(LifecycleStarter.java:183)
at org.apache.maven.lifecycle.internal.LifecycleStarter.execute(LifecycleStarter.java:161)
at org.apache.maven.DefaultMaven.doExecute(DefaultMaven.java:320)
at org.apache.maven.DefaultMaven.execute(DefaultMaven.java:156)
at org.jvnet.hudson.maven3.launcher.Maven3Launcher.main(Maven3Launcher.java:117)
at sun.reflect.NativeMethodAccessorImpl.invoke0(Native Method)
at sun.reflect.NativeMethodAccessorImpl.invoke(NativeMethodAccessorImpl.java:57)
at sun.reflect.DelegatingMethodAccessorImpl.invoke(DelegatingMethodAccessorImpl.java:43)
at java.lang.reflect.Method.invoke(Method.java:606)
at org.codehaus.plexus.classworlds.launcher.Launcher.launchStandard(Launcher.java:329)
at org.codehaus.plexus.classworlds.launcher.Launcher.launch(Launcher.java:239)
at org.jvnet.hudson.maven3.agent.Maven3Main.launch(Maven3Main.java:178)
at sun.reflect.NativeMethodAccessorImpl.invoke0(Native Method)
at sun.reflect.NativeMethodAccessorImpl.invoke(NativeMethodAccessorImpl.java:57)
at sun.reflect.DelegatingMethodAccessorImpl.invoke(DelegatingMethodAccessorImpl.java:43)
at java.lang.reflect.Method.invoke(Method.java:606)
at hudson.maven.Maven3Builder.call(Maven3Builder.java:134)
at hudson.maven.Maven3Builder.call(Maven3Builder.java:69)
at hudson.remoting.UserRequest.perform(UserRequest.java:118)
at hudson.remoting.UserRequest.perform(UserRequest.java:48)
at hudson.remoting.Request$2.run(Request.java:328)
at hudson.remoting.InterceptingExecutorService$1.call(InterceptingExecutorService.java:72)
at java.util.concurrent.FutureTask$Sync.innerRun(FutureTask.java:334)
at java.util.concurrent.FutureTask.run(FutureTask.java:166)
at java.util.concurrent.ThreadPoolExecutor.runWorker(ThreadPoolExecutor.java:1145)
at java.util.concurrent.ThreadPoolExecutor$Worker.run(ThreadPoolExecutor.java:615)
at java.lang.Thread.run(Thread.java:724)
Caused by: org.apache.maven.plugin.MojoExecutionException: schema_reference.4: Failed to read schema document '<https://builds.apache.org/job/ActiveMQ-Java7/ws/activemq-spring/target/classes/activemq.xsd',> because 1) could not find the document; 2) the document could not be read; 3) the root element of the document is not <xsd:schema>.
at org.apache.cxf.maven_plugin.AbstractXSDToJavaMojo.execute(AbstractXSDToJavaMojo.java:237)
at org.apache.cxf.maven_plugin.XSDToJavaMojo.execute(XSDToJavaMojo.java:41)
at org.apache.maven.plugin.DefaultBuildPluginManager.executeMojo(DefaultBuildPluginManager.java:101)
at org.apache.maven.lifecycle.internal.MojoExecutor.execute(MojoExecutor.java:209)
... 31 more
Caused by: org.xml.sax.SAXParseException; schema_reference.4: Failed to read schema document '<https://builds.apache.org/job/ActiveMQ-Java7/ws/activemq-spring/target/classes/activemq.xsd',> because 1) could not find the document; 2) the document could not be read; 3) the root element of the document is not <xsd:schema>.
at org.apache.cxf.maven_plugin.XJCErrorListener.error(XJCErrorListener.java:64)
at com.sun.tools.xjc.util.ErrorReceiverFilter.error(ErrorReceiverFilter.java:82)
at com.sun.tools.xjc.util.ErrorReceiverFilter.error(ErrorReceiverFilter.java:82)
at com.sun.org.apache.xerces.internal.util.ErrorHandlerWrapper.error(ErrorHandlerWrapper.java:137)
at com.sun.org.apache.xerces.internal.impl.XMLErrorReporter.reportError(XMLErrorReporter.java:437)
at com.sun.org.apache.xerces.internal.impl.XMLErrorReporter.reportError(XMLErrorReporter.java:347)
at com.sun.org.apache.xerces.internal.impl.xs.traversers.XSDHandler.reportSchemaErr(XSDHandler.java:4128)
at com.sun.org.apache.xerces.internal.impl.xs.traversers.XSDHandler.reportSchemaError(XSDHandler.java:4111)
at com.sun.org.apache.xerces.internal.impl.xs.traversers.XSDHandler.getSchemaDocument1(XSDHandler.java:2452)
at com.sun.org.apache.xerces.internal.impl.xs.traversers.XSDHandler.getSchemaDocument(XSDHandler.java:2280)
at com.sun.org.apache.xerces.internal.impl.xs.traversers.XSDHandler.parseSchema(XSDHandler.java:549)
at com.sun.org.apache.xerces.internal.impl.xs.XMLSchemaLoader.loadSchema(XMLSchemaLoader.java:588)
at com.sun.org.apache.xerces.internal.impl.xs.XMLSchemaLoader.loadGrammar(XMLSchemaLoader.java:555)
at com.sun.org.apache.xerces.internal.impl.xs.XMLSchemaLoader.loadGrammar(XMLSchemaLoader.java:521)
at com.sun.org.apache.xerces.internal.jaxp.validation.XMLSchemaFactory.newSchema(XMLSchemaFactory.java:240)
at com.sun.tools.xjc.reader.xmlschema.parser.SchemaConstraintChecker.check(SchemaConstraintChecker.java:111)
at com.sun.tools.xjc.ModelLoader.loadXMLSchema(ModelLoader.java:360)
at com.sun.tools.xjc.ModelLoader.load(ModelLoader.java:174)
at com.sun.tools.xjc.ModelLoader.load(ModelLoader.java:119)
at sun.reflect.NativeMethodAccessorImpl.invoke0(Native Method)
at sun.reflect.NativeMethodAccessorImpl.invoke(NativeMethodAccessorImpl.java:57)
at sun.reflect.DelegatingMethodAccessorImpl.invoke(DelegatingMethodAccessorImpl.java:43)
at java.lang.reflect.Method.invoke(Method.java:606)
at org.apache.cxf.maven_plugin.XSDToJavaRunner.loadModel(XSDToJavaRunner.java:182)
at org.apache.cxf.maven_plugin.XSDToJavaRunner.run(XSDToJavaRunner.java:134)
at org.apache.cxf.maven_plugin.AbstractXSDToJavaMojo.run(AbstractXSDToJavaMojo.java:285)
at org.apache.cxf.maven_plugin.AbstractXSDToJavaMojo.execute(AbstractXSDToJavaMojo.java:224)
... 34 more
Caused by: java.io.FileNotFoundException: <https://builds.apache.org/job/ActiveMQ-Java7/ws/activemq-spring/target/classes/activemq.xsd> (No such file or directory)
at java.io.FileInputStream.open(Native Method)
at java.io.FileInputStream.<init>(FileInputStream.java:138)
at java.io.FileInputStream.<init>(FileInputStream.java:97)
at sun.net.www.protocol.file.FileURLConnection.connect(FileURLConnection.java:90)
at sun.net.www.protocol.file.FileURLConnection.getInputStream(FileURLConnection.java:188)
at com.sun.org.apache.xerces.internal.impl.XMLEntityManager.setupCurrentEntity(XMLEntityManager.java:609)
at com.sun.org.apache.xerces.internal.impl.XMLVersionDetector.determineDocVersion(XMLVersionDetector.java:189)
at com.sun.org.apache.xerces.internal.parsers.XML11Configuration.parse(XML11Configuration.java:799)
at com.sun.org.apache.xerces.internal.parsers.XML11Configuration.parse(XML11Configuration.java:764)
at com.sun.org.apache.xerces.internal.parsers.XMLParser.parse(XMLParser.java:123)
at com.sun.org.apache.xerces.internal.parsers.AbstractSAXParser.parse(AbstractSAXParser.java:1210)
at com.sun.org.apache.xerces.internal.impl.xs.traversers.XSDHandler.getSchemaDocument(XSDHandler.java:2252)
... 51 more
[ERROR] Failed to execute goal org.apache.maven.plugins:maven-install-plugin:2.3.1:install (default-install) on project activemq-tooling: Failed to install artifact org.apache.activemq.tooling:activemq-tooling:pom:5.11-SNAPSHOT: <https://builds.apache.org/job/ActiveMQ-Java7/ws/activemq-tooling/pom.xml> (No such file or directory) -> [Help 1]
org.apache.maven.lifecycle.LifecycleExecutionException: Failed to execute goal org.apache.maven.plugins:maven-install-plugin:2.3.1:install (default-install) on project activemq-tooling: Failed to install artifact org.apache.activemq.tooling:activemq-tooling:pom:5.11-SNAPSHOT: <https://builds.apache.org/job/ActiveMQ-Java7/ws/activemq-tooling/pom.xml> (No such file or directory)
at org.apache.maven.lifecycle.internal.MojoExecutor.execute(MojoExecutor.java:217)
at org.apache.maven.lifecycle.internal.MojoExecutor.execute(MojoExecutor.java:153)
at org.apache.maven.lifecycle.internal.MojoExecutor.execute(MojoExecutor.java:145)
at org.apache.maven.lifecycle.internal.LifecycleModuleBuilder.buildProject(LifecycleModuleBuilder.java:84)
at org.apache.maven.lifecycle.internal.LifecycleModuleBuilder.buildProject(LifecycleModuleBuilder.java:59)
at org.apache.maven.lifecycle.internal.LifecycleStarter.singleThreadedBuild(LifecycleStarter.java:183)
at org.apache.maven.lifecycle.internal.LifecycleStarter.execute(LifecycleStarter.java:161)
at org.apache.maven.DefaultMaven.doExecute(DefaultMaven.java:320)
at org.apache.maven.DefaultMaven.execute(DefaultMaven.java:156)
at org.jvnet.hudson.maven3.launcher.Maven3Launcher.main(Maven3Launcher.java:117)
at sun.reflect.NativeMethodAccessorImpl.invoke0(Native Method)
at sun.reflect.NativeMethodAccessorImpl.invoke(NativeMethodAccessorImpl.java:57)
at sun.reflect.DelegatingMethodAccessorImpl.invoke(DelegatingMethodAccessorImpl.java:43)
at java.lang.reflect.Method.invoke(Method.java:606)
at org.codehaus.plexus.classworlds.launcher.Launcher.launchStandard(Launcher.java:329)
at org.codehaus.plexus.classworlds.launcher.Launcher.launch(Launcher.java:239)
at org.jvnet.hudson.maven3.agent.Maven3Main.launch(Maven3Main.java:178)
at sun.reflect.NativeMethodAccessorImpl.invoke0(Native Method)
at sun.reflect.NativeMethodAccessorImpl.invoke(NativeMethodAccessorImpl.java:57)
at sun.reflect.DelegatingMethodAccessorImpl.invoke(DelegatingMethodAccessorImpl.java:43)
at java.lang.reflect.Method.invoke(Method.java:606)
at hudson.maven.Maven3Builder.call(Maven3Builder.java:134)
at hudson.maven.Maven3Builder.call(Maven3Builder.java:69)
at hudson.remoting.UserRequest.perform(UserRequest.java:118)
at hudson.remoting.UserRequest.perform(UserRequest.java:48)
at hudson.remoting.Request$2.run(Request.java:328)
at hudson.remoting.InterceptingExecutorService$1.call(InterceptingExecutorService.java:72)
at java.util.concurrent.FutureTask$Sync.innerRun(FutureTask.java:334)
at java.util.concurrent.FutureTask.run(FutureTask.java:166)
at java.util.concurrent.ThreadPoolExecutor.runWorker(ThreadPoolExecutor.java:1145)
at java.util.concurrent.ThreadPoolExecutor$Worker.run(ThreadPoolExecutor.java:615)
at java.lang.Thread.run(Thread.java:724)
Caused by: org.apache.maven.plugin.MojoExecutionException: Failed to install artifact org.apache.activemq.tooling:activemq-tooling:pom:5.11-SNAPSHOT: <https://builds.apache.org/job/ActiveMQ-Java7/ws/activemq-tooling/pom.xml> (No such file or directory)
at org.apache.maven.plugin.install.InstallMojo.execute(InstallMojo.java:139)
at org.apache.maven.plugin.DefaultBuildPluginManager.executeMojo(DefaultBuildPluginManager.java:101)
at org.apache.maven.lifecycle.internal.MojoExecutor.execute(MojoExecutor.java:209)
... 31 more
Caused by: org.apache.maven.artifact.installer.ArtifactInstallationException: Failed to install artifact org.apache.activemq.tooling:activemq-tooling:pom:5.11-SNAPSHOT: <https://builds.apache.org/job/ActiveMQ-Java7/ws/activemq-tooling/pom.xml> (No such file or directory)
at org.apache.maven.artifact.installer.DefaultArtifactInstaller.install(DefaultArtifactInstaller.java:111)
at org.apache.maven.plugin.install.InstallMojo.execute(InstallMojo.java:89)
... 33 more
Caused by: org.sonatype.aether.installation.InstallationException: Failed to install artifact org.apache.activemq.tooling:activemq-tooling:pom:5.11-SNAPSHOT: <https://builds.apache.org/job/ActiveMQ-Java7/ws/activemq-tooling/pom.xml> (No such file or directory)
at org.sonatype.aether.impl.internal.DefaultInstaller.install(DefaultInstaller.java:279)
at org.sonatype.aether.impl.internal.DefaultInstaller.install(DefaultInstaller.java:201)
at org.sonatype.aether.impl.internal.DefaultInstaller.install(DefaultInstaller.java:158)
at org.sonatype.aether.impl.internal.DefaultRepositorySystem.install(DefaultRepositorySystem.java:436)
at org.apache.maven.artifact.installer.DefaultArtifactInstaller.install(DefaultArtifactInstaller.java:107)
... 34 more
Caused by: java.io.FileNotFoundException: <https://builds.apache.org/job/ActiveMQ-Java7/ws/activemq-tooling/pom.xml> (No such file or directory)
at java.io.FileInputStream.open(Native Method)
at java.io.FileInputStream.<init>(FileInputStream.java:138)
at org.sonatype.aether.impl.internal.DefaultFileProcessor.copy(DefaultFileProcessor.java:118)
at org.sonatype.aether.impl.internal.DefaultInstaller.install(DefaultInstaller.java:266)
... 38 more
[ERROR] Failed to execute goal org.apache.felix:maven-bundle-plugin:2.3.7:bundle (default-bundle) on project activemq-blueprint: Internal error in maven-bundle-plugin: <https://builds.apache.org/job/ActiveMQ-Java7/ws/activemq-blueprint/pom.xml> (No such file or directory) -> [Help 1]
org.apache.maven.lifecycle.LifecycleExecutionException: Failed to execute goal org.apache.felix:maven-bundle-plugin:2.3.7:bundle (default-bundle) on project activemq-blueprint: Internal error in maven-bundle-plugin
at org.apache.maven.lifecycle.internal.MojoExecutor.execute(MojoExecutor.java:217)
at org.apache.maven.lifecycle.internal.MojoExecutor.execute(MojoExecutor.java:153)
at org.apache.maven.lifecycle.internal.MojoExecutor.execute(MojoExecutor.java:145)
at org.apache.maven.lifecycle.internal.LifecycleModuleBuilder.buildProject(LifecycleModuleBuilder.java:84)
at org.apache.maven.lifecycle.internal.LifecycleModuleBuilder.buildProject(LifecycleModuleBuilder.java:59)
at org.apache.maven.lifecycle.internal.LifecycleStarter.singleThreadedBuild(LifecycleStarter.java:183)
at org.apache.maven.lifecycle.internal.LifecycleStarter.execute(LifecycleStarter.java:161)
at org.apache.maven.DefaultMaven.doExecute(DefaultMaven.java:320)
at org.apache.maven.DefaultMaven.execute(DefaultMaven.java:156)
at org.jvnet.hudson.maven3.launcher.Maven3Launcher.main(Maven3Launcher.java:117)
at sun.reflect.NativeMethodAccessorImpl.invoke0(Native Method)
at sun.reflect.NativeMethodAccessorImpl.invoke(NativeMethodAccessorImpl.java:57)
at sun.reflect.DelegatingMethodAccessorImpl.invoke(DelegatingMethodAccessorImpl.java:43)
at java.lang.reflect.Method.invoke(Method.java:606)
at org.codehaus.plexus.classworlds.launcher.Launcher.launchStandard(Launcher.java:329)
at org.codehaus.plexus.classworlds.launcher.Launcher.launch(Launcher.java:239)
at org.jvnet.hudson.maven3.agent.Maven3Main.launch(Maven3Main.java:178)
at sun.reflect.NativeMethodAccessorImpl.invoke0(Native Method)
at sun.reflect.NativeMethodAccessorImpl.invoke(NativeMethodAccessorImpl.java:57)
at sun.reflect.DelegatingMethodAccessorImpl.invoke(DelegatingMethodAccessorImpl.java:43)
at java.lang.reflect.Method.invoke(Method.java:606)
at hudson.maven.Maven3Builder.call(Maven3Builder.java:134)
at hudson.maven.Maven3Builder.call(Maven3Builder.java:69)
at hudson.remoting.UserRequest.perform(UserRequest.java:118)
at hudson.remoting.UserRequest.perform(UserRequest.java:48)
at hudson.remoting.Request$2.run(Request.java:328)
at hudson.remoting.InterceptingExecutorService$1.call(InterceptingExecutorService.java:72)
at java.util.concurrent.FutureTask$Sync.innerRun(FutureTask.java:334)
at java.util.concurrent.FutureTask.run(FutureTask.java:166)
at java.util.concurrent.ThreadPoolExecutor.runWorker(ThreadPoolExecutor.java:1145)
at java.util.concurrent.ThreadPoolExecutor$Worker.run(ThreadPoolExecutor.java:615)
at java.lang.Thread.run(Thread.java:724)
Caused by: org.apache.maven.plugin.MojoExecutionException: Internal error in maven-bundle-plugin
at org.apache.felix.bundleplugin.BundlePlugin.execute(BundlePlugin.java:412)
at org.apache.felix.bundleplugin.BundlePlugin.execute(BundlePlugin.java:264)
at org.apache.felix.bundleplugin.BundlePlugin.execute(BundlePlugin.java:255)
at org.apache.maven.plugin.DefaultBuildPluginManager.executeMojo(DefaultBuildPluginManager.java:101)
at org.apache.maven.lifecycle.internal.MojoExecutor.execute(MojoExecutor.java:209)
... 31 more
Caused by: java.io.FileNotFoundException: <https://builds.apache.org/job/ActiveMQ-Java7/ws/activemq-blueprint/pom.xml> (No such file or directory)
at java.io.FileInputStream.open(Native Method)
at java.io.FileInputStream.<init>(FileInputStream.java:138)
at aQute.lib.osgi.FileResource.openInputStream(FileResource.java:15)
at aQute.lib.osgi.FileResource.copy(FileResource.java:36)
at aQute.lib.osgi.FileResource.write(FileResource.java:31)
at aQute.lib.osgi.Jar.writeResource(Jar.java:445)
at aQute.lib.osgi.Jar.write(Jar.java:224)
at aQute.lib.osgi.Jar.write(Jar.java:192)
at org.apache.felix.bundleplugin.BundlePlugin.execute(BundlePlugin.java:362)
... 35 more
[ERROR]
[ERROR] Re-run Maven using the -X switch to enable full debug logging.
[ERROR]
[ERROR] For more information about the errors and possible solutions, please read the following articles:
[ERROR] [Help 1] http://cwiki.apache.org/confluence/display/MAVEN/MojoExecutionException
[ERROR]
[ERROR] After correcting the problems, you can resume the build with the command
[ERROR] mvn <goals> -rf :activemq-amqp
[JENKINS] Archiving <https://builds.apache.org/job/ActiveMQ-Java7/ws/activemq-openwire-legacy/pom.xml> to org.apache.activemq/activemq-openwire-legacy/5.11-SNAPSHOT/activemq-openwire-legacy-5.11-SNAPSHOT.pom
[JENKINS] Archiving <https://builds.apache.org/job/ActiveMQ-Java7/ws/activemq-openwire-legacy/target/activemq-openwire-legacy-5.11-SNAPSHOT.jar> to org.apache.activemq/activemq-openwire-legacy/5.11-SNAPSHOT/activemq-openwire-legacy-5.11-SNAPSHOT.jar
[JENKINS] Archiving <https://builds.apache.org/job/ActiveMQ-Java7/ws/activemq-openwire-legacy/target/activemq-openwire-legacy-5.11-SNAPSHOT-sources.jar> to org.apache.activemq/activemq-openwire-legacy/5.11-SNAPSHOT/activemq-openwire-legacy-5.11-SNAPSHOT-sources.jar
Sending artifact delta relative to ActiveMQ-Java7 ? ActiveMQ :: Openwire Legacy Support #388
Sending e-mails to: commits@activemq.apache.org
Sending e-mails to: commits@activemq.apache.org
Sending e-mails to: commits@activemq.apache.org
Sending e-mails to: commits@activemq.apache.org
Sending e-mails to: commits@activemq.apache.org
Sending e-mails to: commits@activemq.apache.org
Sending e-mails to: commits@activemq.apache.org
channel stopped
[locks-and-latches] Releasing all the locks
[locks-and-latches] All the locks released
ERROR: Failed to parse POMs
hudson.util.IOException2: null
stream=
at com.cloudbees.jenkins.plugins.jsync.archiver.JSyncArtifactManager.inflate(JSyncArtifactManager.java:264)
at com.cloudbees.jenkins.plugins.jsync.archiver.JSyncArtifactManager.remoteSync(JSyncArtifactManager.java:131)
at com.cloudbees.jenkins.plugins.jsync.archiver.JSyncArtifactManager.archive(JSyncArtifactManager.java:67)
at hudson.maven.MavenBuild$ProxyImpl.performArchiving(MavenBuild.java:474)
at hudson.maven.MavenModuleSetBuild$MavenModuleSetBuildExecution.doRun(MavenModuleSetBuild.java:845)
at hudson.model.AbstractBuild$AbstractBuildExecution.run(AbstractBuild.java:585)
at hudson.model.Run.execute(Run.java:1676)
at hudson.maven.MavenModuleSetBuild.run(MavenModuleSetBuild.java:529)
at hudson.model.ResourceController.execute(ResourceController.java:88)
at hudson.model.Executor.run(Executor.java:231)
Caused by: java.io.EOFException
at java.util.zip.GZIPInputStream.readUByte(GZIPInputStream.java:264)
at java.util.zip.GZIPInputStream.readUShort(GZIPInputStream.java:254)
at java.util.zip.GZIPInputStream.readHeader(GZIPInputStream.java:163)
at java.util.zip.GZIPInputStream.<init>(GZIPInputStream.java:78)
at com.cloudbees.jenkins.plugins.jsync.archiver.JSyncArtifactManager.inflate(JSyncArtifactManager.java:260)
... 9 more
Build failed in Jenkins: ActiveMQ-Java7 #388
Posted by Apache Jenkins Server <je...@builds.apache.org>.
See <https://builds.apache.org/job/ActiveMQ-Java7/388/changes>
Changes:
[tabish121] Fix small typo in the docs
------------------------------------------
[...truncated 5378 lines...]
Archived 3 artifacts
Archive block size is 32768
Received 0 blocks and 24881 bytes
Compression is 0.0%
Took 77 ms
[JENKINS] Archiving <https://builds.apache.org/job/ActiveMQ-Java7/ws/activemq-mqtt/pom.xml> to org.apache.activemq/activemq-mqtt/5.11-SNAPSHOT/activemq-mqtt-5.11-SNAPSHOT.pom
[JENKINS] Archiving <https://builds.apache.org/job/ActiveMQ-Java7/ws/activemq-mqtt/target/activemq-mqtt-5.11-SNAPSHOT.jar> to org.apache.activemq/activemq-mqtt/5.11-SNAPSHOT/activemq-mqtt-5.11-SNAPSHOT.jar
[JENKINS] Archiving <https://builds.apache.org/job/ActiveMQ-Java7/ws/activemq-mqtt/target/activemq-mqtt-5.11-SNAPSHOT-sources.jar> to org.apache.activemq/activemq-mqtt/5.11-SNAPSHOT/activemq-mqtt-5.11-SNAPSHOT-sources.jar
Sending artifact delta relative to ActiveMQ-Java7 ? ActiveMQ :: MQTT Protocol #387
Archived 3 artifacts
Archive block size is 32768
Received 0 blocks and 125849 bytes
Compression is 0.0%
Took 0.21 sec
[JENKINS] Archiving <https://builds.apache.org/job/ActiveMQ-Java7/ws/activemq-shiro/pom.xml> to org.apache.activemq/activemq-shiro/5.11-SNAPSHOT/activemq-shiro-5.11-SNAPSHOT.pom
[JENKINS] Archiving <https://builds.apache.org/job/ActiveMQ-Java7/ws/activemq-shiro/target/activemq-shiro-5.11-SNAPSHOT.jar> to org.apache.activemq/activemq-shiro/5.11-SNAPSHOT/activemq-shiro-5.11-SNAPSHOT.jar
[JENKINS] Archiving <https://builds.apache.org/job/ActiveMQ-Java7/ws/activemq-shiro/target/activemq-shiro-5.11-SNAPSHOT-sources.jar> to org.apache.activemq/activemq-shiro/5.11-SNAPSHOT/activemq-shiro-5.11-SNAPSHOT-sources.jar
Sending artifact delta relative to ActiveMQ-Java7 ? ActiveMQ :: Shiro #387
Archived 3 artifacts
Archive block size is 32768
Received 0 blocks and 98809 bytes
Compression is 0.0%
Took 0.14 sec
[JENKINS] Archiving <https://builds.apache.org/job/ActiveMQ-Java7/ws/activemq-console/pom.xml> to org.apache.activemq/activemq-console/5.11-SNAPSHOT/activemq-console-5.11-SNAPSHOT.pom
[JENKINS] Archiving <https://builds.apache.org/job/ActiveMQ-Java7/ws/activemq-console/target/activemq-console-5.11-SNAPSHOT.jar> to org.apache.activemq/activemq-console/5.11-SNAPSHOT/activemq-console-5.11-SNAPSHOT.jar
[JENKINS] Archiving <https://builds.apache.org/job/ActiveMQ-Java7/ws/activemq-console/target/activemq-console-5.11-SNAPSHOT-sources.jar> to org.apache.activemq/activemq-console/5.11-SNAPSHOT/activemq-console-5.11-SNAPSHOT-sources.jar
Sending artifact delta relative to ActiveMQ-Java7 ? ActiveMQ :: Console #387
Archived 3 artifacts
Archive block size is 32768
Received 0 blocks and 325024 bytes
Compression is 0.0%
Took 0.15 sec
[JENKINS] Archiving <https://builds.apache.org/job/ActiveMQ-Java7/ws/activemq-camel/pom.xml> to org.apache.activemq/activemq-camel/5.11-SNAPSHOT/activemq-camel-5.11-SNAPSHOT.pom
[JENKINS] Archiving <https://builds.apache.org/job/ActiveMQ-Java7/ws/activemq-camel/target/activemq-camel-5.11-SNAPSHOT.jar> to org.apache.activemq/activemq-camel/5.11-SNAPSHOT/activemq-camel-5.11-SNAPSHOT.jar
[JENKINS] Archiving <https://builds.apache.org/job/ActiveMQ-Java7/ws/activemq-camel/target/activemq-camel-5.11-SNAPSHOT-sources.jar> to org.apache.activemq/activemq-camel/5.11-SNAPSHOT/activemq-camel-5.11-SNAPSHOT-sources.jar
Sending artifact delta relative to ActiveMQ-Java7 ? ActiveMQ :: Camel #387
Archived 3 artifacts
Archive block size is 32768
Received 0 blocks and 98941 bytes
Compression is 0.0%
Took 94 ms
[JENKINS] Archiving <https://builds.apache.org/job/ActiveMQ-Java7/ws/activemq-blueprint/pom.xml> to org.apache.activemq/activemq-blueprint/5.11-SNAPSHOT/activemq-blueprint-5.11-SNAPSHOT.pom
[JENKINS] Archiving <https://builds.apache.org/job/ActiveMQ-Java7/ws/activemq-blueprint/target/activemq-blueprint-5.11-SNAPSHOT.jar> to org.apache.activemq/activemq-blueprint/5.11-SNAPSHOT/activemq-blueprint-5.11-SNAPSHOT.jar
[JENKINS] Archiving <https://builds.apache.org/job/ActiveMQ-Java7/ws/activemq-blueprint/target/activemq-blueprint-5.11-SNAPSHOT-sources.jar> to org.apache.activemq/activemq-blueprint/5.11-SNAPSHOT/activemq-blueprint-5.11-SNAPSHOT-sources.jar
Sending artifact delta relative to ActiveMQ-Java7 ? ActiveMQ :: Blueprint #387
Archived 3 artifacts
Archive block size is 32768
Received 0 blocks and 18126 bytes
Compression is 0.0%
Took 0.16 sec
[JENKINS] Archiving <https://builds.apache.org/job/ActiveMQ-Java7/ws/activemq-client/pom.xml> to org.apache.activemq/activemq-client/5.11-SNAPSHOT/activemq-client-5.11-SNAPSHOT.pom
[JENKINS] Archiving <https://builds.apache.org/job/ActiveMQ-Java7/ws/activemq-client/target/activemq-client-5.11-SNAPSHOT.jar> to org.apache.activemq/activemq-client/5.11-SNAPSHOT/activemq-client-5.11-SNAPSHOT.jar
[JENKINS] Archiving <https://builds.apache.org/job/ActiveMQ-Java7/ws/activemq-client/target/activemq-client-5.11-SNAPSHOT-sources.jar> to org.apache.activemq/activemq-client/5.11-SNAPSHOT/activemq-client-5.11-SNAPSHOT-sources.jar
Sending artifact delta relative to ActiveMQ-Java7 ? ActiveMQ :: Client #387
Archived 3 artifacts
Archive block size is 32768
Received 0 blocks and 2210594 bytes
Compression is 0.0%
Took 0.64 sec
[JENKINS] Archiving <https://builds.apache.org/job/ActiveMQ-Java7/ws/pom.xml> to org.apache.activemq/activemq-parent/5.11-SNAPSHOT/activemq-parent-5.11-SNAPSHOT.pom
Sending artifact delta relative to ActiveMQ-Java7 ? ActiveMQ #387
Archived 1 artifacts
Archive block size is 32768
Received 1 blocks and 25846 bytes
Compression is 55.9%
Took 77 ms
[JENKINS] Archiving <https://builds.apache.org/job/ActiveMQ-Java7/ws/activemq-karaf-itest/pom.xml> to org.apache.activemq/activemq-karaf-itest/5.11-SNAPSHOT/activemq-karaf-itest-5.11-SNAPSHOT.pom
[JENKINS] Archiving <https://builds.apache.org/job/ActiveMQ-Java7/ws/activemq-karaf-itest/target/activemq-karaf-itest-5.11-SNAPSHOT.jar> to org.apache.activemq/activemq-karaf-itest/5.11-SNAPSHOT/activemq-karaf-itest-5.11-SNAPSHOT.jar
[JENKINS] Archiving <https://builds.apache.org/job/ActiveMQ-Java7/ws/activemq-karaf-itest/target/activemq-karaf-itest-5.11-SNAPSHOT-sources.jar> to org.apache.activemq/activemq-karaf-itest/5.11-SNAPSHOT/activemq-karaf-itest-5.11-SNAPSHOT-sources.jar
Sending artifact delta relative to ActiveMQ-Java7 ? ActiveMQ :: Karaf Integration Tests #387
Archived 3 artifacts
Archive block size is 32768
Received 0 blocks and 28158 bytes
Compression is 0.0%
Took 77 ms
[JENKINS] Archiving <https://builds.apache.org/job/ActiveMQ-Java7/ws/activemq-broker/pom.xml> to org.apache.activemq/activemq-broker/5.11-SNAPSHOT/activemq-broker-5.11-SNAPSHOT.pom
[JENKINS] Archiving <https://builds.apache.org/job/ActiveMQ-Java7/ws/activemq-broker/target/activemq-broker-5.11-SNAPSHOT.jar> to org.apache.activemq/activemq-broker/5.11-SNAPSHOT/activemq-broker-5.11-SNAPSHOT.jar
[JENKINS] Archiving <https://builds.apache.org/job/ActiveMQ-Java7/ws/activemq-broker/target/activemq-broker-5.11-SNAPSHOT-tests.jar> to org.apache.activemq/activemq-broker/5.11-SNAPSHOT/activemq-broker-5.11-SNAPSHOT-tests.jar
[JENKINS] Archiving <https://builds.apache.org/job/ActiveMQ-Java7/ws/activemq-broker/target/activemq-broker-5.11-SNAPSHOT-sources.jar> to org.apache.activemq/activemq-broker/5.11-SNAPSHOT/activemq-broker-5.11-SNAPSHOT-sources.jar
Sending artifact delta relative to ActiveMQ-Java7 ? ActiveMQ :: Broker #387
Archived 4 artifacts
Archive block size is 32768
Received 0 blocks and 1904712 bytes
Compression is 0.0%
Took 0.61 sec
[JENKINS] Archiving <https://builds.apache.org/job/ActiveMQ-Java7/ws/activemq-ra/pom.xml> to org.apache.activemq/activemq-ra/5.11-SNAPSHOT/activemq-ra-5.11-SNAPSHOT.pom
[JENKINS] Archiving <https://builds.apache.org/job/ActiveMQ-Java7/ws/activemq-ra/target/activemq-ra-5.11-SNAPSHOT.jar> to org.apache.activemq/activemq-ra/5.11-SNAPSHOT/activemq-ra-5.11-SNAPSHOT.jar
[JENKINS] Archiving <https://builds.apache.org/job/ActiveMQ-Java7/ws/activemq-ra/target/xbean/activemq-ra.xsd> to org.apache.activemq/activemq-ra/5.11-SNAPSHOT/activemq-ra-5.11-SNAPSHOT.xsd
[JENKINS] Archiving <https://builds.apache.org/job/ActiveMQ-Java7/ws/activemq-ra/target/xbean/activemq-ra.xsd.html> to org.apache.activemq/activemq-ra/5.11-SNAPSHOT/activemq-ra-5.11-SNAPSHOT-schema.html
[JENKINS] Archiving <https://builds.apache.org/job/ActiveMQ-Java7/ws/activemq-ra/target/xbean/activemq-ra.xsd.html> to org.apache.activemq/activemq-ra/5.11-SNAPSHOT/activemq-ra-5.11-SNAPSHOT.xsd.html
[JENKINS] Archiving <https://builds.apache.org/job/ActiveMQ-Java7/ws/activemq-ra/target/activemq-ra-5.11-SNAPSHOT-sources.jar> to org.apache.activemq/activemq-ra/5.11-SNAPSHOT/activemq-ra-5.11-SNAPSHOT-sources.jar
Sending artifact delta relative to ActiveMQ-Java7 ? ActiveMQ :: RA #387
Archived 6 artifacts
Archive block size is 32768
Received 0 blocks and 185226 bytes
Compression is 0.0%
Took 0.11 sec
[JENKINS] Archiving <https://builds.apache.org/job/ActiveMQ-Java7/ws/activemq-spring/pom.xml> to org.apache.activemq/activemq-spring/5.11-SNAPSHOT/activemq-spring-5.11-SNAPSHOT.pom
[JENKINS] Archiving <https://builds.apache.org/job/ActiveMQ-Java7/ws/activemq-spring/target/activemq-spring-5.11-SNAPSHOT.jar> to org.apache.activemq/activemq-spring/5.11-SNAPSHOT/activemq-spring-5.11-SNAPSHOT.jar
[JENKINS] Archiving <https://builds.apache.org/job/ActiveMQ-Java7/ws/activemq-spring/target/classes/activemq.xsd> to org.apache.activemq/activemq-spring/5.11-SNAPSHOT/activemq-spring-5.11-SNAPSHOT.xsd
[JENKINS] Archiving <https://builds.apache.org/job/ActiveMQ-Java7/ws/activemq-spring/target/classes/activemq.xsd.html> to org.apache.activemq/activemq-spring/5.11-SNAPSHOT/activemq-spring-5.11-SNAPSHOT-schema.html
[JENKINS] Archiving <https://builds.apache.org/job/ActiveMQ-Java7/ws/activemq-spring/target/activemq-spring-5.11-SNAPSHOT-sources.jar> to org.apache.activemq/activemq-spring/5.11-SNAPSHOT/activemq-spring-5.11-SNAPSHOT-sources.jar
Sending artifact delta relative to ActiveMQ-Java7 ? ActiveMQ :: Spring #387
Archived 5 artifacts
Archive block size is 32768
Received 18 blocks and 479477 bytes
Compression is 55.2%
Took 0.22 sec
[JENKINS] Archiving <https://builds.apache.org/job/ActiveMQ-Java7/ws/activemq-all/dependency-reduced-pom.xml> to org.apache.activemq/activemq-all/5.11-SNAPSHOT/activemq-all-5.11-SNAPSHOT.pom
[JENKINS] Archiving <https://builds.apache.org/job/ActiveMQ-Java7/ws/activemq-all/target/activemq-all-5.11-SNAPSHOT.jar> to org.apache.activemq/activemq-all/5.11-SNAPSHOT/activemq-all-5.11-SNAPSHOT.jar
[JENKINS] Archiving <https://builds.apache.org/job/ActiveMQ-Java7/ws/activemq-all/target/activemq-all-5.11-SNAPSHOT-sources.jar> to org.apache.activemq/activemq-all/5.11-SNAPSHOT/activemq-all-5.11-SNAPSHOT-sources.jar
Sending artifact delta relative to ActiveMQ-Java7 ? ActiveMQ :: All JAR bundle #387
Archived 3 artifacts
Archive block size is 32768
Received 0 blocks and 6350159 bytes
Compression is 0.0%
Took 3 sec
[JENKINS] Archiving <https://builds.apache.org/job/ActiveMQ-Java7/ws/activemq-kahadb-store/pom.xml> to org.apache.activemq/activemq-kahadb-store/5.11-SNAPSHOT/activemq-kahadb-store-5.11-SNAPSHOT.pom
[JENKINS] Archiving <https://builds.apache.org/job/ActiveMQ-Java7/ws/activemq-kahadb-store/target/activemq-kahadb-store-5.11-SNAPSHOT.jar> to org.apache.activemq/activemq-kahadb-store/5.11-SNAPSHOT/activemq-kahadb-store-5.11-SNAPSHOT.jar
[JENKINS] Archiving <https://builds.apache.org/job/ActiveMQ-Java7/ws/activemq-kahadb-store/target/activemq-kahadb-store-5.11-SNAPSHOT-sources.jar> to org.apache.activemq/activemq-kahadb-store/5.11-SNAPSHOT/activemq-kahadb-store-5.11-SNAPSHOT-sources.jar
Sending artifact delta relative to ActiveMQ-Java7 ? ActiveMQ :: KahaDB Store #387
Archived 3 artifacts
Archive block size is 32768
Received 0 blocks and 887613 bytes
Compression is 0.0%
Took 0.32 sec
[JENKINS] Archiving <https://builds.apache.org/job/ActiveMQ-Java7/ws/activemq-jaas/pom.xml> to org.apache.activemq/activemq-jaas/5.11-SNAPSHOT/activemq-jaas-5.11-SNAPSHOT.pom
[JENKINS] Archiving <https://builds.apache.org/job/ActiveMQ-Java7/ws/activemq-jaas/target/activemq-jaas-5.11-SNAPSHOT.jar> to org.apache.activemq/activemq-jaas/5.11-SNAPSHOT/activemq-jaas-5.11-SNAPSHOT.jar
[JENKINS] Archiving <https://builds.apache.org/job/ActiveMQ-Java7/ws/activemq-jaas/target/activemq-jaas-5.11-SNAPSHOT-sources.jar> to org.apache.activemq/activemq-jaas/5.11-SNAPSHOT/activemq-jaas-5.11-SNAPSHOT-sources.jar
Sending artifact delta relative to ActiveMQ-Java7 ? ActiveMQ :: JAAS #387
Archived 3 artifacts
Archive block size is 32768
Received 0 blocks and 64183 bytes
Compression is 0.0%
Took 97 ms
[JENKINS] Archiving <https://builds.apache.org/job/ActiveMQ-Java7/ws/activemq-tooling/pom.xml> to org.apache.activemq.tooling/activemq-tooling/5.11-SNAPSHOT/activemq-tooling-5.11-SNAPSHOT.pom
Sending artifact delta relative to ActiveMQ-Java7 ? ActiveMQ :: Tooling #387
Archived 1 artifacts
Archive block size is 32768
Received 0 blocks and 1679 bytes
Compression is 0.0%
Took 73 ms
[JENKINS] Archiving <https://builds.apache.org/job/ActiveMQ-Java7/ws/activemq-partition/pom.xml> to org.apache.activemq/activemq-partition/5.11-SNAPSHOT/activemq-partition-5.11-SNAPSHOT.pom
[JENKINS] Archiving <https://builds.apache.org/job/ActiveMQ-Java7/ws/activemq-partition/target/activemq-partition-5.11-SNAPSHOT.jar> to org.apache.activemq/activemq-partition/5.11-SNAPSHOT/activemq-partition-5.11-SNAPSHOT.jar
[JENKINS] Archiving <https://builds.apache.org/job/ActiveMQ-Java7/ws/activemq-partition/target/activemq-partition-5.11-SNAPSHOT-sources.jar> to org.apache.activemq/activemq-partition/5.11-SNAPSHOT/activemq-partition-5.11-SNAPSHOT-sources.jar
Sending artifact delta relative to ActiveMQ-Java7 ? ActiveMQ :: Partition Management #387
Archived 3 artifacts
Archive block size is 32768
Received 0 blocks and 46326 bytes
Compression is 0.0%
Took 80 ms
[JENKINS] Archiving <https://builds.apache.org/job/ActiveMQ-Java7/ws/activemq-web/pom.xml> to org.apache.activemq/activemq-web/5.11-SNAPSHOT/activemq-web-5.11-SNAPSHOT.pom
[JENKINS] Archiving <https://builds.apache.org/job/ActiveMQ-Java7/ws/activemq-web/target/activemq-web-5.11-SNAPSHOT.jar> to org.apache.activemq/activemq-web/5.11-SNAPSHOT/activemq-web-5.11-SNAPSHOT.jar
[JENKINS] Archiving <https://builds.apache.org/job/ActiveMQ-Java7/ws/activemq-web/target/activemq-web-5.11-SNAPSHOT-sources.jar> to org.apache.activemq/activemq-web/5.11-SNAPSHOT/activemq-web-5.11-SNAPSHOT-sources.jar
Sending artifact delta relative to ActiveMQ-Java7 ? ActiveMQ :: Web #387
Archived 3 artifacts
Archive block size is 32768
Received 0 blocks and 211732 bytes
Compression is 0.0%
Took 0.23 sec
[JENKINS] Archiving <https://builds.apache.org/job/ActiveMQ-Java7/ws/activemq-leveldb-store/pom.xml> to org.apache.activemq/activemq-leveldb-store/5.11-SNAPSHOT/activemq-leveldb-store-5.11-SNAPSHOT.pom
[JENKINS] Archiving <https://builds.apache.org/job/ActiveMQ-Java7/ws/activemq-leveldb-store/target/activemq-leveldb-store-5.11-SNAPSHOT.jar> to org.apache.activemq/activemq-leveldb-store/5.11-SNAPSHOT/activemq-leveldb-store-5.11-SNAPSHOT.jar
[JENKINS] Archiving <https://builds.apache.org/job/ActiveMQ-Java7/ws/activemq-leveldb-store/target/activemq-leveldb-store-5.11-SNAPSHOT-sources.jar> to org.apache.activemq/activemq-leveldb-store/5.11-SNAPSHOT/activemq-leveldb-store-5.11-SNAPSHOT-sources.jar
Sending artifact delta relative to ActiveMQ-Java7 ? ActiveMQ :: LevelDB Store #387
Archived 3 artifacts
Archive block size is 32768
Received 0 blocks and 1086484 bytes
Compression is 0.0%
Took 0.38 sec
[JENKINS] Archiving <https://builds.apache.org/job/ActiveMQ-Java7/ws/activemq-fileserver/pom.xml> to org.apache.activemq/activemq-fileserver/5.11-SNAPSHOT/activemq-fileserver-5.11-SNAPSHOT.pom
[JENKINS] Archiving <https://builds.apache.org/job/ActiveMQ-Java7/ws/activemq-fileserver/target/activemq-fileserver-5.11-SNAPSHOT.war> to org.apache.activemq/activemq-fileserver/5.11-SNAPSHOT/activemq-fileserver-5.11-SNAPSHOT.war
[JENKINS] Archiving <https://builds.apache.org/job/ActiveMQ-Java7/ws/activemq-fileserver/target/activemq-fileserver-5.11-SNAPSHOT-sources.jar> to org.apache.activemq/activemq-fileserver/5.11-SNAPSHOT/activemq-fileserver-5.11-SNAPSHOT-sources.jar
Sending artifact delta relative to ActiveMQ-Java7 ? ActiveMQ :: File Server #387
Archived 3 artifacts
Archive block size is 32768
Received 0 blocks and 58361 bytes
Compression is 0.0%
Took 79 ms
[JENKINS] Archiving <https://builds.apache.org/job/ActiveMQ-Java7/ws/activemq-karaf/pom.xml> to org.apache.activemq/activemq-karaf/5.11-SNAPSHOT/activemq-karaf-5.11-SNAPSHOT.pom
[JENKINS] Archiving <https://builds.apache.org/job/ActiveMQ-Java7/ws/activemq-karaf/target/activemq-karaf-5.11-SNAPSHOT.jar> to org.apache.activemq/activemq-karaf/5.11-SNAPSHOT/activemq-karaf-5.11-SNAPSHOT.jar
[JENKINS] Archiving <https://builds.apache.org/job/ActiveMQ-Java7/ws/activemq-karaf/target/classes/features.xml> to org.apache.activemq/activemq-karaf/5.11-SNAPSHOT/activemq-karaf-5.11-SNAPSHOT-features.xml
[JENKINS] Archiving <https://builds.apache.org/job/ActiveMQ-Java7/ws/activemq-karaf/target/classes/features-core.xml> to org.apache.activemq/activemq-karaf/5.11-SNAPSHOT/activemq-karaf-5.11-SNAPSHOT-features-core.xml
[JENKINS] Archiving <https://builds.apache.org/job/ActiveMQ-Java7/ws/activemq-karaf/target/classes/activemq.xml> to org.apache.activemq/activemq-karaf/5.11-SNAPSHOT/activemq-karaf-5.11-SNAPSHOT-activemq.xml
[JENKINS] Archiving <https://builds.apache.org/job/ActiveMQ-Java7/ws/activemq-karaf/target/classes/org.apache.activemq.server-default.cfg> to org.apache.activemq/activemq-karaf/5.11-SNAPSHOT/activemq-karaf-5.11-SNAPSHOT-activemq.cfg
[JENKINS] Archiving <https://builds.apache.org/job/ActiveMQ-Java7/ws/activemq-karaf/target/classes/org.apache.activemq.webconsole.cfg> to org.apache.activemq/activemq-karaf/5.11-SNAPSHOT/activemq-karaf-5.11-SNAPSHOT-activemq-webconsole.cfg
[JENKINS] Archiving <https://builds.apache.org/job/ActiveMQ-Java7/ws/activemq-karaf/target/activemq-karaf-5.11-SNAPSHOT-sources.jar> to org.apache.activemq/activemq-karaf/5.11-SNAPSHOT/activemq-karaf-5.11-SNAPSHOT-sources.jar
Sending artifact delta relative to ActiveMQ-Java7 ? ActiveMQ :: Apache Karaf #387
Archived 8 artifacts
Archive block size is 32768
Received 0 blocks and 69195 bytes
Compression is 0.0%
Took 1.6 sec
[JENKINS] Archiving <https://builds.apache.org/job/ActiveMQ-Java7/ws/activemq-http/pom.xml> to org.apache.activemq/activemq-http/5.11-SNAPSHOT/activemq-http-5.11-SNAPSHOT.pom
[JENKINS] Archiving <https://builds.apache.org/job/ActiveMQ-Java7/ws/activemq-http/target/activemq-http-5.11-SNAPSHOT.jar> to org.apache.activemq/activemq-http/5.11-SNAPSHOT/activemq-http-5.11-SNAPSHOT.jar
[JENKINS] Archiving <https://builds.apache.org/job/ActiveMQ-Java7/ws/activemq-http/target/activemq-http-5.11-SNAPSHOT-sources.jar> to org.apache.activemq/activemq-http/5.11-SNAPSHOT/activemq-http-5.11-SNAPSHOT-sources.jar
Sending artifact delta relative to ActiveMQ-Java7 ? ActiveMQ :: HTTP Protocol Support #387
Archived 3 artifacts
Archive block size is 32768
Received 0 blocks and 150781 bytes
Compression is 0.0%
Took 0.18 sec
Sending e-mails to: commits@activemq.apache.org
channel stopped
[locks-and-latches] Releasing all the locks
[locks-and-latches] All the locks released
Maven RedeployPublisher use remote ubuntu-6 maven settings from : /home/jenkins/.m2/settings.xml
[ERROR] uniqueVersion == false is not anymore supported in maven 3
[INFO] Deployment in https://repository.apache.org/content/repositories/snapshots (id=,uniqueVersion=false)
Deploying the main artifact activemq-all-5.11-SNAPSHOT.jar
Downloading: https://repository.apache.org/content/repositories/snapshots/org/apache/activemq/activemq-all/5.11-SNAPSHOT/maven-metadata.xml
Downloaded: https://repository.apache.org/content/repositories/snapshots/org/apache/activemq/activemq-all/5.11-SNAPSHOT/maven-metadata.xml (781 B at 4.3 KB/sec)
Uploading: https://repository.apache.org/content/repositories/snapshots/org/apache/activemq/activemq-all/5.11-SNAPSHOT/activemq-all-5.11-20140717.101549-36.jar
Uploading: https://repository.apache.org/content/repositories/snapshots/org/apache/activemq/activemq-all/5.11-SNAPSHOT/activemq-all-5.11-20140717.101549-36.pom
ERROR: Failed to deploy artifacts: Could not transfer artifact org.apache.activemq:activemq-all:jar:5.11-20140717.101549-36 from/to (https://repository.apache.org/content/repositories/snapshots): Failed to transfer file: https://repository.apache.org/content/repositories/snapshots/org/apache/activemq/activemq-all/5.11-SNAPSHOT/activemq-all-5.11-20140717.101549-36.jar. Return code is: 401, ReasonPhrase: Unauthorized.
org.apache.maven.artifact.deployer.ArtifactDeploymentException: Failed to deploy artifacts: Could not transfer artifact org.apache.activemq:activemq-all:jar:5.11-20140717.101549-36 from/to (https://repository.apache.org/content/repositories/snapshots): Failed to transfer file: https://repository.apache.org/content/repositories/snapshots/org/apache/activemq/activemq-all/5.11-SNAPSHOT/activemq-all-5.11-20140717.101549-36.jar. Return code is: 401, ReasonPhrase: Unauthorized.
at org.apache.maven.artifact.deployer.DefaultArtifactDeployer.deploy(DefaultArtifactDeployer.java:143)
at hudson.maven.reporters.MavenArtifactRecord.deploy(MavenArtifactRecord.java:193)
at hudson.maven.RedeployPublisher.perform(RedeployPublisher.java:176)
at hudson.tasks.BuildStepMonitor$1.perform(BuildStepMonitor.java:20)
at hudson.model.AbstractBuild$AbstractBuildExecution.perform(AbstractBuild.java:804)
at hudson.model.AbstractBuild$AbstractBuildExecution.performAllBuildSteps(AbstractBuild.java:776)
at hudson.maven.MavenModuleSetBuild$MavenModuleSetBuildExecution.post2(MavenModuleSetBuild.java:1040)
at hudson.model.AbstractBuild$AbstractBuildExecution.post(AbstractBuild.java:725)
at hudson.model.Run.execute(Run.java:1701)
at hudson.maven.MavenModuleSetBuild.run(MavenModuleSetBuild.java:529)
at hudson.model.ResourceController.execute(ResourceController.java:88)
at hudson.model.Executor.run(Executor.java:231)
Caused by: org.eclipse.aether.deployment.DeploymentException: Failed to deploy artifacts: Could not transfer artifact org.apache.activemq:activemq-all:jar:5.11-20140717.101549-36 from/to (https://repository.apache.org/content/repositories/snapshots): Failed to transfer file: https://repository.apache.org/content/repositories/snapshots/org/apache/activemq/activemq-all/5.11-SNAPSHOT/activemq-all-5.11-20140717.101549-36.jar. Return code is: 401, ReasonPhrase: Unauthorized.
at org.eclipse.aether.internal.impl.DefaultDeployer.deploy(DefaultDeployer.java:341)
at org.eclipse.aether.internal.impl.DefaultDeployer.deploy(DefaultDeployer.java:269)
at org.eclipse.aether.internal.impl.DefaultRepositorySystem.deploy(DefaultRepositorySystem.java:413)
at org.apache.maven.artifact.deployer.DefaultArtifactDeployer.deploy(DefaultArtifactDeployer.java:139)
... 11 more
Caused by: org.eclipse.aether.transfer.ArtifactTransferException: Could not transfer artifact org.apache.activemq:activemq-all:jar:5.11-20140717.101549-36 from/to (https://repository.apache.org/content/repositories/snapshots): Failed to transfer file: https://repository.apache.org/content/repositories/snapshots/org/apache/activemq/activemq-all/5.11-SNAPSHOT/activemq-all-5.11-20140717.101549-36.jar. Return code is: 401, ReasonPhrase: Unauthorized.
at org.eclipse.aether.connector.wagon.WagonRepositoryConnector$6.wrap(WagonRepositoryConnector.java:1016)
at org.eclipse.aether.connector.wagon.WagonRepositoryConnector$6.wrap(WagonRepositoryConnector.java:1004)
at org.eclipse.aether.connector.wagon.WagonRepositoryConnector$PutTask.run(WagonRepositoryConnector.java:895)
at org.eclipse.aether.connector.wagon.WagonRepositoryConnector.put(WagonRepositoryConnector.java:522)
at org.eclipse.aether.internal.impl.DefaultDeployer.deploy(DefaultDeployer.java:335)
... 14 more
Caused by: org.apache.maven.wagon.TransferFailedException: Failed to transfer file: https://repository.apache.org/content/repositories/snapshots/org/apache/activemq/activemq-all/5.11-SNAPSHOT/activemq-all-5.11-20140717.101549-36.jar. Return code is: 401, ReasonPhrase: Unauthorized.
at org.apache.maven.wagon.shared.http4.AbstractHttpClientWagon.put(AbstractHttpClientWagon.java:626)
at org.apache.maven.wagon.shared.http4.AbstractHttpClientWagon.put(AbstractHttpClientWagon.java:524)
at org.apache.maven.wagon.shared.http4.AbstractHttpClientWagon.put(AbstractHttpClientWagon.java:505)
at org.apache.maven.wagon.shared.http4.AbstractHttpClientWagon.put(AbstractHttpClientWagon.java:485)
at org.eclipse.aether.connector.wagon.WagonRepositoryConnector$PutTask.run(WagonRepositoryConnector.java:871)
... 16 more
[INFO] Deployment failed after 0.91 sec
Build step 'Deploy artifacts to Maven repository' changed build result to FAILURE
Jenkins build is unstable: ActiveMQ-Java7 #387
Posted by Apache Jenkins Server <je...@builds.apache.org>.
See <https://builds.apache.org/job/ActiveMQ-Java7/387/changes>
Build failed in Jenkins: ActiveMQ-Java7 #386
Posted by Apache Jenkins Server <je...@builds.apache.org>.
See <https://builds.apache.org/job/ActiveMQ-Java7/386/changes>
Changes:
[gtully] fix up to respect normalisation of mbean attribute/property names from http://git-wip-us.apache.org/repos/asf/activemq/commit/0709c2cc
[gtully] https://issues.apache.org/jira/browse/AMQ-5086 - init of broker got dropped after mutex wait - testWaitFor was failing
[gtully] https://issues.apache.org/jira/browse/AMQ-5277 - jdbc store make use of entryLocator on ack
------------------------------------------
[...truncated 8551 lines...]
Sending artifact delta relative to ActiveMQ-Java7 ? ActiveMQ :: Run Jar #385
Archived 3 artifacts
Archive block size is 32768
Received 0 blocks and 24881 bytes
Compression is 0.0%
Took 2.1 sec
[JENKINS] Archiving <https://builds.apache.org/job/ActiveMQ-Java7/ws/activemq-mqtt/pom.xml> to org.apache.activemq/activemq-mqtt/5.11-SNAPSHOT/activemq-mqtt-5.11-SNAPSHOT.pom
[JENKINS] Archiving <https://builds.apache.org/job/ActiveMQ-Java7/ws/activemq-mqtt/target/activemq-mqtt-5.11-SNAPSHOT.jar> to org.apache.activemq/activemq-mqtt/5.11-SNAPSHOT/activemq-mqtt-5.11-SNAPSHOT.jar
[JENKINS] Archiving <https://builds.apache.org/job/ActiveMQ-Java7/ws/activemq-mqtt/target/activemq-mqtt-5.11-SNAPSHOT-sources.jar> to org.apache.activemq/activemq-mqtt/5.11-SNAPSHOT/activemq-mqtt-5.11-SNAPSHOT-sources.jar
Sending artifact delta relative to ActiveMQ-Java7 ? ActiveMQ :: MQTT Protocol #385
Archived 3 artifacts
Archive block size is 32768
Received 0 blocks and 125849 bytes
Compression is 0.0%
Took 0.55 sec
[JENKINS] Archiving <https://builds.apache.org/job/ActiveMQ-Java7/ws/activemq-shiro/pom.xml> to org.apache.activemq/activemq-shiro/5.11-SNAPSHOT/activemq-shiro-5.11-SNAPSHOT.pom
[JENKINS] Archiving <https://builds.apache.org/job/ActiveMQ-Java7/ws/activemq-shiro/target/activemq-shiro-5.11-SNAPSHOT.jar> to org.apache.activemq/activemq-shiro/5.11-SNAPSHOT/activemq-shiro-5.11-SNAPSHOT.jar
[JENKINS] Archiving <https://builds.apache.org/job/ActiveMQ-Java7/ws/activemq-shiro/target/activemq-shiro-5.11-SNAPSHOT-sources.jar> to org.apache.activemq/activemq-shiro/5.11-SNAPSHOT/activemq-shiro-5.11-SNAPSHOT-sources.jar
Sending artifact delta relative to ActiveMQ-Java7 ? ActiveMQ :: Shiro #385
Archived 3 artifacts
Archive block size is 32768
Received 0 blocks and 98807 bytes
Compression is 0.0%
Took 2.1 sec
[JENKINS] Archiving <https://builds.apache.org/job/ActiveMQ-Java7/ws/activemq-console/pom.xml> to org.apache.activemq/activemq-console/5.11-SNAPSHOT/activemq-console-5.11-SNAPSHOT.pom
[JENKINS] Archiving <https://builds.apache.org/job/ActiveMQ-Java7/ws/activemq-console/target/activemq-console-5.11-SNAPSHOT.jar> to org.apache.activemq/activemq-console/5.11-SNAPSHOT/activemq-console-5.11-SNAPSHOT.jar
[JENKINS] Archiving <https://builds.apache.org/job/ActiveMQ-Java7/ws/activemq-console/target/activemq-console-5.11-SNAPSHOT-sources.jar> to org.apache.activemq/activemq-console/5.11-SNAPSHOT/activemq-console-5.11-SNAPSHOT-sources.jar
Sending artifact delta relative to ActiveMQ-Java7 ? ActiveMQ :: Console #385
Archived 3 artifacts
Archive block size is 32768
Received 0 blocks and 325024 bytes
Compression is 0.0%
Took 3.1 sec
[JENKINS] Archiving <https://builds.apache.org/job/ActiveMQ-Java7/ws/activemq-camel/pom.xml> to org.apache.activemq/activemq-camel/5.11-SNAPSHOT/activemq-camel-5.11-SNAPSHOT.pom
[JENKINS] Archiving <https://builds.apache.org/job/ActiveMQ-Java7/ws/activemq-camel/target/activemq-camel-5.11-SNAPSHOT.jar> to org.apache.activemq/activemq-camel/5.11-SNAPSHOT/activemq-camel-5.11-SNAPSHOT.jar
[JENKINS] Archiving <https://builds.apache.org/job/ActiveMQ-Java7/ws/activemq-camel/target/activemq-camel-5.11-SNAPSHOT-sources.jar> to org.apache.activemq/activemq-camel/5.11-SNAPSHOT/activemq-camel-5.11-SNAPSHOT-sources.jar
Sending artifact delta relative to ActiveMQ-Java7 ? ActiveMQ :: Camel #385
Archived 3 artifacts
Archive block size is 32768
Received 0 blocks and 98941 bytes
Compression is 0.0%
Took 0.36 sec
[JENKINS] Archiving <https://builds.apache.org/job/ActiveMQ-Java7/ws/activemq-blueprint/pom.xml> to org.apache.activemq/activemq-blueprint/5.11-SNAPSHOT/activemq-blueprint-5.11-SNAPSHOT.pom
[JENKINS] Archiving <https://builds.apache.org/job/ActiveMQ-Java7/ws/activemq-blueprint/target/activemq-blueprint-5.11-SNAPSHOT.jar> to org.apache.activemq/activemq-blueprint/5.11-SNAPSHOT/activemq-blueprint-5.11-SNAPSHOT.jar
[JENKINS] Archiving <https://builds.apache.org/job/ActiveMQ-Java7/ws/activemq-blueprint/target/activemq-blueprint-5.11-SNAPSHOT-sources.jar> to org.apache.activemq/activemq-blueprint/5.11-SNAPSHOT/activemq-blueprint-5.11-SNAPSHOT-sources.jar
Sending artifact delta relative to ActiveMQ-Java7 ? ActiveMQ :: Blueprint #385
Archived 3 artifacts
Archive block size is 32768
Received 0 blocks and 18126 bytes
Compression is 0.0%
Took 0.2 sec
[JENKINS] Archiving <https://builds.apache.org/job/ActiveMQ-Java7/ws/activemq-client/pom.xml> to org.apache.activemq/activemq-client/5.11-SNAPSHOT/activemq-client-5.11-SNAPSHOT.pom
[JENKINS] Archiving <https://builds.apache.org/job/ActiveMQ-Java7/ws/activemq-client/target/activemq-client-5.11-SNAPSHOT.jar> to org.apache.activemq/activemq-client/5.11-SNAPSHOT/activemq-client-5.11-SNAPSHOT.jar
[JENKINS] Archiving <https://builds.apache.org/job/ActiveMQ-Java7/ws/activemq-client/target/activemq-client-5.11-SNAPSHOT-sources.jar> to org.apache.activemq/activemq-client/5.11-SNAPSHOT/activemq-client-5.11-SNAPSHOT-sources.jar
Sending artifact delta relative to ActiveMQ-Java7 ? ActiveMQ :: Client #385
Archived 3 artifacts
Archive block size is 32768
Received 0 blocks and 2210594 bytes
Compression is 0.0%
Took 3.2 sec
[JENKINS] Archiving <https://builds.apache.org/job/ActiveMQ-Java7/ws/pom.xml> to org.apache.activemq/activemq-parent/5.11-SNAPSHOT/activemq-parent-5.11-SNAPSHOT.pom
Sending artifact delta relative to ActiveMQ-Java7 ? ActiveMQ #385
Archived 1 artifacts
Archive block size is 32768
Received 1 blocks and 25917 bytes
Compression is 55.8%
Took 0.1 sec
[JENKINS] Archiving <https://builds.apache.org/job/ActiveMQ-Java7/ws/activemq-karaf-itest/pom.xml> to org.apache.activemq/activemq-karaf-itest/5.11-SNAPSHOT/activemq-karaf-itest-5.11-SNAPSHOT.pom
[JENKINS] Archiving <https://builds.apache.org/job/ActiveMQ-Java7/ws/activemq-karaf-itest/target/activemq-karaf-itest-5.11-SNAPSHOT.jar> to org.apache.activemq/activemq-karaf-itest/5.11-SNAPSHOT/activemq-karaf-itest-5.11-SNAPSHOT.jar
[JENKINS] Archiving <https://builds.apache.org/job/ActiveMQ-Java7/ws/activemq-karaf-itest/target/activemq-karaf-itest-5.11-SNAPSHOT-sources.jar> to org.apache.activemq/activemq-karaf-itest/5.11-SNAPSHOT/activemq-karaf-itest-5.11-SNAPSHOT-sources.jar
Sending artifact delta relative to ActiveMQ-Java7 ? ActiveMQ :: Karaf Integration Tests #385
Archived 3 artifacts
Archive block size is 32768
Received 0 blocks and 28156 bytes
Compression is 0.0%
Took 79 ms
[JENKINS] Archiving <https://builds.apache.org/job/ActiveMQ-Java7/ws/activemq-broker/pom.xml> to org.apache.activemq/activemq-broker/5.11-SNAPSHOT/activemq-broker-5.11-SNAPSHOT.pom
[JENKINS] Archiving <https://builds.apache.org/job/ActiveMQ-Java7/ws/activemq-broker/target/activemq-broker-5.11-SNAPSHOT.jar> to org.apache.activemq/activemq-broker/5.11-SNAPSHOT/activemq-broker-5.11-SNAPSHOT.jar
[JENKINS] Archiving <https://builds.apache.org/job/ActiveMQ-Java7/ws/activemq-broker/target/activemq-broker-5.11-SNAPSHOT-tests.jar> to org.apache.activemq/activemq-broker/5.11-SNAPSHOT/activemq-broker-5.11-SNAPSHOT-tests.jar
[JENKINS] Archiving <https://builds.apache.org/job/ActiveMQ-Java7/ws/activemq-broker/target/activemq-broker-5.11-SNAPSHOT-sources.jar> to org.apache.activemq/activemq-broker/5.11-SNAPSHOT/activemq-broker-5.11-SNAPSHOT-sources.jar
Sending artifact delta relative to ActiveMQ-Java7 ? ActiveMQ :: Broker #385
Archived 4 artifacts
Archive block size is 32768
Received 0 blocks and 1904715 bytes
Compression is 0.0%
Took 4.5 sec
[JENKINS] Archiving <https://builds.apache.org/job/ActiveMQ-Java7/ws/activemq-ra/pom.xml> to org.apache.activemq/activemq-ra/5.11-SNAPSHOT/activemq-ra-5.11-SNAPSHOT.pom
[JENKINS] Archiving <https://builds.apache.org/job/ActiveMQ-Java7/ws/activemq-ra/target/activemq-ra-5.11-SNAPSHOT.jar> to org.apache.activemq/activemq-ra/5.11-SNAPSHOT/activemq-ra-5.11-SNAPSHOT.jar
[JENKINS] Archiving <https://builds.apache.org/job/ActiveMQ-Java7/ws/activemq-ra/target/xbean/activemq-ra.xsd> to org.apache.activemq/activemq-ra/5.11-SNAPSHOT/activemq-ra-5.11-SNAPSHOT.xsd
[JENKINS] Archiving <https://builds.apache.org/job/ActiveMQ-Java7/ws/activemq-ra/target/xbean/activemq-ra.xsd.html> to org.apache.activemq/activemq-ra/5.11-SNAPSHOT/activemq-ra-5.11-SNAPSHOT-schema.html
[JENKINS] Archiving <https://builds.apache.org/job/ActiveMQ-Java7/ws/activemq-ra/target/xbean/activemq-ra.xsd.html> to org.apache.activemq/activemq-ra/5.11-SNAPSHOT/activemq-ra-5.11-SNAPSHOT.xsd.html
[JENKINS] Archiving <https://builds.apache.org/job/ActiveMQ-Java7/ws/activemq-ra/target/activemq-ra-5.11-SNAPSHOT-sources.jar> to org.apache.activemq/activemq-ra/5.11-SNAPSHOT/activemq-ra-5.11-SNAPSHOT-sources.jar
Sending artifact delta relative to ActiveMQ-Java7 ? ActiveMQ :: RA #385
Archived 6 artifacts
Archive block size is 32768
Received 0 blocks and 185226 bytes
Compression is 0.0%
Took 0.18 sec
[JENKINS] Archiving <https://builds.apache.org/job/ActiveMQ-Java7/ws/activemq-spring/pom.xml> to org.apache.activemq/activemq-spring/5.11-SNAPSHOT/activemq-spring-5.11-SNAPSHOT.pom
[JENKINS] Archiving <https://builds.apache.org/job/ActiveMQ-Java7/ws/activemq-spring/target/activemq-spring-5.11-SNAPSHOT.jar> to org.apache.activemq/activemq-spring/5.11-SNAPSHOT/activemq-spring-5.11-SNAPSHOT.jar
[JENKINS] Archiving <https://builds.apache.org/job/ActiveMQ-Java7/ws/activemq-spring/target/classes/activemq.xsd> to org.apache.activemq/activemq-spring/5.11-SNAPSHOT/activemq-spring-5.11-SNAPSHOT.xsd
[JENKINS] Archiving <https://builds.apache.org/job/ActiveMQ-Java7/ws/activemq-spring/target/classes/activemq.xsd.html> to org.apache.activemq/activemq-spring/5.11-SNAPSHOT/activemq-spring-5.11-SNAPSHOT-schema.html
[JENKINS] Archiving <https://builds.apache.org/job/ActiveMQ-Java7/ws/activemq-spring/target/activemq-spring-5.11-SNAPSHOT-sources.jar> to org.apache.activemq/activemq-spring/5.11-SNAPSHOT/activemq-spring-5.11-SNAPSHOT-sources.jar
Sending artifact delta relative to ActiveMQ-Java7 ? ActiveMQ :: Spring #385
Archived 5 artifacts
Archive block size is 32768
Received 21 blocks and 381223 bytes
Compression is 64.4%
Took 0.32 sec
[JENKINS] Archiving <https://builds.apache.org/job/ActiveMQ-Java7/ws/activemq-all/dependency-reduced-pom.xml> to org.apache.activemq/activemq-all/5.11-SNAPSHOT/activemq-all-5.11-SNAPSHOT.pom
[JENKINS] Archiving <https://builds.apache.org/job/ActiveMQ-Java7/ws/activemq-all/target/activemq-all-5.11-SNAPSHOT.jar> to org.apache.activemq/activemq-all/5.11-SNAPSHOT/activemq-all-5.11-SNAPSHOT.jar
[JENKINS] Archiving <https://builds.apache.org/job/ActiveMQ-Java7/ws/activemq-all/target/activemq-all-5.11-SNAPSHOT-sources.jar> to org.apache.activemq/activemq-all/5.11-SNAPSHOT/activemq-all-5.11-SNAPSHOT-sources.jar
Sending artifact delta relative to ActiveMQ-Java7 ? ActiveMQ :: All JAR bundle #385
Archived 3 artifacts
Archive block size is 32768
Received 1 blocks and 6317413 bytes
Compression is 0.5%
Took 3.2 sec
[JENKINS] Archiving <https://builds.apache.org/job/ActiveMQ-Java7/ws/activemq-kahadb-store/pom.xml> to org.apache.activemq/activemq-kahadb-store/5.11-SNAPSHOT/activemq-kahadb-store-5.11-SNAPSHOT.pom
[JENKINS] Archiving <https://builds.apache.org/job/ActiveMQ-Java7/ws/activemq-kahadb-store/target/activemq-kahadb-store-5.11-SNAPSHOT.jar> to org.apache.activemq/activemq-kahadb-store/5.11-SNAPSHOT/activemq-kahadb-store-5.11-SNAPSHOT.jar
[JENKINS] Archiving <https://builds.apache.org/job/ActiveMQ-Java7/ws/activemq-kahadb-store/target/activemq-kahadb-store-5.11-SNAPSHOT-sources.jar> to org.apache.activemq/activemq-kahadb-store/5.11-SNAPSHOT/activemq-kahadb-store-5.11-SNAPSHOT-sources.jar
Sending artifact delta relative to ActiveMQ-Java7 ? ActiveMQ :: KahaDB Store #385
Archived 3 artifacts
Archive block size is 32768
Received 0 blocks and 887613 bytes
Compression is 0.0%
Took 2 sec
[JENKINS] Archiving <https://builds.apache.org/job/ActiveMQ-Java7/ws/activemq-jaas/pom.xml> to org.apache.activemq/activemq-jaas/5.11-SNAPSHOT/activemq-jaas-5.11-SNAPSHOT.pom
[JENKINS] Archiving <https://builds.apache.org/job/ActiveMQ-Java7/ws/activemq-jaas/target/activemq-jaas-5.11-SNAPSHOT.jar> to org.apache.activemq/activemq-jaas/5.11-SNAPSHOT/activemq-jaas-5.11-SNAPSHOT.jar
[JENKINS] Archiving <https://builds.apache.org/job/ActiveMQ-Java7/ws/activemq-jaas/target/activemq-jaas-5.11-SNAPSHOT-sources.jar> to org.apache.activemq/activemq-jaas/5.11-SNAPSHOT/activemq-jaas-5.11-SNAPSHOT-sources.jar
Sending artifact delta relative to ActiveMQ-Java7 ? ActiveMQ :: JAAS #385
Archived 3 artifacts
Archive block size is 32768
Received 0 blocks and 64183 bytes
Compression is 0.0%
Took 0.16 sec
[JENKINS] Archiving <https://builds.apache.org/job/ActiveMQ-Java7/ws/activemq-tooling/pom.xml> to org.apache.activemq.tooling/activemq-tooling/5.11-SNAPSHOT/activemq-tooling-5.11-SNAPSHOT.pom
Sending artifact delta relative to ActiveMQ-Java7 ? ActiveMQ :: Tooling #385
Archived 1 artifacts
Archive block size is 32768
Received 0 blocks and 1679 bytes
Compression is 0.0%
Took 0.2 sec
[JENKINS] Archiving <https://builds.apache.org/job/ActiveMQ-Java7/ws/activemq-partition/pom.xml> to org.apache.activemq/activemq-partition/5.11-SNAPSHOT/activemq-partition-5.11-SNAPSHOT.pom
[JENKINS] Archiving <https://builds.apache.org/job/ActiveMQ-Java7/ws/activemq-partition/target/activemq-partition-5.11-SNAPSHOT.jar> to org.apache.activemq/activemq-partition/5.11-SNAPSHOT/activemq-partition-5.11-SNAPSHOT.jar
[JENKINS] Archiving <https://builds.apache.org/job/ActiveMQ-Java7/ws/activemq-partition/target/activemq-partition-5.11-SNAPSHOT-sources.jar> to org.apache.activemq/activemq-partition/5.11-SNAPSHOT/activemq-partition-5.11-SNAPSHOT-sources.jar
Sending artifact delta relative to ActiveMQ-Java7 ? ActiveMQ :: Partition Management #385
Archived 3 artifacts
Archive block size is 32768
Received 0 blocks and 46326 bytes
Compression is 0.0%
Took 0.3 sec
[JENKINS] Archiving <https://builds.apache.org/job/ActiveMQ-Java7/ws/activemq-web/pom.xml> to org.apache.activemq/activemq-web/5.11-SNAPSHOT/activemq-web-5.11-SNAPSHOT.pom
[JENKINS] Archiving <https://builds.apache.org/job/ActiveMQ-Java7/ws/activemq-web/target/activemq-web-5.11-SNAPSHOT.jar> to org.apache.activemq/activemq-web/5.11-SNAPSHOT/activemq-web-5.11-SNAPSHOT.jar
[JENKINS] Archiving <https://builds.apache.org/job/ActiveMQ-Java7/ws/activemq-web/target/activemq-web-5.11-SNAPSHOT-sources.jar> to org.apache.activemq/activemq-web/5.11-SNAPSHOT/activemq-web-5.11-SNAPSHOT-sources.jar
Sending artifact delta relative to ActiveMQ-Java7 ? ActiveMQ :: Web #385
Archived 3 artifacts
Archive block size is 32768
Received 0 blocks and 211733 bytes
Compression is 0.0%
Took 0.18 sec
[JENKINS] Archiving <https://builds.apache.org/job/ActiveMQ-Java7/ws/activemq-leveldb-store/pom.xml> to org.apache.activemq/activemq-leveldb-store/5.11-SNAPSHOT/activemq-leveldb-store-5.11-SNAPSHOT.pom
[JENKINS] Archiving <https://builds.apache.org/job/ActiveMQ-Java7/ws/activemq-leveldb-store/target/activemq-leveldb-store-5.11-SNAPSHOT.jar> to org.apache.activemq/activemq-leveldb-store/5.11-SNAPSHOT/activemq-leveldb-store-5.11-SNAPSHOT.jar
[JENKINS] Archiving <https://builds.apache.org/job/ActiveMQ-Java7/ws/activemq-leveldb-store/target/activemq-leveldb-store-5.11-SNAPSHOT-sources.jar> to org.apache.activemq/activemq-leveldb-store/5.11-SNAPSHOT/activemq-leveldb-store-5.11-SNAPSHOT-sources.jar
Sending artifact delta relative to ActiveMQ-Java7 ? ActiveMQ :: LevelDB Store #385
Archived 3 artifacts
Archive block size is 32768
Received 0 blocks and 1086484 bytes
Compression is 0.0%
Took 3.1 sec
[JENKINS] Archiving <https://builds.apache.org/job/ActiveMQ-Java7/ws/activemq-fileserver/pom.xml> to org.apache.activemq/activemq-fileserver/5.11-SNAPSHOT/activemq-fileserver-5.11-SNAPSHOT.pom
[JENKINS] Archiving <https://builds.apache.org/job/ActiveMQ-Java7/ws/activemq-fileserver/target/activemq-fileserver-5.11-SNAPSHOT.war> to org.apache.activemq/activemq-fileserver/5.11-SNAPSHOT/activemq-fileserver-5.11-SNAPSHOT.war
[JENKINS] Archiving <https://builds.apache.org/job/ActiveMQ-Java7/ws/activemq-fileserver/target/activemq-fileserver-5.11-SNAPSHOT-sources.jar> to org.apache.activemq/activemq-fileserver/5.11-SNAPSHOT/activemq-fileserver-5.11-SNAPSHOT-sources.jar
Sending artifact delta relative to ActiveMQ-Java7 ? ActiveMQ :: File Server #385
Archived 3 artifacts
Archive block size is 32768
Received 0 blocks and 58361 bytes
Compression is 0.0%
Took 0.21 sec
[JENKINS] Archiving <https://builds.apache.org/job/ActiveMQ-Java7/ws/activemq-karaf/pom.xml> to org.apache.activemq/activemq-karaf/5.11-SNAPSHOT/activemq-karaf-5.11-SNAPSHOT.pom
[JENKINS] Archiving <https://builds.apache.org/job/ActiveMQ-Java7/ws/activemq-karaf/target/activemq-karaf-5.11-SNAPSHOT.jar> to org.apache.activemq/activemq-karaf/5.11-SNAPSHOT/activemq-karaf-5.11-SNAPSHOT.jar
[JENKINS] Archiving <https://builds.apache.org/job/ActiveMQ-Java7/ws/activemq-karaf/target/classes/features.xml> to org.apache.activemq/activemq-karaf/5.11-SNAPSHOT/activemq-karaf-5.11-SNAPSHOT-features.xml
[JENKINS] Archiving <https://builds.apache.org/job/ActiveMQ-Java7/ws/activemq-karaf/target/classes/features-core.xml> to org.apache.activemq/activemq-karaf/5.11-SNAPSHOT/activemq-karaf-5.11-SNAPSHOT-features-core.xml
[JENKINS] Archiving <https://builds.apache.org/job/ActiveMQ-Java7/ws/activemq-karaf/target/classes/activemq.xml> to org.apache.activemq/activemq-karaf/5.11-SNAPSHOT/activemq-karaf-5.11-SNAPSHOT-activemq.xml
[JENKINS] Archiving <https://builds.apache.org/job/ActiveMQ-Java7/ws/activemq-karaf/target/classes/org.apache.activemq.server-default.cfg> to org.apache.activemq/activemq-karaf/5.11-SNAPSHOT/activemq-karaf-5.11-SNAPSHOT-activemq.cfg
[JENKINS] Archiving <https://builds.apache.org/job/ActiveMQ-Java7/ws/activemq-karaf/target/classes/org.apache.activemq.webconsole.cfg> to org.apache.activemq/activemq-karaf/5.11-SNAPSHOT/activemq-karaf-5.11-SNAPSHOT-activemq-webconsole.cfg
[JENKINS] Archiving <https://builds.apache.org/job/ActiveMQ-Java7/ws/activemq-karaf/target/activemq-karaf-5.11-SNAPSHOT-sources.jar> to org.apache.activemq/activemq-karaf/5.11-SNAPSHOT/activemq-karaf-5.11-SNAPSHOT-sources.jar
Sending artifact delta relative to ActiveMQ-Java7 ? ActiveMQ :: Apache Karaf #385
Archived 8 artifacts
Archive block size is 32768
Received 0 blocks and 69195 bytes
Compression is 0.0%
Took 0.27 sec
[JENKINS] Archiving <https://builds.apache.org/job/ActiveMQ-Java7/ws/activemq-http/pom.xml> to org.apache.activemq/activemq-http/5.11-SNAPSHOT/activemq-http-5.11-SNAPSHOT.pom
[JENKINS] Archiving <https://builds.apache.org/job/ActiveMQ-Java7/ws/activemq-http/target/activemq-http-5.11-SNAPSHOT.jar> to org.apache.activemq/activemq-http/5.11-SNAPSHOT/activemq-http-5.11-SNAPSHOT.jar
[JENKINS] Archiving <https://builds.apache.org/job/ActiveMQ-Java7/ws/activemq-http/target/activemq-http-5.11-SNAPSHOT-sources.jar> to org.apache.activemq/activemq-http/5.11-SNAPSHOT/activemq-http-5.11-SNAPSHOT-sources.jar
Sending artifact delta relative to ActiveMQ-Java7 ? ActiveMQ :: HTTP Protocol Support #385
Archived 3 artifacts
Archive block size is 32768
Received 0 blocks and 150780 bytes
Compression is 0.0%
Took 2.6 sec
channel stopped
[locks-and-latches] Releasing all the locks
[locks-and-latches] All the locks released
Maven RedeployPublisher use remote ubuntu-6 maven settings from : /home/jenkins/.m2/settings.xml
[ERROR] uniqueVersion == false is not anymore supported in maven 3
[INFO] Deployment in https://repository.apache.org/content/repositories/snapshots (id=,uniqueVersion=false)
Deploying the main artifact activemq-all-5.11-SNAPSHOT.jar
Downloading: https://repository.apache.org/content/repositories/snapshots/org/apache/activemq/activemq-all/5.11-SNAPSHOT/maven-metadata.xml
Downloaded: https://repository.apache.org/content/repositories/snapshots/org/apache/activemq/activemq-all/5.11-SNAPSHOT/maven-metadata.xml (781 B at 0.4 KB/sec)
Uploading: https://repository.apache.org/content/repositories/snapshots/org/apache/activemq/activemq-all/5.11-SNAPSHOT/activemq-all-5.11-20140715.103046-34.jar
Uploading: https://repository.apache.org/content/repositories/snapshots/org/apache/activemq/activemq-all/5.11-SNAPSHOT/activemq-all-5.11-20140715.103046-34.pom
ERROR: Failed to deploy artifacts: Could not transfer artifact org.apache.activemq:activemq-all:jar:5.11-20140715.103046-34 from/to (https://repository.apache.org/content/repositories/snapshots): Failed to transfer file: https://repository.apache.org/content/repositories/snapshots/org/apache/activemq/activemq-all/5.11-SNAPSHOT/activemq-all-5.11-20140715.103046-34.jar. Return code is: 401, ReasonPhrase: Unauthorized.
org.apache.maven.artifact.deployer.ArtifactDeploymentException: Failed to deploy artifacts: Could not transfer artifact org.apache.activemq:activemq-all:jar:5.11-20140715.103046-34 from/to (https://repository.apache.org/content/repositories/snapshots): Failed to transfer file: https://repository.apache.org/content/repositories/snapshots/org/apache/activemq/activemq-all/5.11-SNAPSHOT/activemq-all-5.11-20140715.103046-34.jar. Return code is: 401, ReasonPhrase: Unauthorized.
at org.apache.maven.artifact.deployer.DefaultArtifactDeployer.deploy(DefaultArtifactDeployer.java:143)
at hudson.maven.reporters.MavenArtifactRecord.deploy(MavenArtifactRecord.java:193)
at hudson.maven.RedeployPublisher.perform(RedeployPublisher.java:176)
at hudson.tasks.BuildStepMonitor$1.perform(BuildStepMonitor.java:20)
at hudson.model.AbstractBuild$AbstractBuildExecution.perform(AbstractBuild.java:804)
at hudson.model.AbstractBuild$AbstractBuildExecution.performAllBuildSteps(AbstractBuild.java:776)
at hudson.maven.MavenModuleSetBuild$MavenModuleSetBuildExecution.post2(MavenModuleSetBuild.java:1040)
at hudson.model.AbstractBuild$AbstractBuildExecution.post(AbstractBuild.java:725)
at hudson.model.Run.execute(Run.java:1701)
at hudson.maven.MavenModuleSetBuild.run(MavenModuleSetBuild.java:529)
at hudson.model.ResourceController.execute(ResourceController.java:88)
at hudson.model.Executor.run(Executor.java:231)
Caused by: org.eclipse.aether.deployment.DeploymentException: Failed to deploy artifacts: Could not transfer artifact org.apache.activemq:activemq-all:jar:5.11-20140715.103046-34 from/to (https://repository.apache.org/content/repositories/snapshots): Failed to transfer file: https://repository.apache.org/content/repositories/snapshots/org/apache/activemq/activemq-all/5.11-SNAPSHOT/activemq-all-5.11-20140715.103046-34.jar. Return code is: 401, ReasonPhrase: Unauthorized.
at org.eclipse.aether.internal.impl.DefaultDeployer.deploy(DefaultDeployer.java:341)
at org.eclipse.aether.internal.impl.DefaultDeployer.deploy(DefaultDeployer.java:269)
at org.eclipse.aether.internal.impl.DefaultRepositorySystem.deploy(DefaultRepositorySystem.java:413)
at org.apache.maven.artifact.deployer.DefaultArtifactDeployer.deploy(DefaultArtifactDeployer.java:139)
... 11 more
Caused by: org.eclipse.aether.transfer.ArtifactTransferException: Could not transfer artifact org.apache.activemq:activemq-all:jar:5.11-20140715.103046-34 from/to (https://repository.apache.org/content/repositories/snapshots): Failed to transfer file: https://repository.apache.org/content/repositories/snapshots/org/apache/activemq/activemq-all/5.11-SNAPSHOT/activemq-all-5.11-20140715.103046-34.jar. Return code is: 401, ReasonPhrase: Unauthorized.
at org.eclipse.aether.connector.wagon.WagonRepositoryConnector$6.wrap(WagonRepositoryConnector.java:1016)
at org.eclipse.aether.connector.wagon.WagonRepositoryConnector$6.wrap(WagonRepositoryConnector.java:1004)
at org.eclipse.aether.connector.wagon.WagonRepositoryConnector$PutTask.run(WagonRepositoryConnector.java:895)
at org.eclipse.aether.connector.wagon.WagonRepositoryConnector.put(WagonRepositoryConnector.java:522)
at org.eclipse.aether.internal.impl.DefaultDeployer.deploy(DefaultDeployer.java:335)
... 14 more
Caused by: org.apache.maven.wagon.TransferFailedException: Failed to transfer file: https://repository.apache.org/content/repositories/snapshots/org/apache/activemq/activemq-all/5.11-SNAPSHOT/activemq-all-5.11-20140715.103046-34.jar. Return code is: 401, ReasonPhrase: Unauthorized.
at org.apache.maven.wagon.shared.http4.AbstractHttpClientWagon.put(AbstractHttpClientWagon.java:626)
at org.apache.maven.wagon.shared.http4.AbstractHttpClientWagon.put(AbstractHttpClientWagon.java:524)
at org.apache.maven.wagon.shared.http4.AbstractHttpClientWagon.put(AbstractHttpClientWagon.java:505)
at org.apache.maven.wagon.shared.http4.AbstractHttpClientWagon.put(AbstractHttpClientWagon.java:485)
at org.eclipse.aether.connector.wagon.WagonRepositoryConnector$PutTask.run(WagonRepositoryConnector.java:871)
... 16 more
[INFO] Deployment failed after 3.4 sec
Build step 'Deploy artifacts to Maven repository' changed build result to FAILURE