You are viewing a plain text version of this content. The canonical link for it is here.
Posted to dev@poi.apache.org by Apache Jenkins Server <je...@builds.apache.org> on 2024/11/24 07:36:13 UTC

Build failed in Jenkins: POI » POI-DSL-IBM-JDK #230

See <https://ci-builds.apache.org/job/POI/job/POI-DSL-IBM-JDK/230/display/redirect?page=changes>

Changes:

[PJ Fanning] log4j 2.24.2

[PJ Fanning] log4j 2.24.2

[Dominik Stadler] Add test to verify bug 69266

We could not reproduce the reported issue,
this test verifies this the functionality
some more now.

[Dominik Stadler] More tests for reproducible outputs

[Dominik Stadler] Apply some IDE suggestions, JavaDoc and GitHub PR

Update assertion-message
Adjust JavaDoc
Add tests
Reformat class DirectoryNode, adjust/move some comments

Closes #730

[PJ Fanning] commons-io 2.18.0

[PJ Fanning] commons-io 2.18.0

[PJ Fanning] [bug-66590] Number of blocks used by the property table missing from the file header. Thanks to Emmanuel Bourg. This closes #728

[PJ Fanning] [gitub-727] Remove DSTAMP token substitution. Thanks to Emmanuel Bourg. This closes #727

[PJ Fanning] [bug-66590] Number of blocks used by the property table missing from the file header

[PJ Fanning] [bug-66590] Number of blocks used by the property table missing from the file header. Thanks to Emmanuel Bourg. This closes #462

[PJ Fanning] [bug-66590] Number of blocks used by the property table missing from the file header. Thanks to Emmanuel Bourg. This closes #462

[PJ Fanning] snapshot version


------------------------------------------
[...truncated 277.53 KB...]
[junitlauncher] Running org.apache.poi.xssf.usermodel.TestSXSSFBugs
[junitlauncher]    Aborted: bug59393_commentsCanHaveSameAnchor(): org.opentest4j.TestAbortedException: Assumption failed: assumption is not true
[junitlauncher] Tests run: 42, Failures: 0, Aborted: 1, Skipped: 2, Time elapsed: 3.904000 sec
[junitlauncher] Running org.apache.poi.xssf.usermodel.TestSXSSFSheetAutosizeColumn
[junitlauncher] 
[junitlauncher] Running org.apache.poi.xssf.usermodel.TestSXSSFSheetAutosizeColumn
[junitlauncher] Tests run: 8, Failures: 0, Aborted: 0, Skipped: 0, Time elapsed: 0.035000 sec
[junitlauncher] Running org.apache.poi.xssf.usermodel.TestSheetHiding
[junitlauncher] 
[junitlauncher] Running org.apache.poi.xssf.usermodel.TestSheetHiding
[junitlauncher] Tests run: 5, Failures: 0, Aborted: 0, Skipped: 0, Time elapsed: 0.095000 sec
[junitlauncher] Running org.apache.poi.xssf.usermodel.TestTableStyles
[junitlauncher] 
[junitlauncher] Running org.apache.poi.xssf.usermodel.TestTableStyles
[junitlauncher] Tests run: 2, Failures: 0, Aborted: 0, Skipped: 0, Time elapsed: 0.189000 sec
[junitlauncher] Running org.apache.poi.xssf.usermodel.TestXSSFBugs
[junitlauncher] 
[junitlauncher] Running org.apache.poi.xssf.usermodel.TestXSSFBugs
[junitlauncher]    Aborted: bug59393_commentsCanHaveSameAnchor(): org.opentest4j.TestAbortedException: Assumption failed: assumption is not true
[junitlauncher] Tests run: 192, Failures: 0, Aborted: 1, Skipped: 8, Time elapsed: 12.547000 sec
[junitlauncher] Running org.apache.poi.xssf.usermodel.TestXSSFCell
[junitlauncher] 
[junitlauncher] Running org.apache.poi.xssf.usermodel.TestXSSFCell
[junitlauncher] Tests run: 78, Failures: 0, Aborted: 0, Skipped: 0, Time elapsed: 0.668000 sec
[junitlauncher] Running org.apache.poi.xssf.usermodel.TestXSSFCellStyle
[junitlauncher] 
[junitlauncher] Running org.apache.poi.xssf.usermodel.TestXSSFCellStyle
[junitlauncher] Tests run: 43, Failures: 0, Aborted: 0, Skipped: 0, Time elapsed: 0.164000 sec
[junitlauncher] Running org.apache.poi.xssf.usermodel.TestXSSFChart
[junitlauncher] 
[junitlauncher] Running org.apache.poi.xssf.usermodel.TestXSSFChart
[junitlauncher] Tests run: 3, Failures: 0, Aborted: 0, Skipped: 0, Time elapsed: 0.089000 sec
[junitlauncher] Running org.apache.poi.xssf.usermodel.TestXSSFChartSheet
[junitlauncher] 
[junitlauncher] Running org.apache.poi.xssf.usermodel.TestXSSFChartSheet
[junitlauncher] Tests run: 3, Failures: 0, Aborted: 0, Skipped: 0, Time elapsed: 0.038000 sec
[junitlauncher] Running org.apache.poi.xssf.usermodel.TestXSSFColGrouping
[junitlauncher] 
[junitlauncher] Running org.apache.poi.xssf.usermodel.TestXSSFColGrouping
[junitlauncher] Tests run: 6, Failures: 0, Aborted: 0, Skipped: 0, Time elapsed: 0.062000 sec
[junitlauncher] Running org.apache.poi.xssf.usermodel.TestXSSFColor
[junitlauncher] 
[junitlauncher] Running org.apache.poi.xssf.usermodel.TestXSSFColor
[junitlauncher] Tests run: 4, Failures: 0, Aborted: 0, Skipped: 0, Time elapsed: 0.063000 sec
[junitlauncher] Running org.apache.poi.xssf.usermodel.TestXSSFComment
[junitlauncher] 
[junitlauncher] Running org.apache.poi.xssf.usermodel.TestXSSFComment
[junitlauncher] Tests run: 27, Failures: 0, Aborted: 0, Skipped: 0, Time elapsed: 0.276000 sec
[junitlauncher] Running org.apache.poi.xssf.usermodel.TestXSSFConditionalFormatting
[junitlauncher] 
[junitlauncher] Running org.apache.poi.xssf.usermodel.TestXSSFConditionalFormatting
[junitlauncher] Tests run: 24, Failures: 0, Aborted: 0, Skipped: 0, Time elapsed: 0.129000 sec
[junitlauncher] Running org.apache.poi.xssf.usermodel.TestXSSFDataFormat
[junitlauncher] 
[junitlauncher] Running org.apache.poi.xssf.usermodel.TestXSSFDataFormat
[junitlauncher] Tests run: 12, Failures: 0, Aborted: 0, Skipped: 0, Time elapsed: 0.068000 sec
[junitlauncher] Running org.apache.poi.xssf.usermodel.TestXSSFDataValidation
[junitlauncher] 
[junitlauncher] Running org.apache.poi.xssf.usermodel.TestXSSFDataValidation
[junitlauncher] Tests run: 9, Failures: 0, Aborted: 0, Skipped: 0, Time elapsed: 0.289000 sec
[junitlauncher] Running org.apache.poi.xssf.usermodel.TestXSSFDataValidationConstraint
[junitlauncher] 
[junitlauncher] Running org.apache.poi.xssf.usermodel.TestXSSFDataValidationConstraint
[junitlauncher] Tests run: 6, Failures: 0, Aborted: 0, Skipped: 0, Time elapsed: 0.009000 sec
[junitlauncher] Running org.apache.poi.xssf.usermodel.TestXSSFDialogSheet
[junitlauncher] 
[junitlauncher] Running org.apache.poi.xssf.usermodel.TestXSSFDialogSheet
[junitlauncher] Tests run: 14, Failures: 0, Aborted: 0, Skipped: 0, Time elapsed: 0.024000 sec
[junitlauncher] Running org.apache.poi.xssf.usermodel.TestXSSFDrawing
[junitlauncher] 
[junitlauncher] Running org.apache.poi.xssf.usermodel.TestXSSFDrawing
[junitlauncher] Tests run: 22, Failures: 0, Aborted: 0, Skipped: 0, Time elapsed: 0.444000 sec
[junitlauncher] Running org.apache.poi.xssf.usermodel.TestXSSFEvaluationSheet
[junitlauncher] 
[junitlauncher] Running org.apache.poi.xssf.usermodel.TestXSSFEvaluationSheet
[junitlauncher] Tests run: 3, Failures: 0, Aborted: 0, Skipped: 0, Time elapsed: 0.005000 sec
[junitlauncher] Running org.apache.poi.xssf.usermodel.TestXSSFEvaluationWorkbook
[junitlauncher] 
[junitlauncher] Running org.apache.poi.xssf.usermodel.TestXSSFEvaluationWorkbook
[junitlauncher] Tests run: 1, Failures: 0, Aborted: 0, Skipped: 0, Time elapsed: 0.002000 sec
[junitlauncher] Running org.apache.poi.xssf.usermodel.TestXSSFEvenFooter
[junitlauncher] 
[junitlauncher] Running org.apache.poi.xssf.usermodel.TestXSSFEvenFooter
[junitlauncher] Tests run: 1, Failures: 0, Aborted: 0, Skipped: 0, Time elapsed: 0.002000 sec
[junitlauncher] Running org.apache.poi.xssf.usermodel.TestXSSFEvenHeader
[junitlauncher] 
[junitlauncher] Running org.apache.poi.xssf.usermodel.TestXSSFEvenHeader
[junitlauncher] Tests run: 1, Failures: 0, Aborted: 0, Skipped: 0, Time elapsed: 0.002000 sec
[junitlauncher] Running org.apache.poi.xssf.usermodel.TestXSSFExternalFunctions
[junitlauncher] 
[junitlauncher] Running org.apache.poi.xssf.usermodel.TestXSSFExternalFunctions
[junitlauncher] Tests run: 2, Failures: 0, Aborted: 0, Skipped: 0, Time elapsed: 0.016000 sec
[junitlauncher] Running org.apache.poi.xssf.usermodel.TestXSSFFirstFooter
[junitlauncher] 
[junitlauncher] Running org.apache.poi.xssf.usermodel.TestXSSFFirstFooter
[junitlauncher] Tests run: 1, Failures: 0, Aborted: 0, Skipped: 0, Time elapsed: 0.002000 sec
[junitlauncher] Running org.apache.poi.xssf.usermodel.TestXSSFFirstHeader
[junitlauncher] 
[junitlauncher] Running org.apache.poi.xssf.usermodel.TestXSSFFirstHeader
[junitlauncher] Tests run: 1, Failures: 0, Aborted: 0, Skipped: 0, Time elapsed: 0.002000 sec
[junitlauncher] Running org.apache.poi.xssf.usermodel.TestXSSFFont
[junitlauncher] 
[junitlauncher] Running org.apache.poi.xssf.usermodel.TestXSSFFont
[junitlauncher] Tests run: 29, Failures: 0, Aborted: 0, Skipped: 0, Time elapsed: 0.086000 sec
[junitlauncher] Running org.apache.poi.xssf.usermodel.TestXSSFForkedEvaluator
[junitlauncher] 
[junitlauncher] Running org.apache.poi.xssf.usermodel.TestXSSFForkedEvaluator
[junitlauncher] Tests run: 2, Failures: 0, Aborted: 0, Skipped: 0, Time elapsed: 0.011000 sec
[junitlauncher] Running org.apache.poi.xssf.usermodel.TestXSSFFormulaEvaluation
[junitlauncher] 
[junitlauncher] Running org.apache.poi.xssf.usermodel.TestXSSFFormulaEvaluation
[junitlauncher] Tests run: 43, Failures: 0, Aborted: 0, Skipped: 1, Time elapsed: 0.214000 sec
[junitlauncher] Running org.apache.poi.xssf.usermodel.TestXSSFFormulaParser
[junitlauncher] 
[junitlauncher] Running org.apache.poi.xssf.usermodel.TestXSSFFormulaParser
[junitlauncher] Tests run: 13, Failures: 0, Aborted: 0, Skipped: 0, Time elapsed: 0.083000 sec
[junitlauncher] Running org.apache.poi.xssf.usermodel.TestXSSFHeaderFooterProperties
[junitlauncher] 
[junitlauncher] Running org.apache.poi.xssf.usermodel.TestXSSFHeaderFooterProperties
[junitlauncher] Tests run: 8, Failures: 0, Aborted: 0, Skipped: 0, Time elapsed: 0.012000 sec
[junitlauncher] Running org.apache.poi.xssf.usermodel.TestXSSFHyperlink
[junitlauncher] 
[junitlauncher] Running org.apache.poi.xssf.usermodel.TestXSSFHyperlink
[junitlauncher] Tests run: 19, Failures: 0, Aborted: 0, Skipped: 0, Time elapsed: 0.235000 sec
[junitlauncher] Running org.apache.poi.xssf.usermodel.TestXSSFName
[junitlauncher] 
[junitlauncher] Running org.apache.poi.xssf.usermodel.TestXSSFName
[junitlauncher] Tests run: 47, Failures: 0, Aborted: 0, Skipped: 0, Time elapsed: 0.117000 sec
[junitlauncher] Running org.apache.poi.xssf.usermodel.TestXSSFOddFooter
[junitlauncher] 
[junitlauncher] Running org.apache.poi.xssf.usermodel.TestXSSFOddFooter
[junitlauncher] Tests run: 1, Failures: 0, Aborted: 0, Skipped: 0, Time elapsed: 0.002000 sec
[junitlauncher] Running org.apache.poi.xssf.usermodel.TestXSSFOddHeader
[junitlauncher] 
[junitlauncher] Running org.apache.poi.xssf.usermodel.TestXSSFOddHeader
[junitlauncher] Tests run: 1, Failures: 0, Aborted: 0, Skipped: 0, Time elapsed: 0.002000 sec
[junitlauncher] Running org.apache.poi.xssf.usermodel.TestXSSFPicture
[junitlauncher] 
[junitlauncher] Running org.apache.poi.xssf.usermodel.TestXSSFPicture
[junitlauncher] Tests run: 9, Failures: 0, Aborted: 0, Skipped: 0, Time elapsed: 0.257000 sec
[junitlauncher] Running org.apache.poi.xssf.usermodel.TestXSSFPictureData
[junitlauncher] 
[junitlauncher] Running org.apache.poi.xssf.usermodel.TestXSSFPictureData
[junitlauncher] Tests run: 4, Failures: 0, Aborted: 0, Skipped: 0, Time elapsed: 0.071000 sec
[junitlauncher] Running org.apache.poi.xssf.usermodel.TestXSSFPivotTableName
[junitlauncher] 
[junitlauncher] Running org.apache.poi.xssf.usermodel.TestXSSFPivotTableName
[junitlauncher] Tests run: 18, Failures: 0, Aborted: 0, Skipped: 0, Time elapsed: 0.470000 sec
[junitlauncher] Running org.apache.poi.xssf.usermodel.TestXSSFPivotTableRef
[junitlauncher] 
[junitlauncher] Running org.apache.poi.xssf.usermodel.TestXSSFPivotTableRef
[junitlauncher] Tests run: 18, Failures: 0, Aborted: 0, Skipped: 0, Time elapsed: 0.393000 sec
[junitlauncher] Running org.apache.poi.xssf.usermodel.TestXSSFPivotTableSorting
[junitlauncher] 
[junitlauncher] Running org.apache.poi.xssf.usermodel.TestXSSFPivotTableSorting
[junitlauncher] Tests run: 1, Failures: 0, Aborted: 0, Skipped: 0, Time elapsed: 0.016000 sec
[junitlauncher] Running org.apache.poi.xssf.usermodel.TestXSSFPrintSetup
[junitlauncher] 
[junitlauncher] Running org.apache.poi.xssf.usermodel.TestXSSFPrintSetup
[junitlauncher] Tests run: 19, Failures: 0, Aborted: 0, Skipped: 0, Time elapsed: 0.046000 sec
[junitlauncher] Running org.apache.poi.xssf.usermodel.TestXSSFRichTextString
[junitlauncher] 
[junitlauncher] Running org.apache.poi.xssf.usermodel.TestXSSFRichTextString
[junitlauncher] Tests run: 20, Failures: 0, Aborted: 0, Skipped: 0, Time elapsed: 0.037000 sec
[junitlauncher] Running org.apache.poi.xssf.usermodel.TestXSSFRow
[junitlauncher] 
[junitlauncher] Running org.apache.poi.xssf.usermodel.TestXSSFRow
[junitlauncher] Tests run: 26, Failures: 0, Aborted: 0, Skipped: 0, Time elapsed: 0.298000 sec
[junitlauncher] Running org.apache.poi.xssf.usermodel.TestXSSFShape
[junitlauncher] 
[junitlauncher] Running org.apache.poi.xssf.usermodel.TestXSSFShape
[junitlauncher] Tests run: 2, Failures: 0, Aborted: 0, Skipped: 0, Time elapsed: 0.046000 sec
[junitlauncher] Running org.apache.poi.xssf.usermodel.TestXSSFSheet
[junitlauncher] 
[junitlauncher] Running org.apache.poi.xssf.usermodel.TestXSSFSheet
[junitlauncher] Tests run: 120, Failures: 0, Aborted: 0, Skipped: 0, Time elapsed: 3.982000 sec
[junitlauncher] Running org.apache.poi.xssf.usermodel.TestXSSFSheetAutosizeColumn
[junitlauncher] 
[junitlauncher] Running org.apache.poi.xssf.usermodel.TestXSSFSheetAutosizeColumn
[junitlauncher] Tests run: 8, Failures: 0, Aborted: 0, Skipped: 0, Time elapsed: 0.017000 sec
[junitlauncher] Running org.apache.poi.xssf.usermodel.TestXSSFSheetMergeRegions
[junitlauncher] 
[junitlauncher] Running org.apache.poi.xssf.usermodel.TestXSSFSheetMergeRegions
[junitlauncher] Tests run: 1, Failures: 0, Aborted: 0, Skipped: 0, Time elapsed: 0.897000 sec
[junitlauncher] Running org.apache.poi.xssf.usermodel.TestXSSFSheetRowGrouping
[junitlauncher] 
[junitlauncher] Running org.apache.poi.xssf.usermodel.TestXSSFSheetRowGrouping
[junitlauncher] Tests run: 6, Failures: 0, Aborted: 0, Skipped: 0, Time elapsed: 0.196000 sec
[junitlauncher] Running org.apache.poi.xssf.usermodel.TestXSSFSheetShiftColumns
[junitlauncher] 
[junitlauncher] Running org.apache.poi.xssf.usermodel.TestXSSFSheetShiftColumns
[junitlauncher] Tests run: 11, Failures: 0, Aborted: 0, Skipped: 0, Time elapsed: 0.069000 sec
[junitlauncher] Running org.apache.poi.xssf.usermodel.TestXSSFSheetShiftRows
[junitlauncher] 
[junitlauncher] Running org.apache.poi.xssf.usermodel.TestXSSFSheetShiftRows
[junitlauncher] Tests run: 35, Failures: 0, Aborted: 0, Skipped: 0, Time elapsed: 22.130000 sec
[junitlauncher] Running org.apache.poi.xssf.usermodel.TestXSSFSheetShiftRowsAndColumns
[junitlauncher] 
[junitlauncher] Running org.apache.poi.xssf.usermodel.TestXSSFSheetShiftRowsAndColumns
[junitlauncher] Tests run: 5, Failures: 0, Aborted: 0, Skipped: 0, Time elapsed: 0.031000 sec
[junitlauncher] Running org.apache.poi.xssf.usermodel.TestXSSFSheetUpdateArrayFormulas
[junitlauncher] 
[junitlauncher] Running org.apache.poi.xssf.usermodel.TestXSSFSheetUpdateArrayFormulas
[junitlauncher] Tests run: 18, Failures: 0, Aborted: 0, Skipped: 1, Time elapsed: 0.035000 sec
[junitlauncher] Running org.apache.poi.xssf.usermodel.TestXSSFSimpleShape
[junitlauncher] 
[junitlauncher] Running org.apache.poi.xssf.usermodel.TestXSSFSimpleShape
[junitlauncher] Tests run: 1, Failures: 0, Aborted: 0, Skipped: 0, Time elapsed: 0.012000 sec
[junitlauncher] Running org.apache.poi.xssf.usermodel.TestXSSFTable
[junitlauncher] 
[junitlauncher] Running org.apache.poi.xssf.usermodel.TestXSSFTable
[junitlauncher] Tests run: 36, Failures: 0, Aborted: 0, Skipped: 0, Time elapsed: 0.443000 sec
[junitlauncher] Running org.apache.poi.xssf.usermodel.TestXSSFTableColumn
[junitlauncher] 
[junitlauncher] Running org.apache.poi.xssf.usermodel.TestXSSFTableColumn
[junitlauncher] Tests run: 3, Failures: 0, Aborted: 0, Skipped: 0, Time elapsed: 0.040000 sec
[junitlauncher] Running org.apache.poi.xssf.usermodel.TestXSSFTextParagraph
[junitlauncher] 
[junitlauncher] Running org.apache.poi.xssf.usermodel.TestXSSFTextParagraph
[junitlauncher] Tests run: 1, Failures: 0, Aborted: 0, Skipped: 0, Time elapsed: 0.008000 sec
[junitlauncher] Running org.apache.poi.xssf.usermodel.TestXSSFTextRun
[junitlauncher] 
[junitlauncher] Running org.apache.poi.xssf.usermodel.TestXSSFTextRun
[junitlauncher] Tests run: 1, Failures: 0, Aborted: 0, Skipped: 0, Time elapsed: 0.005000 sec
[junitlauncher] Running org.apache.poi.xssf.usermodel.TestXSSFUnicodeSurrogates
[junitlauncher] 
[junitlauncher] Running org.apache.poi.xssf.usermodel.TestXSSFUnicodeSurrogates
[junitlauncher] Tests run: 1, Failures: 0, Aborted: 0, Skipped: 0, Time elapsed: 0.011000 sec
[junitlauncher] Running org.apache.poi.xssf.usermodel.TestXSSFVMLDrawing
[junitlauncher] 
[junitlauncher] Running org.apache.poi.xssf.usermodel.TestXSSFVMLDrawing
[junitlauncher]    Failed: testInvalidFile(): org.apache.poi.ooxml.POIXMLException: org.apache.xmlbeans.XmlException: error: Attribute name "sheetId" associated with an element type "sheet" must be followed by the ' = ' character.
[junitlauncher] Tests run: 6, Failures: 1, Aborted: 0, Skipped: 0, Time elapsed: 0.079000 sec

BUILD FAILED
<https://ci-builds.apache.org/job/POI/job/POI-DSL-IBM-JDK/ws/build.xml>:1806: The following error occurred while executing this line:
<https://ci-builds.apache.org/job/POI/job/POI-DSL-IBM-JDK/ws/build.xml>:1778: The following error occurred while executing this line:
<https://ci-builds.apache.org/job/POI/job/POI-DSL-IBM-JDK/ws/build.xml>:1385: Some test(s) have failure(s)

Total time: 7 minutes 27 seconds
Build step 'Invoke Ant' marked build as failure
[SpotBugs] Skipping execution of recorder since overall result is 'FAILURE'
ERROR: Not all environment variables could be successfully injected. Check for similarly-named environment variables.
Archiving artifacts
ERROR: Not all environment variables could be successfully injected. Check for similarly-named environment variables.
Recording test results
ERROR: Not all environment variables could be successfully injected. Check for similarly-named environment variables.
[Checks API] No suitable checks publisher found.
ERROR: Not all environment variables could be successfully injected. Check for similarly-named environment variables.

---------------------------------------------------------------------
To unsubscribe, e-mail: dev-unsubscribe@poi.apache.org
For additional commands, e-mail: dev-help@poi.apache.org


Jenkins build is back to normal : POI » POI-DSL-IBM-JDK #232

Posted by Apache Jenkins Server <je...@builds.apache.org>.
See <https://ci-builds.apache.org/job/POI/job/POI-DSL-IBM-JDK/232/display/redirect?page=changes>


---------------------------------------------------------------------
To unsubscribe, e-mail: dev-unsubscribe@poi.apache.org
For additional commands, e-mail: dev-help@poi.apache.org


Build failed in Jenkins: POI » POI-DSL-IBM-JDK #231

Posted by Apache Jenkins Server <je...@builds.apache.org>.
See <https://ci-builds.apache.org/job/POI/job/POI-DSL-IBM-JDK/231/display/redirect?page=changes>

Changes:

[PJ Fanning] [github-735] POIFS: optimise occupied size calc. Thanks to Emmanuel Bourg. This closes #735

[Dominik Stadler] Expect an XML parser error in one test when running with IBM JDK

[Dominik Stadler] Jenkins DSL: Remove POI builds for non-LTS JDKs 18, 19 and 20

[Dominik Stadler] Groovy script example: Use latest POI and fix to run again

Fix path to test-file
Fix changed constants
Add settings.gradle
Adjust Rat exclusions

[Dominik Stadler] Jenkins DSL: adoptopenjdk is not available any more

[PJ Fanning] gradle 8.11.1

[PJ Fanning] add back 731 changes but increase gradle heap

[PJ Fanning] test with xmlbeans 5.3.0 rc1

[PJ Fanning] revert 731 because of suspicious mem issues in ci-builds

[PJ Fanning] add mirr test

[PJ Fanning] add mirr test

[PJ Fanning] [github-733] Fix rate order in Mirr function. Thanks to Aleksandrs Jansons. This closes #733

[PJ Fanning] [github-731] Fix the mini-stream size in the root property. This closes #731

[PJ Fanning] PoiLogManager

[PJ Fanning] PoiLogManager

[PJ Fanning] PoiLogManager

[PJ Fanning] PoiLogManager

[PJ Fanning] forbidden-apis

[PJ Fanning] PoiLogManager

[PJ Fanning] PoiLogManager


------------------------------------------
[...truncated 311.15 KiB...]
[junitlauncher] Running org.apache.poi.xssf.usermodel.helpers.TestHeaderFooterHelper
[junitlauncher] 
[junitlauncher] Running org.apache.poi.xssf.usermodel.helpers.TestHeaderFooterHelper
[junitlauncher] Tests run: 2, Failures: 0, Aborted: 0, Skipped: 0, Time elapsed: 0.000000 sec
[junitlauncher] Running org.apache.poi.xssf.usermodel.helpers.TestXSSFColumnShifting
[junitlauncher] 
[junitlauncher] Running org.apache.poi.xssf.usermodel.helpers.TestXSSFColumnShifting
[junitlauncher] Tests run: 2, Failures: 0, Aborted: 0, Skipped: 0, Time elapsed: 0.001000 sec
[junitlauncher] Running org.apache.poi.xssf.util.TestCTColComparator
[junitlauncher] 
[junitlauncher] Running org.apache.poi.xssf.util.TestCTColComparator
[junitlauncher] Tests run: 2, Failures: 0, Aborted: 0, Skipped: 0, Time elapsed: 0.000000 sec
[junitlauncher] Running org.apache.poi.xssf.util.TestEvilUnclosedBRFixingInputStream
[junitlauncher] 
[junitlauncher] Running org.apache.poi.xssf.util.TestEvilUnclosedBRFixingInputStream
[junitlauncher] Tests run: 3, Failures: 0, Aborted: 0, Skipped: 0, Time elapsed: 0.024000 sec
[junitlauncher] Running org.apache.poi.xssf.util.TestNumericRanges
[junitlauncher] 
[junitlauncher] Running org.apache.poi.xssf.util.TestNumericRanges
[junitlauncher] Tests run: 2, Failures: 0, Aborted: 0, Skipped: 0, Time elapsed: 0.001000 sec
[junitlauncher] Running org.apache.poi.xwpf.TestAllExtendedProperties
[junitlauncher] 
[junitlauncher] Running org.apache.poi.xwpf.TestAllExtendedProperties
[junitlauncher] Tests run: 1, Failures: 0, Aborted: 0, Skipped: 0, Time elapsed: 0.022000 sec
[junitlauncher] Running org.apache.poi.xwpf.TestDocumentProtection
[junitlauncher] 
[junitlauncher] Running org.apache.poi.xwpf.TestDocumentProtection
[junitlauncher] Tests run: 10, Failures: 0, Aborted: 0, Skipped: 0, Time elapsed: 0.243000 sec
[junitlauncher] Running org.apache.poi.xwpf.TestNecessaryOOXMLClasses
[junitlauncher] 
[junitlauncher] Running org.apache.poi.xwpf.TestNecessaryOOXMLClasses
[junitlauncher] Tests run: 1, Failures: 0, Aborted: 0, Skipped: 0, Time elapsed: 0.009000 sec
[junitlauncher] Running org.apache.poi.xwpf.TestPackageCorePropertiesGetKeywords
[junitlauncher] 
[junitlauncher] Running org.apache.poi.xwpf.TestPackageCorePropertiesGetKeywords
[junitlauncher] Tests run: 1, Failures: 0, Aborted: 0, Skipped: 0, Time elapsed: 0.020000 sec
[junitlauncher] Running org.apache.poi.xwpf.TestXWPFBugs
[junitlauncher] 
[junitlauncher] Running org.apache.poi.xwpf.TestXWPFBugs
[junitlauncher] Tests run: 11, Failures: 0, Aborted: 0, Skipped: 0, Time elapsed: 1.301000 sec
[junitlauncher] Running org.apache.poi.xwpf.extractor.TestExternalEntities
[junitlauncher] 
[junitlauncher] Running org.apache.poi.xwpf.extractor.TestExternalEntities
[junitlauncher] Tests run: 1, Failures: 0, Aborted: 0, Skipped: 0, Time elapsed: 0.012000 sec
[junitlauncher] Running org.apache.poi.xwpf.extractor.TestXWPFWordExtractor
[junitlauncher] 
[junitlauncher] Running org.apache.poi.xwpf.extractor.TestXWPFWordExtractor
[junitlauncher] Tests run: 27, Failures: 0, Aborted: 0, Skipped: 0, Time elapsed: 0.468000 sec
[junitlauncher] Running org.apache.poi.xwpf.model.TestMultiSectionHeaders
[junitlauncher] 
[junitlauncher] Running org.apache.poi.xwpf.model.TestMultiSectionHeaders
[junitlauncher] Tests run: 2, Failures: 0, Aborted: 0, Skipped: 0, Time elapsed: 0.003000 sec
[junitlauncher] Running org.apache.poi.xwpf.model.TestXWPFDecorators
[junitlauncher] 
[junitlauncher] Running org.apache.poi.xwpf.model.TestXWPFDecorators
[junitlauncher] Tests run: 2, Failures: 0, Aborted: 0, Skipped: 0, Time elapsed: 0.064000 sec
[junitlauncher] Running org.apache.poi.xwpf.model.TestXWPFHeaderFooterPolicy
[junitlauncher] 
[junitlauncher] Running org.apache.poi.xwpf.model.TestXWPFHeaderFooterPolicy
[junitlauncher] Tests run: 3, Failures: 0, Aborted: 0, Skipped: 0, Time elapsed: 0.144000 sec
[junitlauncher] Running org.apache.poi.xwpf.usermodel.TestChangeTracking
[junitlauncher] 
[junitlauncher] Running org.apache.poi.xwpf.usermodel.TestChangeTracking
[junitlauncher] Tests run: 3, Failures: 0, Aborted: 0, Skipped: 0, Time elapsed: 0.026000 sec
[junitlauncher] Running org.apache.poi.xwpf.usermodel.TestColumn
[junitlauncher] 
[junitlauncher] Running org.apache.poi.xwpf.usermodel.TestColumn
[junitlauncher] Tests run: 4, Failures: 0, Aborted: 0, Skipped: 0, Time elapsed: 0.019000 sec
[junitlauncher] Running org.apache.poi.xwpf.usermodel.TestXWPFAbstractNum
[junitlauncher] 
[junitlauncher] Running org.apache.poi.xwpf.usermodel.TestXWPFAbstractNum
[junitlauncher] Tests run: 1, Failures: 0, Aborted: 0, Skipped: 0, Time elapsed: 0.001000 sec
[junitlauncher] Running org.apache.poi.xwpf.usermodel.TestXWPFBugs
[junitlauncher] 
[junitlauncher] Running org.apache.poi.xwpf.usermodel.TestXWPFBugs
[junitlauncher] Tests run: 14, Failures: 0, Aborted: 0, Skipped: 0, Time elapsed: 0.251000 sec
[junitlauncher] Running org.apache.poi.xwpf.usermodel.TestXWPFChart
[junitlauncher] 
[junitlauncher] Running org.apache.poi.xwpf.usermodel.TestXWPFChart
[junitlauncher] Tests run: 4, Failures: 0, Aborted: 0, Skipped: 0, Time elapsed: 0.038000 sec
[junitlauncher] Running org.apache.poi.xwpf.usermodel.TestXWPFComment
[junitlauncher] 
[junitlauncher] Running org.apache.poi.xwpf.usermodel.TestXWPFComment
[junitlauncher] Tests run: 6, Failures: 0, Aborted: 0, Skipped: 0, Time elapsed: 0.281000 sec
[junitlauncher] Running org.apache.poi.xwpf.usermodel.TestXWPFComments
[junitlauncher] 
[junitlauncher] Running org.apache.poi.xwpf.usermodel.TestXWPFComments
[junitlauncher] Tests run: 2, Failures: 0, Aborted: 0, Skipped: 0, Time elapsed: 0.017000 sec
[junitlauncher] Running org.apache.poi.xwpf.usermodel.TestXWPFDocument
[junitlauncher] 
[junitlauncher] Running org.apache.poi.xwpf.usermodel.TestXWPFDocument
[junitlauncher] Tests run: 26, Failures: 0, Aborted: 0, Skipped: 1, Time elapsed: 0.352000 sec
[junitlauncher] Running org.apache.poi.xwpf.usermodel.TestXWPFEndnote
[junitlauncher] 
[junitlauncher] Running org.apache.poi.xwpf.usermodel.TestXWPFEndnote
[junitlauncher] Tests run: 4, Failures: 0, Aborted: 0, Skipped: 0, Time elapsed: 0.018000 sec
[junitlauncher] Running org.apache.poi.xwpf.usermodel.TestXWPFEndnotes
[junitlauncher] 
[junitlauncher] Running org.apache.poi.xwpf.usermodel.TestXWPFEndnotes
[junitlauncher] Tests run: 2, Failures: 0, Aborted: 0, Skipped: 0, Time elapsed: 0.008000 sec
[junitlauncher] Running org.apache.poi.xwpf.usermodel.TestXWPFFootnote
[junitlauncher] 
[junitlauncher] Running org.apache.poi.xwpf.usermodel.TestXWPFFootnote
[junitlauncher] Tests run: 4, Failures: 0, Aborted: 0, Skipped: 0, Time elapsed: 0.015000 sec
[junitlauncher] Running org.apache.poi.xwpf.usermodel.TestXWPFFootnotes
[junitlauncher] 
[junitlauncher] Running org.apache.poi.xwpf.usermodel.TestXWPFFootnotes
[junitlauncher] Tests run: 3, Failures: 0, Aborted: 0, Skipped: 0, Time elapsed: 0.023000 sec
[junitlauncher] Running org.apache.poi.xwpf.usermodel.TestXWPFHeader
[junitlauncher] 
[junitlauncher] Running org.apache.poi.xwpf.usermodel.TestXWPFHeader
[junitlauncher] Tests run: 6, Failures: 0, Aborted: 0, Skipped: 0, Time elapsed: 0.109000 sec
[junitlauncher] Running org.apache.poi.xwpf.usermodel.TestXWPFHeadings
[junitlauncher] 
[junitlauncher] Running org.apache.poi.xwpf.usermodel.TestXWPFHeadings
[junitlauncher] Tests run: 1, Failures: 0, Aborted: 0, Skipped: 0, Time elapsed: 0.024000 sec
[junitlauncher] Running org.apache.poi.xwpf.usermodel.TestXWPFNumbering
[junitlauncher] 
[junitlauncher] Running org.apache.poi.xwpf.usermodel.TestXWPFNumbering
[junitlauncher] Tests run: 10, Failures: 0, Aborted: 0, Skipped: 0, Time elapsed: 0.097000 sec
[junitlauncher] Running org.apache.poi.xwpf.usermodel.TestXWPFParagraph
[junitlauncher] 
[junitlauncher] Running org.apache.poi.xwpf.usermodel.TestXWPFParagraph
[junitlauncher] Tests run: 31, Failures: 0, Aborted: 0, Skipped: 0, Time elapsed: 0.170000 sec
[junitlauncher] Running org.apache.poi.xwpf.usermodel.TestXWPFPictureData
[junitlauncher] 
[junitlauncher] Running org.apache.poi.xwpf.usermodel.TestXWPFPictureData
[junitlauncher] Tests run: 6, Failures: 0, Aborted: 0, Skipped: 0, Time elapsed: 0.127000 sec
[junitlauncher] Running org.apache.poi.xwpf.usermodel.TestXWPFRun
[junitlauncher] 
[junitlauncher] Running org.apache.poi.xwpf.usermodel.TestXWPFRun
[junitlauncher] Tests run: 39, Failures: 0, Aborted: 0, Skipped: 0, Time elapsed: 0.166000 sec
[junitlauncher] Running org.apache.poi.xwpf.usermodel.TestXWPFSDT
[junitlauncher] 
[junitlauncher] Running org.apache.poi.xwpf.usermodel.TestXWPFSDT
[junitlauncher] Tests run: 7, Failures: 0, Aborted: 0, Skipped: 0, Time elapsed: 0.090000 sec
[junitlauncher] Running org.apache.poi.xwpf.usermodel.TestXWPFSmartTag
[junitlauncher] 
[junitlauncher] Running org.apache.poi.xwpf.usermodel.TestXWPFSmartTag
[junitlauncher] Tests run: 1, Failures: 0, Aborted: 0, Skipped: 0, Time elapsed: 0.008000 sec
[junitlauncher] Running org.apache.poi.xwpf.usermodel.TestXWPFStyles
[junitlauncher] 
[junitlauncher] Running org.apache.poi.xwpf.usermodel.TestXWPFStyles
[junitlauncher] Tests run: 11, Failures: 0, Aborted: 0, Skipped: 0, Time elapsed: 0.101000 sec
[junitlauncher] Running org.apache.poi.xwpf.usermodel.TestXWPFTable
[junitlauncher] 
[junitlauncher] Running org.apache.poi.xwpf.usermodel.TestXWPFTable
[junitlauncher] Tests run: 17, Failures: 0, Aborted: 0, Skipped: 0, Time elapsed: 0.054000 sec
[junitlauncher] Running org.apache.poi.xwpf.usermodel.TestXWPFTableCell
[junitlauncher] 
[junitlauncher] Running org.apache.poi.xwpf.usermodel.TestXWPFTableCell
[junitlauncher] Tests run: 13, Failures: 0, Aborted: 0, Skipped: 0, Time elapsed: 0.044000 sec
[junitlauncher] Running org.apache.poi.xwpf.usermodel.TestXWPFTableRow
[junitlauncher] 
[junitlauncher] Running org.apache.poi.xwpf.usermodel.TestXWPFTableRow
[junitlauncher] Tests run: 9, Failures: 0, Aborted: 0, Skipped: 0, Time elapsed: 0.031000 sec
[junitlauncher] Running org.apache.poi.xwpf.usermodel.TestXWPFTheme
[junitlauncher] 
[junitlauncher] Running org.apache.poi.xwpf.usermodel.TestXWPFTheme
[junitlauncher] Tests run: 1, Failures: 0, Aborted: 0, Skipped: 0, Time elapsed: 0.014000 sec

-test-ooxml-write-testfile:

compile-ooxml-lite:
     [echo] Create ooxml-lite schemas
     [copy] Copying 1 file to <https://ci-builds.apache.org/job/POI/job/POI-DSL-IBM-JDK/ws/src/resources>
     [copy] Copying 1 file to <https://ci-builds.apache.org/job/POI/job/POI-DSL-IBM-JDK/ws/src/resources>
     [copy] Copying 1 file to <https://ci-builds.apache.org/job/POI/job/POI-DSL-IBM-JDK/ws/src/resources>
    [mkdir] Created dir: <https://ci-builds.apache.org/job/POI/job/POI-DSL-IBM-JDK/ws/build/dist/maven/poi-ooxml-lite>
      [jar] Building jar: <https://ci-builds.apache.org/job/POI/job/POI-DSL-IBM-JDK/231/artifact/build/dist/maven/poi-ooxml-lite/poi-ooxml-lite-5.4.0-SNAPSHOT.jar>
   [delete] Deleting: <https://ci-builds.apache.org/job/POI/job/POI-DSL-IBM-JDK/ws/src/resources/ooxml-lite-report.clazz1>
   [delete] Deleting: <https://ci-builds.apache.org/job/POI/job/POI-DSL-IBM-JDK/ws/src/resources/ooxml-lite-report.clazz2>
   [delete] Deleting: <https://ci-builds.apache.org/job/POI/job/POI-DSL-IBM-JDK/ws/src/resources/ooxml-lite-report.xsb2>

-test-excelant-check:

test-excelant:
[junitlauncher] Running org.apache.poi.ss.excelant.TestBuildFile
[junitlauncher] 
[junitlauncher] Running org.apache.poi.ss.excelant.TestBuildFile
[junitlauncher] Tests run: 14, Failures: 0, Aborted: 0, Skipped: 0, Time elapsed: 2.756000 sec
[junitlauncher] Running org.apache.poi.ss.excelant.TestExcelAntPrecision
[junitlauncher] 
[junitlauncher] Running org.apache.poi.ss.excelant.TestExcelAntPrecision
[junitlauncher] Tests run: 1, Failures: 0, Aborted: 0, Skipped: 0, Time elapsed: 0.002000 sec
[junitlauncher] Running org.apache.poi.ss.excelant.TestExcelAntSet
[junitlauncher] 
[junitlauncher] Running org.apache.poi.ss.excelant.TestExcelAntSet
[junitlauncher] Tests run: 2, Failures: 0, Aborted: 0, Skipped: 0, Time elapsed: 0.019000 sec
[junitlauncher] Running org.apache.poi.ss.excelant.TestExcelAntSetDoubleCell
[junitlauncher] 
[junitlauncher] Running org.apache.poi.ss.excelant.TestExcelAntSetDoubleCell
[junitlauncher] Tests run: 1, Failures: 0, Aborted: 0, Skipped: 0, Time elapsed: 0.002000 sec
[junitlauncher] Running org.apache.poi.ss.excelant.TestExcelAntUserDefinedFunction
[junitlauncher] 
[junitlauncher] Running org.apache.poi.ss.excelant.TestExcelAntUserDefinedFunction
[junitlauncher] Tests run: 2, Failures: 0, Aborted: 0, Skipped: 0, Time elapsed: 0.003000 sec
[junitlauncher] Running org.apache.poi.ss.excelant.util.TestExcelAntEvaluationResult
[junitlauncher] 
[junitlauncher] Running org.apache.poi.ss.excelant.util.TestExcelAntEvaluationResult
[junitlauncher] Tests run: 4, Failures: 0, Aborted: 0, Skipped: 0, Time elapsed: 0.006000 sec
[junitlauncher] Running org.apache.poi.ss.excelant.util.TestExcelAntWorkbookUtil
[junitlauncher] 
[junitlauncher] Running org.apache.poi.ss.excelant.util.TestExcelAntWorkbookUtil
[junitlauncher] Tests run: 23, Failures: 0, Aborted: 0, Skipped: 0, Time elapsed: 1.269000 sec
[junitlauncher] Running org.apache.poi.ss.excelant.util.TestExcelAntWorkbookUtilFactory
[junitlauncher] 
[junitlauncher] Running org.apache.poi.ss.excelant.util.TestExcelAntWorkbookUtilFactory
[junitlauncher] Tests run: 2, Failures: 0, Aborted: 0, Skipped: 0, Time elapsed: 0.002000 sec

-test-excelant-write-testfile:

test:

compile-integration:
    [javac] Compiling 28 source files to <https://ci-builds.apache.org/job/POI/job/POI-DSL-IBM-JDK/ws/poi-integration/build/test-classes>
    [javac] Support for javac --release has been added in Java9 ignoring it
    [javac] Note: <https://ci-builds.apache.org/job/POI/job/POI-DSL-IBM-JDK/ws/poi-integration/src/test/java/org/apache/poi/stress/OptimizedNullPrintStream.java> uses or overrides a deprecated API.
    [javac] Note: Recompile with -Xlint:deprecation for details.
    [mkdir] Created dir: <https://ci-builds.apache.org/job/POI/job/POI-DSL-IBM-JDK/ws/poi-integration/build/test-classes/META-INF/versions/9>
      [jar] Building jar: <https://ci-builds.apache.org/job/POI/job/POI-DSL-IBM-JDK/231/artifact/build/dist/maven/poi-integration/poi-integration-5.4.0-SNAPSHOT.jar>

-test-integration-check:

test-integration:
[junitlauncher] Running org.apache.poi.stress.TestAllFiles
[junitlauncher] 
[junitlauncher] Running org.apache.poi.stress.TestAllFiles
[junitlauncher]    Aborted: #885 slideshow/23884_defense_FINAL_OOimport_edit.ppt HSLF: org.opentest4j.TestAbortedException: Assumption failed: Some files hang in JDK graphics rendering on Java 8 due to a JDK bug
[junitlauncher]    Aborted: #886 slideshow/23884_defense_FINAL_OOimport_edit.ppt HPSF: org.opentest4j.TestAbortedException: Assumption failed: Some files hang in JDK graphics rendering on Java 8 due to a JDK bug
[junitlauncher]    Failed: Additional - #2570 spreadsheet/clusterfuzz-testcase-minimized-POIXSSFFuzzer-5089447305609216.xlsx XSSF: org.opentest4j.AssertionFailedError: spreadsheet/clusterfuzz-testcase-minimized-POIXSSFFuzzer-5089447305609216.xlsx - failed for handler XSSFFileHandler:  expected class java.lang.IllegalStateException ==> Unexpected exception type thrown, expected: <java.lang.IllegalStateException> but was: <org.apache.poi.ooxml.POIXMLException>
[junitlauncher]    Failed: Extracting - #2570 spreadsheet/clusterfuzz-testcase-minimized-POIXSSFFuzzer-5089447305609216.xlsx XSSF: org.opentest4j.AssertionFailedError: spreadsheet/clusterfuzz-testcase-minimized-POIXSSFFuzzer-5089447305609216.xlsx - failed for handler XSSFFileHandler:  expected class java.lang.IllegalStateException ==> Unexpected exception type thrown, expected: <java.lang.IllegalStateException> but was: <org.xml.sax.SAXParseException>
[junitlauncher]    Failed: Extracting - #2571 spreadsheet/clusterfuzz-testcase-minimized-POIXSSFFuzzer-5089447305609216.xlsx OPC: org.opentest4j.AssertionFailedError: spreadsheet/clusterfuzz-testcase-minimized-POIXSSFFuzzer-5089447305609216.xlsx - failed for handler OPCFileHandler:  expected class java.lang.IllegalStateException ==> Unexpected exception type thrown, expected: <java.lang.IllegalStateException> but was: <org.xml.sax.SAXParseException>
[junitlauncher] Tests run: 8700, Failures: 3, Aborted: 2, Skipped: 0, Time elapsed: 257.528000 sec

BUILD FAILED
<https://ci-builds.apache.org/job/POI/job/POI-DSL-IBM-JDK/ws/build.xml>:1841: The following error occurred while executing this line:
<https://ci-builds.apache.org/job/POI/job/POI-DSL-IBM-JDK/ws/build.xml>:1385: Some test(s) have failure(s)

Total time: 12 minutes 3 seconds
Build step 'Invoke Ant' marked build as failure
[SpotBugs] Skipping execution of recorder since overall result is 'FAILURE'
ERROR: Not all environment variables could be successfully injected. Check for similarly-named environment variables.
Archiving artifacts
ERROR: Not all environment variables could be successfully injected. Check for similarly-named environment variables.
Recording test results
ERROR: Not all environment variables could be successfully injected. Check for similarly-named environment variables.
[Checks API] No suitable checks publisher found.
ERROR: Not all environment variables could be successfully injected. Check for similarly-named environment variables.

---------------------------------------------------------------------
To unsubscribe, e-mail: dev-unsubscribe@poi.apache.org
For additional commands, e-mail: dev-help@poi.apache.org