You are viewing a plain text version of this content. The canonical link for it is here.
Posted to builds@cassandra.apache.org by Apache Jenkins Server <je...@builds.apache.org> on 2021/10/05 19:25:34 UTC

Build complete: Cassandra-3.11 #272 [UNSTABLE] 939ab71cfd3b5505e0a24cc3ccfa0f1f6617d6e3

-------------------------------------------------------------------------------
Build Cassandra-3.11 #272 Still Unstable
URL: https://ci-cassandra.apache.org/job/Cassandra-3.11/272/
-------------------------------------------------------------------------------
Changes:
[Stefan Miklosovic] OWASP follow-up - version-aware dependency check and removed


-------------------------------------------------------------------------------
Failed Tests:
48 tests failed.
FAILED:  cqlshlib.python2.jdk8.no_cython.test.test_cqlsh_completion.TestCqlshCompletion.test_complete_in_create_table
FAILED:  cqlshlib.python2.jdk8.no_cython.test.test_cqlsh_completion.TestCqlshCompletion.test_complete_in_describe
FAILED:  cqlshlib.python2.jdk8.no_cython.test.test_cqlsh_completion.TestCqlshCompletion.test_complete_in_drop
FAILED:  cqlshlib.python2.jdk8.no_cython.test.test_cqlsh_completion.TestCqlshCompletion.test_complete_in_insert
FAILED:  dtest-upgrade.upgrade_tests.upgrade_through_versions_test.TestUpgrade_current_2_1_x_To_indev_3_11_x.test_parallel_upgrade
FAILED:  dtest.auth_test.TestAuthUnavailable.test_permission_cache_background_reload_handle_unavailable
FAILED:  org.apache.cassandra.db.compaction.LongLeveledCompactionStrategyCQLTest.stressTestCompactionStrategyManager
FAILED:  org.apache.cassandra.utils.RecomputingSupplierTest.recomputingSupplierTest-cdc
FAILED:  org.apache.cassandra.cql3.ViewFilteringTest.testPartitionKeyFilteringWithSlice
FAILED:  org.apache.cassandra.cql3.ViewFilteringTest.testPartitionKeyFilteringWithSlice
FAILED:  org.apache.cassandra.cql3.ViewComplexTest.testUpdateColumnInViewPKWithTTLWithFlush
FAILED:  dtest-upgrade.upgrade_tests.upgrade_through_versions_test.TestUpgrade_current_2_1_x_To_indev_3_11_x.test_parallel_upgrade_with_internode_ssl
FAILED:  org.apache.cassandra.distributed.upgrade.CompactStorage2to3UpgradeTest.singleColumn
FAILED:  cqlshlib.python2.jdk8.no_cython.test.test_cqlsh_output.TestCqlshOutput.test_boolean_output
FAILED:  cqlshlib.python2.jdk8.no_cython.test.test_cqlsh_output.TestCqlshOutput.test_columnless_key_output
FAILED:  cqlshlib.python2.jdk8.no_cython.test.test_cqlsh_output.TestCqlshOutput.test_count_output
FAILED:  cqlshlib.python2.jdk8.no_cython.test.test_cqlsh_output.TestCqlshOutput.test_null_output
FAILED:  cqlshlib.python2.jdk8.no_cython.test.test_cqlsh_output.TestCqlshOutput.test_numeric_output
FAILED:  cqlshlib.python2.jdk8.no_cython.test.test_cqlsh_output.TestCqlshOutput.test_static_cf_output
FAILED:  cqlshlib.python2.jdk8.no_cython.test.test_cqlsh_output.TestCqlshOutput.test_string_output_ascii
FAILED:  cqlshlib.python2.jdk8.no_cython.test.test_cqlsh_output.TestCqlshOutput.test_boolean_output
FAILED:  cqlshlib.python2.jdk8.no_cython.test.test_cqlsh_output.TestCqlshOutput.test_columnless_key_output
FAILED:  cqlshlib.python2.jdk8.no_cython.test.test_cqlsh_output.TestCqlshOutput.test_count_output
FAILED:  cqlshlib.python2.jdk8.no_cython.test.test_cqlsh_output.TestCqlshOutput.test_null_output
FAILED:  cqlshlib.python2.jdk8.no_cython.test.test_cqlsh_output.TestCqlshOutput.test_numeric_output
FAILED:  cqlshlib.python2.jdk8.no_cython.test.test_cqlsh_output.TestCqlshOutput.test_static_cf_output
FAILED:  cqlshlib.python2.jdk8.no_cython.test.test_cqlsh_output.TestCqlshOutput.test_string_output_ascii
FAILED:  dtest-offheap.counter_test.TestCounters.test_13691
FAILED:  dtest-offheap.counter_test.TestCounters.test_13691
FAILED:  dtest-upgrade.upgrade_tests.upgrade_through_versions_test.TestUpgrade_indev_2_2_x_To_indev_3_11_x.test_rolling_upgrade
FAILED:  dtest-upgrade.upgrade_tests.upgrade_through_versions_test.TestUpgrade_current_2_2_x_To_indev_3_11_x.test_rolling_upgrade_with_internode_ssl
FAILED:  dtest-upgrade.upgrade_tests.upgrade_through_versions_test.TestUpgrade_indev_2_2_x_To_indev_3_11_x.test_rolling_upgrade_with_internode_ssl
FAILED:  dtest-upgrade.upgrade_internal_auth_test.TestAuthUpgrade.test_upgrade_legacy_table
FAILED:  dtest-upgrade.upgrade_tests.upgrade_through_versions_test.TestProtoV3Upgrade_AllVersions_EndsAt_3_11_X.test_rolling_upgrade
FAILED:  dtest-upgrade.upgrade_tests.upgrade_through_versions_test.TestProtoV3Upgrade_AllVersions_EndsAt_3_11_X.test_rolling_upgrade_with_internode_ssl
FAILED:  dtest-upgrade.upgrade_tests.upgrade_through_versions_test.TestProtoV3Upgrade_AllVersions_RandomPartitioner_EndsAt_3_11_X_HEAD.test_rolling_upgrade
FAILED:  dtest-upgrade.upgrade_tests.upgrade_through_versions_test.TestProtoV3Upgrade_AllVersions_RandomPartitioner_EndsAt_3_11_X_HEAD.test_rolling_upgrade
FAILED:  dtest-upgrade.upgrade_tests.upgrade_through_versions_test.TestProtoV3Upgrade_AllVersions_RandomPartitioner_EndsAt_3_11_X_HEAD.test_rolling_upgrade_with_internode_ssl
FAILED:  dtest-upgrade.upgrade_tests.upgrade_through_versions_test.TestUpgrade_current_2_1_x_To_indev_3_11_x.test_rolling_upgrade
FAILED:  dtest-upgrade.upgrade_tests.upgrade_through_versions_test.TestUpgrade_current_3_0_x_To_indev_3_11_x.test_rolling_upgrade
FAILED:  dtest-upgrade.upgrade_tests.upgrade_through_versions_test.TestUpgrade_current_2_1_x_To_indev_3_11_x.test_rolling_upgrade_with_internode_ssl
FAILED:  dtest-upgrade.upgrade_tests.upgrade_through_versions_test.TestUpgrade_current_2_2_x_To_indev_3_11_x.test_rolling_upgrade
FAILED:  dtest-upgrade.upgrade_tests.upgrade_through_versions_test.TestUpgrade_current_3_0_x_To_indev_3_11_x.test_rolling_upgrade_with_internode_ssl
FAILED:  org.apache.cassandra.distributed.upgrade.CompactStorage2to3UpgradeTest.testDropCompactWithClusteringAndValueColumnWithDeletesAndWrites
FAILED:  org.apache.cassandra.distributed.upgrade.CompactStorage2to3UpgradeTest.testDropCompactWithClusteringAndValueColumnWithDeletesAndWrites
FAILED:  org.apache.cassandra.distributed.upgrade.CompactStorage2to3UpgradeTest.testDropCompactWithClusteringAndValueColumnWithDeletesAndWrites
FAILED:  org.apache.cassandra.distributed.upgrade.CompactStorage2to3UpgradeTest.testDropCompactWithClusteringAndValueColumnWithDeletesAndWrites
FAILED:  org.apache.cassandra.utils.memory.LongBufferPoolTest.testAllocate

-------------------------------------------------------------------------------
For complete test report and logs see https://nightlies.apache.org/cassandra/Cassandra-3.11/272/