You are viewing a plain text version of this content. The canonical link for it is here.
Posted to dev@lucene.apache.org by Policeman Jenkins Server <je...@thetaphi.de> on 2015/04/01 07:35:54 UTC
[JENKINS] Lucene-Solr-5.1-Linux (64bit/jdk1.7.0_76) - Build # 181 -
Failure!
Build: http://jenkins.thetaphi.de/job/Lucene-Solr-5.1-Linux/181/
Java: 64bit/jdk1.7.0_76 -XX:+UseCompressedOops -XX:+UseG1GC
1 tests failed.
FAILED: org.apache.solr.cloud.RecoveryAfterSoftCommitTest.test
Error Message:
Didn't see all replicas for shard shard1 in collection1 come up within 30000 ms! ClusterState: { "collection1":{ "shards":{"shard1":{ "range":"80000000-7fffffff", "state":"active", "replicas":{ "core_node1":{ "state":"active", "node_name":"127.0.0.1:50328_", "core":"collection1", "base_url":"http://127.0.0.1:50328", "leader":"true"}, "core_node2":{ "state":"recovering", "node_name":"127.0.0.1:45200_", "core":"collection1", "base_url":"http://127.0.0.1:45200"}}}}, "autoAddReplicas":"false", "replicationFactor":"1", "router":{"name":"compositeId"}, "maxShardsPerNode":"1", "autoCreated":"true"}, "control_collection":{ "shards":{"shard1":{ "range":"80000000-7fffffff", "state":"active", "replicas":{"core_node1":{ "state":"active", "node_name":"127.0.0.1:40994_", "core":"collection1", "base_url":"http://127.0.0.1:40994", "leader":"true"}}}}, "autoAddReplicas":"false", "replicationFactor":"1", "router":{"name":"compositeId"}, "maxShardsPerNode":"1", "autoCreated":"true"}}
Stack Trace:
java.lang.AssertionError: Didn't see all replicas for shard shard1 in collection1 come up within 30000 ms! ClusterState: {
"collection1":{
"shards":{"shard1":{
"range":"80000000-7fffffff",
"state":"active",
"replicas":{
"core_node1":{
"state":"active",
"node_name":"127.0.0.1:50328_",
"core":"collection1",
"base_url":"http://127.0.0.1:50328",
"leader":"true"},
"core_node2":{
"state":"recovering",
"node_name":"127.0.0.1:45200_",
"core":"collection1",
"base_url":"http://127.0.0.1:45200"}}}},
"autoAddReplicas":"false",
"replicationFactor":"1",
"router":{"name":"compositeId"},
"maxShardsPerNode":"1",
"autoCreated":"true"},
"control_collection":{
"shards":{"shard1":{
"range":"80000000-7fffffff",
"state":"active",
"replicas":{"core_node1":{
"state":"active",
"node_name":"127.0.0.1:40994_",
"core":"collection1",
"base_url":"http://127.0.0.1:40994",
"leader":"true"}}}},
"autoAddReplicas":"false",
"replicationFactor":"1",
"router":{"name":"compositeId"},
"maxShardsPerNode":"1",
"autoCreated":"true"}}
at __randomizedtesting.SeedInfo.seed([7263C8E56603AAB3:FA37F73FC8FFC74B]:0)
at org.junit.Assert.fail(Assert.java:93)
at org.apache.solr.cloud.AbstractFullDistribZkTestBase.ensureAllReplicasAreActive(AbstractFullDistribZkTestBase.java:1925)
at org.apache.solr.cloud.RecoveryAfterSoftCommitTest.test(RecoveryAfterSoftCommitTest.java:102)
at sun.reflect.NativeMethodAccessorImpl.invoke0(Native Method)
at sun.reflect.NativeMethodAccessorImpl.invoke(NativeMethodAccessorImpl.java:57)
at sun.reflect.DelegatingMethodAccessorImpl.invoke(DelegatingMethodAccessorImpl.java:43)
at java.lang.reflect.Method.invoke(Method.java:606)
at com.carrotsearch.randomizedtesting.RandomizedRunner.invoke(RandomizedRunner.java:1627)
at com.carrotsearch.randomizedtesting.RandomizedRunner$6.evaluate(RandomizedRunner.java:836)
at com.carrotsearch.randomizedtesting.RandomizedRunner$7.evaluate(RandomizedRunner.java:872)
at com.carrotsearch.randomizedtesting.RandomizedRunner$8.evaluate(RandomizedRunner.java:886)
at org.apache.solr.BaseDistributedSearchTestCase$ShardsRepeatRule$ShardsFixedStatement.callStatement(BaseDistributedSearchTestCase.java:960)
at org.apache.solr.BaseDistributedSearchTestCase$ShardsRepeatRule$ShardsStatement.evaluate(BaseDistributedSearchTestCase.java:935)
at com.carrotsearch.randomizedtesting.rules.SystemPropertiesRestoreRule$1.evaluate(SystemPropertiesRestoreRule.java:53)
at org.apache.lucene.util.TestRuleSetupTeardownChained$1.evaluate(TestRuleSetupTeardownChained.java:50)
at org.apache.lucene.util.AbstractBeforeAfterRule$1.evaluate(AbstractBeforeAfterRule.java:46)
at org.apache.lucene.util.TestRuleThreadAndTestName$1.evaluate(TestRuleThreadAndTestName.java:49)
at org.apache.lucene.util.TestRuleIgnoreAfterMaxFailures$1.evaluate(TestRuleIgnoreAfterMaxFailures.java:65)
at org.apache.lucene.util.TestRuleMarkFailure$1.evaluate(TestRuleMarkFailure.java:48)
at com.carrotsearch.randomizedtesting.rules.StatementAdapter.evaluate(StatementAdapter.java:36)
at com.carrotsearch.randomizedtesting.ThreadLeakControl$StatementRunner.run(ThreadLeakControl.java:365)
at com.carrotsearch.randomizedtesting.ThreadLeakControl.forkTimeoutingTask(ThreadLeakControl.java:798)
at com.carrotsearch.randomizedtesting.ThreadLeakControl$3.evaluate(ThreadLeakControl.java:458)
at com.carrotsearch.randomizedtesting.RandomizedRunner.runSingleTest(RandomizedRunner.java:845)
at com.carrotsearch.randomizedtesting.RandomizedRunner$3.evaluate(RandomizedRunner.java:747)
at com.carrotsearch.randomizedtesting.RandomizedRunner$4.evaluate(RandomizedRunner.java:781)
at com.carrotsearch.randomizedtesting.RandomizedRunner$5.evaluate(RandomizedRunner.java:792)
at com.carrotsearch.randomizedtesting.rules.StatementAdapter.evaluate(StatementAdapter.java:36)
at com.carrotsearch.randomizedtesting.rules.SystemPropertiesRestoreRule$1.evaluate(SystemPropertiesRestoreRule.java:53)
at org.apache.lucene.util.AbstractBeforeAfterRule$1.evaluate(AbstractBeforeAfterRule.java:46)
at com.carrotsearch.randomizedtesting.rules.StatementAdapter.evaluate(StatementAdapter.java:36)
at org.apache.lucene.util.TestRuleStoreClassName$1.evaluate(TestRuleStoreClassName.java:42)
at com.carrotsearch.randomizedtesting.rules.NoShadowingOrOverridesOnMethodsRule$1.evaluate(NoShadowingOrOverridesOnMethodsRule.java:39)
at com.carrotsearch.randomizedtesting.rules.NoShadowingOrOverridesOnMethodsRule$1.evaluate(NoShadowingOrOverridesOnMethodsRule.java:39)
at com.carrotsearch.randomizedtesting.rules.StatementAdapter.evaluate(StatementAdapter.java:36)
at com.carrotsearch.randomizedtesting.rules.StatementAdapter.evaluate(StatementAdapter.java:36)
at com.carrotsearch.randomizedtesting.rules.StatementAdapter.evaluate(StatementAdapter.java:36)
at org.apache.lucene.util.TestRuleAssertionsRequired$1.evaluate(TestRuleAssertionsRequired.java:54)
at org.apache.lucene.util.TestRuleMarkFailure$1.evaluate(TestRuleMarkFailure.java:48)
at org.apache.lucene.util.TestRuleIgnoreAfterMaxFailures$1.evaluate(TestRuleIgnoreAfterMaxFailures.java:65)
at org.apache.lucene.util.TestRuleIgnoreTestSuites$1.evaluate(TestRuleIgnoreTestSuites.java:55)
at com.carrotsearch.randomizedtesting.rules.StatementAdapter.evaluate(StatementAdapter.java:36)
at com.carrotsearch.randomizedtesting.ThreadLeakControl$StatementRunner.run(ThreadLeakControl.java:365)
at java.lang.Thread.run(Thread.java:745)
Build Log:
[...truncated 9896 lines...]
[junit4] Suite: org.apache.solr.cloud.RecoveryAfterSoftCommitTest
[junit4] 2> Creating dataDir: /home/jenkins/workspace/Lucene-Solr-5.1-Linux/solr/build/solr-core/test/J0/temp/solr.cloud.RecoveryAfterSoftCommitTest 7263C8E56603AAB3-001/init-core-data-001
[junit4] 2> 485914 T3480 oas.BaseDistributedSearchTestCase.initHostContext Setting hostContext system property: /
[junit4] 2> 485917 T3480 oasc.ZkTestServer.run STARTING ZK TEST SERVER
[junit4] 1> client port:0.0.0.0/0.0.0.0:0
[junit4] 2> 485918 T3481 oasc.ZkTestServer$ZKServerMain.runFromConfig Starting server
[junit4] 2> 486018 T3480 oasc.ZkTestServer.run start zk server on port:48812
[junit4] 2> 486018 T3480 oascc.SolrZkClient.createZkCredentialsToAddAutomatically Using default ZkCredentialsProvider
[junit4] 2> 486019 T3480 oascc.ConnectionManager.waitForConnected Waiting for client to connect to ZooKeeper
[junit4] 2> 486020 T3488 oascc.ConnectionManager.process Watcher org.apache.solr.common.cloud.ConnectionManager@6b42c857 name:ZooKeeperConnection Watcher:127.0.0.1:48812 got event WatchedEvent state:SyncConnected type:None path:null path:null type:None
[junit4] 2> 486021 T3480 oascc.ConnectionManager.waitForConnected Client is connected to ZooKeeper
[junit4] 2> 486021 T3480 oascc.SolrZkClient.createZkACLProvider Using default ZkACLProvider
[junit4] 2> 486021 T3480 oascc.SolrZkClient.makePath makePath: /solr
[junit4] 2> 486023 T3480 oascc.SolrZkClient.createZkCredentialsToAddAutomatically Using default ZkCredentialsProvider
[junit4] 2> 486024 T3480 oascc.ConnectionManager.waitForConnected Waiting for client to connect to ZooKeeper
[junit4] 2> 486025 T3491 oascc.ConnectionManager.process Watcher org.apache.solr.common.cloud.ConnectionManager@3cd6592a name:ZooKeeperConnection Watcher:127.0.0.1:48812/solr got event WatchedEvent state:SyncConnected type:None path:null path:null type:None
[junit4] 2> 486025 T3480 oascc.ConnectionManager.waitForConnected Client is connected to ZooKeeper
[junit4] 2> 486025 T3480 oascc.SolrZkClient.createZkACLProvider Using default ZkACLProvider
[junit4] 2> 486025 T3480 oascc.SolrZkClient.makePath makePath: /collections/collection1
[junit4] 2> 486027 T3480 oascc.SolrZkClient.makePath makePath: /collections/collection1/shards
[junit4] 2> 486027 T3480 oascc.SolrZkClient.makePath makePath: /collections/control_collection
[junit4] 2> 486028 T3480 oascc.SolrZkClient.makePath makePath: /collections/control_collection/shards
[junit4] 2> 486029 T3480 oasc.AbstractZkTestCase.putConfig put /home/jenkins/workspace/Lucene-Solr-5.1-Linux/solr/core/src/test-files/solr/collection1/conf/solrconfig-tlog.xml to /configs/conf1/solrconfig.xml
[junit4] 2> 486029 T3480 oascc.SolrZkClient.makePath makePath: /configs/conf1/solrconfig.xml
[junit4] 2> 486030 T3480 oasc.AbstractZkTestCase.putConfig put /home/jenkins/workspace/Lucene-Solr-5.1-Linux/solr/core/src/test-files/solr/collection1/conf/schema.xml to /configs/conf1/schema.xml
[junit4] 2> 486030 T3480 oascc.SolrZkClient.makePath makePath: /configs/conf1/schema.xml
[junit4] 2> 486031 T3480 oasc.AbstractZkTestCase.putConfig put /home/jenkins/workspace/Lucene-Solr-5.1-Linux/solr/core/src/test-files/solr/collection1/conf/solrconfig.snippet.randomindexconfig.xml to /configs/conf1/solrconfig.snippet.randomindexconfig.xml
[junit4] 2> 486031 T3480 oascc.SolrZkClient.makePath makePath: /configs/conf1/solrconfig.snippet.randomindexconfig.xml
[junit4] 2> 486032 T3480 oasc.AbstractZkTestCase.putConfig put /home/jenkins/workspace/Lucene-Solr-5.1-Linux/solr/core/src/test-files/solr/collection1/conf/stopwords.txt to /configs/conf1/stopwords.txt
[junit4] 2> 486032 T3480 oascc.SolrZkClient.makePath makePath: /configs/conf1/stopwords.txt
[junit4] 2> 486033 T3480 oasc.AbstractZkTestCase.putConfig put /home/jenkins/workspace/Lucene-Solr-5.1-Linux/solr/core/src/test-files/solr/collection1/conf/protwords.txt to /configs/conf1/protwords.txt
[junit4] 2> 486033 T3480 oascc.SolrZkClient.makePath makePath: /configs/conf1/protwords.txt
[junit4] 2> 486034 T3480 oasc.AbstractZkTestCase.putConfig put /home/jenkins/workspace/Lucene-Solr-5.1-Linux/solr/core/src/test-files/solr/collection1/conf/currency.xml to /configs/conf1/currency.xml
[junit4] 2> 486034 T3480 oascc.SolrZkClient.makePath makePath: /configs/conf1/currency.xml
[junit4] 2> 486034 T3480 oasc.AbstractZkTestCase.putConfig put /home/jenkins/workspace/Lucene-Solr-5.1-Linux/solr/core/src/test-files/solr/collection1/conf/enumsConfig.xml to /configs/conf1/enumsConfig.xml
[junit4] 2> 486035 T3480 oascc.SolrZkClient.makePath makePath: /configs/conf1/enumsConfig.xml
[junit4] 2> 486036 T3480 oasc.AbstractZkTestCase.putConfig put /home/jenkins/workspace/Lucene-Solr-5.1-Linux/solr/core/src/test-files/solr/collection1/conf/open-exchange-rates.json to /configs/conf1/open-exchange-rates.json
[junit4] 2> 486036 T3480 oascc.SolrZkClient.makePath makePath: /configs/conf1/open-exchange-rates.json
[junit4] 2> 486036 T3480 oasc.AbstractZkTestCase.putConfig put /home/jenkins/workspace/Lucene-Solr-5.1-Linux/solr/core/src/test-files/solr/collection1/conf/mapping-ISOLatin1Accent.txt to /configs/conf1/mapping-ISOLatin1Accent.txt
[junit4] 2> 486037 T3480 oascc.SolrZkClient.makePath makePath: /configs/conf1/mapping-ISOLatin1Accent.txt
[junit4] 2> 486037 T3480 oasc.AbstractZkTestCase.putConfig put /home/jenkins/workspace/Lucene-Solr-5.1-Linux/solr/core/src/test-files/solr/collection1/conf/old_synonyms.txt to /configs/conf1/old_synonyms.txt
[junit4] 2> 486037 T3480 oascc.SolrZkClient.makePath makePath: /configs/conf1/old_synonyms.txt
[junit4] 2> 486038 T3480 oasc.AbstractZkTestCase.putConfig put /home/jenkins/workspace/Lucene-Solr-5.1-Linux/solr/core/src/test-files/solr/collection1/conf/synonyms.txt to /configs/conf1/synonyms.txt
[junit4] 2> 486038 T3480 oascc.SolrZkClient.makePath makePath: /configs/conf1/synonyms.txt
[junit4] 2> 486082 T3480 oas.SolrTestCaseJ4.writeCoreProperties Writing core.properties file to /home/jenkins/workspace/Lucene-Solr-5.1-Linux/solr/build/solr-core/test/J0/temp/solr.cloud.RecoveryAfterSoftCommitTest 7263C8E56603AAB3-001/control-001/cores/collection1
[junit4] 2> 486084 T3480 oejs.Server.doStart jetty-8.1.10.v20130312
[junit4] 2> 486086 T3480 oejs.AbstractConnector.doStart Started SelectChannelConnector@127.0.0.1:33345
[junit4] 2> 486087 T3480 oascse.JettySolrRunner$1.lifeCycleStarted Jetty properties: {solr.data.dir=/home/jenkins/workspace/Lucene-Solr-5.1-Linux/solr/build/solr-core/test/J0/temp/solr.cloud.RecoveryAfterSoftCommitTest 7263C8E56603AAB3-001/tempDir-001/control/data, hostContext=/, hostPort=40994, coreRootDirectory=/home/jenkins/workspace/Lucene-Solr-5.1-Linux/solr/build/solr-core/test/J0/temp/solr.cloud.RecoveryAfterSoftCommitTest 7263C8E56603AAB3-001/control-001/cores}
[junit4] 2> 486087 T3480 oass.SolrDispatchFilter.init SolrDispatchFilter.init()sun.misc.Launcher$AppClassLoader@12b0f0ae
[junit4] 2> 486087 T3480 oasc.SolrResourceLoader.<init> new SolrResourceLoader for directory: '/home/jenkins/workspace/Lucene-Solr-5.1-Linux/solr/build/solr-core/test/J0/temp/solr.cloud.RecoveryAfterSoftCommitTest 7263C8E56603AAB3-001/control-001/'
[junit4] 2> 486098 T3480 oasc.SolrXmlConfig.fromFile Loading container configuration from /home/jenkins/workspace/Lucene-Solr-5.1-Linux/solr/build/solr-core/test/J0/temp/solr.cloud.RecoveryAfterSoftCommitTest 7263C8E56603AAB3-001/control-001/solr.xml
[junit4] 2> 486106 T3480 oasc.CorePropertiesLocator.<init> Config-defined core root directory: /home/jenkins/workspace/Lucene-Solr-5.1-Linux/solr/build/solr-core/test/J0/temp/solr.cloud.RecoveryAfterSoftCommitTest 7263C8E56603AAB3-001/control-001/cores
[junit4] 2> 486106 T3480 oasc.CoreContainer.<init> New CoreContainer 1404737701
[junit4] 2> 486106 T3480 oasc.CoreContainer.load Loading cores into CoreContainer [instanceDir=/home/jenkins/workspace/Lucene-Solr-5.1-Linux/solr/build/solr-core/test/J0/temp/solr.cloud.RecoveryAfterSoftCommitTest 7263C8E56603AAB3-001/control-001/]
[junit4] 2> 486106 T3480 oasc.CoreContainer.load loading shared library: /home/jenkins/workspace/Lucene-Solr-5.1-Linux/solr/build/solr-core/test/J0/temp/solr.cloud.RecoveryAfterSoftCommitTest 7263C8E56603AAB3-001/control-001/lib
[junit4] 2> 486107 T3480 oasc.SolrResourceLoader.addToClassLoader WARN Can't find (or read) directory to add to classloader: lib (resolved as: /home/jenkins/workspace/Lucene-Solr-5.1-Linux/solr/build/solr-core/test/J0/temp/solr.cloud.RecoveryAfterSoftCommitTest 7263C8E56603AAB3-001/control-001/lib).
[junit4] 2> 486111 T3480 oashc.HttpShardHandlerFactory.getParameter Setting socketTimeout to: 90000
[junit4] 2> 486111 T3480 oashc.HttpShardHandlerFactory.getParameter Setting urlScheme to:
[junit4] 2> 486112 T3480 oashc.HttpShardHandlerFactory.getParameter Setting connTimeout to: 15000
[junit4] 2> 486112 T3480 oashc.HttpShardHandlerFactory.getParameter Setting maxConnectionsPerHost to: 20
[junit4] 2> 486112 T3480 oashc.HttpShardHandlerFactory.getParameter Setting maxConnections to: 10000
[junit4] 2> 486112 T3480 oashc.HttpShardHandlerFactory.getParameter Setting corePoolSize to: 0
[junit4] 2> 486112 T3480 oashc.HttpShardHandlerFactory.getParameter Setting maximumPoolSize to: 2147483647
[junit4] 2> 486112 T3480 oashc.HttpShardHandlerFactory.getParameter Setting maxThreadIdleTime to: 5
[junit4] 2> 486112 T3480 oashc.HttpShardHandlerFactory.getParameter Setting sizeOfQueue to: -1
[junit4] 2> 486113 T3480 oashc.HttpShardHandlerFactory.getParameter Setting fairnessPolicy to: false
[junit4] 2> 486113 T3480 oashc.HttpShardHandlerFactory.getParameter Setting useRetries to: false
[junit4] 2> 486113 T3480 oasu.UpdateShardHandler.<init> Creating UpdateShardHandler HTTP client with params: socketTimeout=340000&connTimeout=45000&retry=true
[junit4] 2> 486113 T3480 oasl.LogWatcher.createWatcher SLF4J impl is org.slf4j.impl.Log4jLoggerFactory
[junit4] 2> 486113 T3480 oasl.LogWatcher.newRegisteredLogWatcher Registering Log Listener [Log4j (org.slf4j.impl.Log4jLoggerFactory)]
[junit4] 2> 486113 T3480 oasc.CoreContainer.load Node Name: 127.0.0.1
[junit4] 2> 486114 T3480 oasc.ZkContainer.initZooKeeper Zookeeper client=127.0.0.1:48812/solr
[junit4] 2> 486114 T3480 oasc.ZkController.checkChrootPath zkHost includes chroot
[junit4] 2> 486114 T3480 oascc.SolrZkClient.createZkCredentialsToAddAutomatically Using default ZkCredentialsProvider
[junit4] 2> 486114 T3480 oascc.ConnectionManager.waitForConnected Waiting for client to connect to ZooKeeper
[junit4] 2> 486116 T3503 oascc.ConnectionManager.process Watcher org.apache.solr.common.cloud.ConnectionManager@63820589 name:ZooKeeperConnection Watcher:127.0.0.1:48812 got event WatchedEvent state:SyncConnected type:None path:null path:null type:None
[junit4] 2> 486116 T3480 oascc.ConnectionManager.waitForConnected Client is connected to ZooKeeper
[junit4] 2> 486116 T3480 oascc.SolrZkClient.createZkACLProvider Using default ZkACLProvider
[junit4] 2> 486118 T3480 oascc.ConnectionManager.waitForConnected Waiting for client to connect to ZooKeeper
[junit4] 2> 486119 T3506 oascc.ConnectionManager.process Watcher org.apache.solr.common.cloud.ConnectionManager@27dae008 name:ZooKeeperConnection Watcher:127.0.0.1:48812/solr got event WatchedEvent state:SyncConnected type:None path:null path:null type:None
[junit4] 2> 486119 T3480 oascc.ConnectionManager.waitForConnected Client is connected to ZooKeeper
[junit4] 2> 486120 T3480 oascc.SolrZkClient.makePath makePath: /overseer/queue
[junit4] 2> 486121 T3480 oascc.SolrZkClient.makePath makePath: /overseer/collection-queue-work
[junit4] 2> 486122 T3480 oascc.SolrZkClient.makePath makePath: /overseer/collection-map-running
[junit4] 2> 486123 T3480 oascc.SolrZkClient.makePath makePath: /overseer/collection-map-completed
[junit4] 2> 486124 T3480 oascc.SolrZkClient.makePath makePath: /overseer/collection-map-failure
[junit4] 2> 486125 T3480 oascc.SolrZkClient.makePath makePath: /live_nodes
[junit4] 2> 486125 T3480 oascc.SolrZkClient.makePath makePath: /aliases.json
[junit4] 2> 486126 T3480 oascc.SolrZkClient.makePath makePath: /clusterstate.json
[junit4] 2> 486126 T3480 oasc.ZkController.createEphemeralLiveNode Register node as live in ZooKeeper:/live_nodes/127.0.0.1:40994_
[junit4] 2> 486127 T3480 oascc.SolrZkClient.makePath makePath: /live_nodes/127.0.0.1:40994_
[junit4] 2> 486128 T3480 oascc.SolrZkClient.makePath makePath: /overseer_elect
[junit4] 2> 486128 T3480 oascc.SolrZkClient.makePath makePath: /overseer_elect/election
[junit4] 2> 486129 T3480 oasc.Overseer.close Overseer (id=null) closing
[junit4] 2> 486130 T3480 oasc.OverseerElectionContext.runLeaderProcess I am going to be the leader 127.0.0.1:40994_
[junit4] 2> 486130 T3480 oascc.SolrZkClient.makePath makePath: /overseer_elect/leader
[junit4] 2> 486131 T3480 oasc.Overseer.start Overseer (id=93576593815764995-127.0.0.1:40994_-n_0000000000) starting
[junit4] 2> 486132 T3480 oascc.SolrZkClient.makePath makePath: /overseer/queue-work
[junit4] 2> 486134 T3480 oasc.OverseerAutoReplicaFailoverThread.<init> Starting OverseerAutoReplicaFailoverThread autoReplicaFailoverWorkLoopDelay=10000 autoReplicaFailoverWaitAfterExpiration=30000 autoReplicaFailoverBadNodeExpiration=60000
[junit4] 2> 486134 T3480 oascc.ZkStateReader.createClusterStateWatchersAndUpdate Updating cluster state from ZooKeeper...
[junit4] 2> 486135 T3508 oasc.OverseerCollectionProcessor.run Process current queue of collection creations
[junit4] 2> 486135 T3507 oasc.Overseer$ClusterStateUpdater.run Starting to work on the main queue
[junit4] 2> 486137 T3480 oasc.CorePropertiesLocator.discover Looking for core definitions underneath /home/jenkins/workspace/Lucene-Solr-5.1-Linux/solr/build/solr-core/test/J0/temp/solr.cloud.RecoveryAfterSoftCommitTest 7263C8E56603AAB3-001/control-001/cores
[junit4] 2> 486138 T3480 oasc.CoreDescriptor.<init> CORE DESCRIPTOR: {shard=, schema=schema.xml, instanceDir=/home/jenkins/workspace/Lucene-Solr-5.1-Linux/solr/build/solr-core/test/J0/temp/solr.cloud.RecoveryAfterSoftCommitTest 7263C8E56603AAB3-001/control-001/cores/collection1, transient=false, collection=control_collection, loadOnStartup=true, name=collection1, coreNodeName=, dataDir=data/, config=solrconfig.xml, absoluteInstDir=/home/jenkins/workspace/Lucene-Solr-5.1-Linux/solr/build/solr-core/test/J0/temp/solr.cloud.RecoveryAfterSoftCommitTest 7263C8E56603AAB3-001/control-001/cores/collection1/}
[junit4] 2> 486138 T3480 oasc.CorePropertiesLocator.discoverUnder Found core collection1 in /home/jenkins/workspace/Lucene-Solr-5.1-Linux/solr/build/solr-core/test/J0/temp/solr.cloud.RecoveryAfterSoftCommitTest 7263C8E56603AAB3-001/control-001/cores/collection1/
[junit4] 2> 486138 T3480 oasc.CorePropertiesLocator.discover Found 1 core definitions
[junit4] 2> 486138 T3510 C:control_collection c:collection1 oasc.ZkController.publish publishing core=collection1 state=down collection=control_collection
[junit4] 2> 486139 T3510 C:control_collection c:collection1 oasc.ZkController.publish numShards not found on descriptor - reading it from system property
[junit4] 2> 486139 T3506 oasc.DistributedQueue$LatchWatcher.process NodeChildrenChanged fired on path /overseer/queue state SyncConnected
[junit4] 2> 486139 T3510 C:control_collection c:collection1 oasc.ZkController.waitForCoreNodeName look for our core node name
[junit4] 2> 486140 T3507 oasc.Overseer$ClusterStateUpdater.run processMessage: queueSize: 1, message = {
[junit4] 2> "operation":"state",
[junit4] 2> "numShards":"1",
[junit4] 2> "state":"down",
[junit4] 2> "collection":"control_collection",
[junit4] 2> "node_name":"127.0.0.1:40994_",
[junit4] 2> "core":"collection1",
[junit4] 2> "base_url":"http://127.0.0.1:40994",
[junit4] 2> "roles":null,
[junit4] 2> "shard":null} current state version: 0
[junit4] 2> 486140 T3507 oasco.ReplicaMutator.updateState Update state numShards=1 message={
[junit4] 2> "operation":"state",
[junit4] 2> "numShards":"1",
[junit4] 2> "state":"down",
[junit4] 2> "collection":"control_collection",
[junit4] 2> "node_name":"127.0.0.1:40994_",
[junit4] 2> "core":"collection1",
[junit4] 2> "base_url":"http://127.0.0.1:40994",
[junit4] 2> "roles":null,
[junit4] 2> "shard":null}
[junit4] 2> 486140 T3507 oasco.ClusterStateMutator.createCollection building a new cName: control_collection
[junit4] 2> 486141 T3507 oasco.ReplicaMutator.updateState Assigning new node to shard shard=shard1
[junit4] 2> 486141 T3506 oascc.ZkStateReader$2.process A cluster state change: WatchedEvent state:SyncConnected type:NodeDataChanged path:/clusterstate.json, has occurred - updating... (live nodes size: 1)
[junit4] 2> 487140 T3510 C:control_collection c:collection1 oasc.ZkController.waitForShardId waiting to find shard id in clusterstate for collection1
[junit4] 2> 487140 T3510 C:control_collection c:collection1 oasc.ZkController.createCollectionZkNode Check for collection zkNode:control_collection
[junit4] 2> 487141 T3510 C:control_collection c:collection1 oasc.ZkController.createCollectionZkNode Collection zkNode exists
[junit4] 2> 487141 T3510 C:control_collection c:collection1 oascc.ZkStateReader.readConfigName Load collection config from:/collections/control_collection
[junit4] 2> 487141 T3510 C:control_collection c:collection1 oascc.ZkStateReader.readConfigName path=/collections/control_collection configName=conf1 specified config exists in ZooKeeper
[junit4] 2> 487141 T3510 C:control_collection c:collection1 oasc.SolrResourceLoader.<init> new SolrResourceLoader for directory: '/home/jenkins/workspace/Lucene-Solr-5.1-Linux/solr/build/solr-core/test/J0/temp/solr.cloud.RecoveryAfterSoftCommitTest 7263C8E56603AAB3-001/control-001/cores/collection1/'
[junit4] 2> 487154 T3510 C:control_collection c:collection1 oasc.ZkController.watchZKConfDir watch zkdir /configs/conf1
[junit4] 2> 487155 T3510 C:control_collection c:collection1 oasc.Config.<init> loaded config solrconfig.xml with version 0
[junit4] 2> 487160 T3510 C:control_collection c:collection1 oasc.SolrConfig.refreshRequestParams current version of requestparams : -1
[junit4] 2> 487173 T3510 C:control_collection c:collection1 oasc.SolrConfig.<init> Using Lucene MatchVersion: 5.1.0
[junit4] 2> 487200 T3510 C:control_collection c:collection1 oasc.SolrConfig.<init> Loaded SolrConfig: solrconfig.xml
[junit4] 2> 487201 T3510 C:control_collection c:collection1 oass.IndexSchema.readSchema Reading Solr Schema from /configs/conf1/schema.xml
[junit4] 2> 487208 T3510 C:control_collection c:collection1 oass.IndexSchema.readSchema [collection1] Schema name=test
[junit4] 2> 487402 T3510 C:control_collection c:collection1 oass.OpenExchangeRatesOrgProvider.init Initialized with rates=open-exchange-rates.json, refreshInterval=1440.
[junit4] 2> 487407 T3510 C:control_collection c:collection1 oass.IndexSchema.readSchema default search field in schema is text
[junit4] 2> 487408 T3510 C:control_collection c:collection1 oass.IndexSchema.readSchema unique key field: id
[junit4] 2> 487413 T3510 C:control_collection c:collection1 oass.FileExchangeRateProvider.reload Reloading exchange rates from file currency.xml
[junit4] 2> 487415 T3510 C:control_collection c:collection1 oass.FileExchangeRateProvider.reload Reloading exchange rates from file currency.xml
[junit4] 2> 487417 T3510 C:control_collection c:collection1 oass.OpenExchangeRatesOrgProvider.reload Reloading exchange rates from open-exchange-rates.json
[junit4] 2> 487417 T3510 C:control_collection c:collection1 oass.OpenExchangeRatesOrgProvider$OpenExchangeRates.<init> WARN Unknown key IMPORTANT NOTE
[junit4] 2> 487417 T3510 C:control_collection c:collection1 oass.OpenExchangeRatesOrgProvider$OpenExchangeRates.<init> WARN Expected key, got STRING
[junit4] 2> 487417 T3510 C:control_collection c:collection1 oass.OpenExchangeRatesOrgProvider.reload Reloading exchange rates from open-exchange-rates.json
[junit4] 2> 487418 T3510 C:control_collection c:collection1 oass.OpenExchangeRatesOrgProvider$OpenExchangeRates.<init> WARN Unknown key IMPORTANT NOTE
[junit4] 2> 487418 T3510 C:control_collection c:collection1 oass.OpenExchangeRatesOrgProvider$OpenExchangeRates.<init> WARN Expected key, got STRING
[junit4] 2> 487418 T3510 C:control_collection c:collection1 oasc.CoreContainer.create Creating SolrCore 'collection1' using configuration from collection control_collection
[junit4] 2> 487418 T3510 C:control_collection c:collection1 oasc.SolrCore.initDirectoryFactory org.apache.solr.core.MockDirectoryFactory
[junit4] 2> 487418 T3510 C:control_collection c:collection1 oasc.SolrCore.<init> [collection1] Opening new SolrCore at /home/jenkins/workspace/Lucene-Solr-5.1-Linux/solr/build/solr-core/test/J0/temp/solr.cloud.RecoveryAfterSoftCommitTest 7263C8E56603AAB3-001/control-001/cores/collection1/, dataDir=/home/jenkins/workspace/Lucene-Solr-5.1-Linux/solr/build/solr-core/test/J0/temp/solr.cloud.RecoveryAfterSoftCommitTest 7263C8E56603AAB3-001/control-001/cores/collection1/data/
[junit4] 2> 487418 T3510 C:control_collection c:collection1 oasc.JmxMonitoredMap.<init> JMX monitoring is enabled. Adding Solr mbeans to JMX Server: com.sun.jmx.mbeanserver.JmxMBeanServer@1298ab34
[junit4] 2> 487419 T3510 C:control_collection c:collection1 oasc.CachingDirectoryFactory.get return new directory for /home/jenkins/workspace/Lucene-Solr-5.1-Linux/solr/build/solr-core/test/J0/temp/solr.cloud.RecoveryAfterSoftCommitTest 7263C8E56603AAB3-001/control-001/cores/collection1/data
[junit4] 2> 487419 T3510 C:control_collection c:collection1 oasc.SolrCore.getNewIndexDir New index directory detected: old=null new=/home/jenkins/workspace/Lucene-Solr-5.1-Linux/solr/build/solr-core/test/J0/temp/solr.cloud.RecoveryAfterSoftCommitTest 7263C8E56603AAB3-001/control-001/cores/collection1/data/index/
[junit4] 2> 487419 T3510 C:control_collection c:collection1 oasc.SolrCore.initIndex WARN [collection1] Solr index directory '/home/jenkins/workspace/Lucene-Solr-5.1-Linux/solr/build/solr-core/test/J0/temp/solr.cloud.RecoveryAfterSoftCommitTest 7263C8E56603AAB3-001/control-001/cores/collection1/data/index' doesn't exist. Creating new index...
[junit4] 2> 487419 T3510 C:control_collection c:collection1 oasc.CachingDirectoryFactory.get return new directory for /home/jenkins/workspace/Lucene-Solr-5.1-Linux/solr/build/solr-core/test/J0/temp/solr.cloud.RecoveryAfterSoftCommitTest 7263C8E56603AAB3-001/control-001/cores/collection1/data/index
[junit4] 2> 487419 T3510 C:control_collection c:collection1 oasu.RandomMergePolicy.<init> RandomMergePolicy wrapping class org.apache.lucene.index.TieredMergePolicy: [TieredMergePolicy: maxMergeAtOnce=21, maxMergeAtOnceExplicit=44, maxMergedSegmentMB=57.36328125, floorSegmentMB=1.2392578125, forceMergeDeletesPctAllowed=19.099248297185753, segmentsPerTier=44.0, maxCFSSegmentSizeMB=8.796093022207999E12, noCFSRatio=1.0
[junit4] 2> 487420 T3510 C:control_collection c:collection1 oasc.SolrDeletionPolicy.onCommit SolrDeletionPolicy.onCommit: commits: num=1
[junit4] 2> commit{dir=MockDirectoryWrapper(RAMDirectory@68a92d29 lockFactory=org.apache.lucene.store.SingleInstanceLockFactory@3ad4146d),segFN=segments_1,generation=1}
[junit4] 2> 487420 T3510 C:control_collection c:collection1 oasc.SolrDeletionPolicy.updateCommits newest commit generation = 1
[junit4] 2> 487422 T3510 C:control_collection c:collection1 oasup.UpdateRequestProcessorChain.init creating updateRequestProcessorChain "nodistrib"
[junit4] 2> 487423 T3510 C:control_collection c:collection1 oasup.UpdateRequestProcessorChain.init creating updateRequestProcessorChain "dedupe"
[junit4] 2> 487423 T3510 C:control_collection c:collection1 oasup.UpdateRequestProcessorChain.init inserting DistributedUpdateProcessorFactory into updateRequestProcessorChain "dedupe"
[junit4] 2> 487423 T3510 C:control_collection c:collection1 oasup.UpdateRequestProcessorChain.init creating updateRequestProcessorChain "stored_sig"
[junit4] 2> 487423 T3510 C:control_collection c:collection1 oasup.UpdateRequestProcessorChain.init inserting DistributedUpdateProcessorFactory into updateRequestProcessorChain "stored_sig"
[junit4] 2> 487423 T3510 C:control_collection c:collection1 oasup.UpdateRequestProcessorChain.init creating updateRequestProcessorChain "distrib-dup-test-chain-explicit"
[junit4] 2> 487423 T3510 C:control_collection c:collection1 oasup.UpdateRequestProcessorChain.init creating updateRequestProcessorChain "distrib-dup-test-chain-implicit"
[junit4] 2> 487424 T3510 C:control_collection c:collection1 oasup.UpdateRequestProcessorChain.init inserting DistributedUpdateProcessorFactory into updateRequestProcessorChain "distrib-dup-test-chain-implicit"
[junit4] 2> 487424 T3510 C:control_collection c:collection1 oasc.SolrCore.loadUpdateProcessorChains no updateRequestProcessorChain defined as default, creating implicit default
[junit4] 2> 487425 T3510 C:control_collection c:collection1 oashl.XMLLoader.init xsltCacheLifetimeSeconds=60
[junit4] 2> 487426 T3510 C:control_collection c:collection1 oashl.XMLLoader.init xsltCacheLifetimeSeconds=60
[junit4] 2> 487427 T3510 C:control_collection c:collection1 oashl.XMLLoader.init xsltCacheLifetimeSeconds=60
[junit4] 2> 487428 T3510 C:control_collection c:collection1 oashl.XMLLoader.init xsltCacheLifetimeSeconds=60
[junit4] 2> 487430 T3510 C:control_collection c:collection1 oasc.RequestHandlers.initHandlersFromConfig Registered paths: /admin/ping,/get,/admin/logging,/admin/properties,standard,/admin/file,/update/json,/admin/plugins,/replication,/config,/admin/threads,/admin/segments,/schema,/update/csv,/update,/admin/system,/update/json/docs,/admin/mbeans,/admin/luke
[junit4] 2> 487431 T3510 C:control_collection c:collection1 oasc.SolrCore.initStatsCache Using default statsCache cache: org.apache.solr.search.stats.LocalStatsCache
[junit4] 2> 487431 T3510 C:control_collection c:collection1 oasu.UpdateHandler.<init> Using UpdateLog implementation: org.apache.solr.update.UpdateLog
[junit4] 2> 487431 T3510 C:control_collection c:collection1 oasu.UpdateLog.init Initializing UpdateLog: dataDir= defaultSyncLevel=FLUSH numRecordsToKeep=100 maxNumLogsToKeep=10
[junit4] 2> 487432 T3510 C:control_collection c:collection1 oasu.CommitTracker.<init> Hard AutoCommit: disabled
[junit4] 2> 487432 T3510 C:control_collection c:collection1 oasu.CommitTracker.<init> Soft AutoCommit: disabled
[junit4] 2> 487432 T3510 C:control_collection c:collection1 oasu.RandomMergePolicy.<init> RandomMergePolicy wrapping class org.apache.lucene.index.TieredMergePolicy: [TieredMergePolicy: maxMergeAtOnce=33, maxMergeAtOnceExplicit=50, maxMergedSegmentMB=44.603515625, floorSegmentMB=0.546875, forceMergeDeletesPctAllowed=8.361652696730411, segmentsPerTier=34.0, maxCFSSegmentSizeMB=8.796093022207999E12, noCFSRatio=0.0
[junit4] 2> 487432 T3510 C:control_collection c:collection1 oasc.SolrDeletionPolicy.onInit SolrDeletionPolicy.onInit: commits: num=1
[junit4] 2> commit{dir=MockDirectoryWrapper(RAMDirectory@68a92d29 lockFactory=org.apache.lucene.store.SingleInstanceLockFactory@3ad4146d),segFN=segments_1,generation=1}
[junit4] 2> 487433 T3510 C:control_collection c:collection1 oasc.SolrDeletionPolicy.updateCommits newest commit generation = 1
[junit4] 2> 487433 T3510 C:control_collection c:collection1 oass.SolrIndexSearcher.<init> Opening Searcher@71206ce9[collection1] main
[junit4] 2> 487433 T3510 C:control_collection c:collection1 oascc.ZkStateReader.readConfigName Load collection config from:/collections/control_collection
[junit4] 2> 487433 T3510 C:control_collection c:collection1 oascc.ZkStateReader.readConfigName path=/collections/control_collection configName=conf1 specified config exists in ZooKeeper
[junit4] 2> 487434 T3510 C:control_collection c:collection1 oasr.ManagedResourceStorage.newStorageIO Setting up ZooKeeper-based storage for the RestManager with znodeBase: /configs/conf1
[junit4] 2> 487434 T3510 C:control_collection c:collection1 oasr.ManagedResourceStorage$ZooKeeperStorageIO.configure Configured ZooKeeperStorageIO with znodeBase: /configs/conf1
[junit4] 2> 487434 T3510 C:control_collection c:collection1 oasr.RestManager.init Initializing RestManager with initArgs: {}
[junit4] 2> 487434 T3510 C:control_collection c:collection1 oasr.ManagedResourceStorage.load Reading _rest_managed.json using ZooKeeperStorageIO:path=/configs/conf1
[junit4] 2> 487434 T3510 C:control_collection c:collection1 oasr.ManagedResourceStorage$ZooKeeperStorageIO.openInputStream No data found for znode /configs/conf1/_rest_managed.json
[junit4] 2> 487435 T3510 C:control_collection c:collection1 oasr.ManagedResourceStorage.load Loaded null at path _rest_managed.json using ZooKeeperStorageIO:path=/configs/conf1
[junit4] 2> 487435 T3510 C:control_collection c:collection1 oasr.RestManager.init Initializing 0 registered ManagedResources
[junit4] 2> 487435 T3510 C:control_collection c:collection1 oash.ReplicationHandler.inform Commits will be reserved for 10000
[junit4] 2> 487435 T3510 C:control_collection c:collection1 oasc.CoreContainer.registerCore registering core: collection1
[junit4] 2> 487435 T3511 C:control_collection c:collection1 oasc.SolrCore.registerSearcher [collection1] Registered new searcher Searcher@71206ce9[collection1] main{ExitableDirectoryReader(UninvertingDirectoryReader())}
[junit4] 2> 487435 T3514 C:control_collection S:shard1 oasc.ZkController.register Register replica - core:collection1 address:http://127.0.0.1:40994 collection:control_collection shard:shard1
[junit4] 2> 487436 T3480 oass.SolrDispatchFilter.init user.dir=/home/jenkins/workspace/Lucene-Solr-5.1-Linux/solr/build/solr-core/test/J0
[junit4] 2> 487436 T3480 oass.SolrDispatchFilter.init SolrDispatchFilter.init() done
[junit4] 2> 487436 T3514 C:control_collection S:shard1 oascc.SolrZkClient.makePath makePath: /collections/control_collection/leader_elect/shard1/election
[junit4] 2> 487437 T3480 oascc.SolrZkClient.createZkCredentialsToAddAutomatically Using default ZkCredentialsProvider
[junit4] 2> 487438 T3480 oascc.ConnectionManager.waitForConnected Waiting for client to connect to ZooKeeper
[junit4] 2> 487438 T3514 C:control_collection S:shard1 oasc.ShardLeaderElectionContext.runLeaderProcess Running the leader process for shard shard1
[junit4] 2> 487438 T3518 oascc.ConnectionManager.process Watcher org.apache.solr.common.cloud.ConnectionManager@79c0a684 name:ZooKeeperConnection Watcher:127.0.0.1:48812/solr got event WatchedEvent state:SyncConnected type:None path:null path:null type:None
[junit4] 2> 487439 T3480 oascc.ConnectionManager.waitForConnected Client is connected to ZooKeeper
[junit4] 2> 487439 T3506 oasc.DistributedQueue$LatchWatcher.process NodeChildrenChanged fired on path /overseer/queue state SyncConnected
[junit4] 2> 487439 T3514 C:control_collection S:shard1 oasc.ShardLeaderElectionContext.waitForReplicasToComeUp Enough replicas found to continue.
[junit4] 2> 487439 T3514 C:control_collection S:shard1 oasc.ShardLeaderElectionContext.runLeaderProcess I may be the new leader - try and sync
[junit4] 2> 487439 T3480 oascc.SolrZkClient.createZkACLProvider Using default ZkACLProvider
[junit4] 2> ASYNC NEW_CORE C688 name=collection1 org.apache.solr.core.SolrCore@90bfcc8 url=http://127.0.0.1:40994/collection1 node=127.0.0.1:40994_ C688_STATE=coll:control_collection core:collection1 props:{state=down, node_name=127.0.0.1:40994_, core=collection1, base_url=http://127.0.0.1:40994}
[junit4] 2> 487439 T3514 C:control_collection S:shard1 C688 P40994 oasc.SyncStrategy.sync Sync replicas to http://127.0.0.1:40994/collection1/
[junit4] 2> 487439 T3507 oasc.Overseer$ClusterStateUpdater.run processMessage: queueSize: 1, message = {
[junit4] 2> "operation":"leader",
[junit4] 2> "shard":"shard1",
[junit4] 2> "collection":"control_collection"} current state version: 1
[junit4] 2> 487440 T3514 C:control_collection S:shard1 C688 P40994 oasc.SyncStrategy.syncReplicas Sync Success - now sync replicas to me
[junit4] 2> 487440 T3480 oascc.ZkStateReader.createClusterStateWatchersAndUpdate Updating cluster state from ZooKeeper...
[junit4] 2> 487440 T3514 C:control_collection S:shard1 C688 P40994 oasc.SyncStrategy.syncToMe http://127.0.0.1:40994/collection1/ has no replicas
[junit4] 2> 487441 T3514 C:control_collection S:shard1 oasc.ShardLeaderElectionContext.runLeaderProcess I am the new leader: http://127.0.0.1:40994/collection1/ shard1
[junit4] 2> 487441 T3514 C:control_collection S:shard1 oascc.SolrZkClient.makePath makePath: /collections/control_collection/leaders/shard1
[junit4] 2> 487442 T3480 oasc.ChaosMonkey.monkeyLog monkey: init - expire sessions:false cause connection loss:false
[junit4] 2> 487443 T3506 oasc.DistributedQueue$LatchWatcher.process NodeChildrenChanged fired on path /overseer/queue state SyncConnected
[junit4] 2> 487443 T3507 oasc.Overseer$ClusterStateUpdater.run processMessage: queueSize: 1, message = {
[junit4] 2> "operation":"leader",
[junit4] 2> "shard":"shard1",
[junit4] 2> "collection":"control_collection",
[junit4] 2> "base_url":"http://127.0.0.1:40994",
[junit4] 2> "core":"collection1",
[junit4] 2> "state":"active"} current state version: 1
[junit4] 2> 487485 T3480 oas.SolrTestCaseJ4.writeCoreProperties Writing core.properties file to /home/jenkins/workspace/Lucene-Solr-5.1-Linux/solr/build/solr-core/test/J0/temp/solr.cloud.RecoveryAfterSoftCommitTest 7263C8E56603AAB3-001/shard-1-001/cores/collection1
[junit4] 2> 487486 T3480 oasc.AbstractFullDistribZkTestBase.createJettys create jetty 1 in directory /home/jenkins/workspace/Lucene-Solr-5.1-Linux/solr/build/solr-core/test/J0/temp/solr.cloud.RecoveryAfterSoftCommitTest 7263C8E56603AAB3-001/shard-1-001
[junit4] 2> 487486 T3480 oejs.Server.doStart jetty-8.1.10.v20130312
[junit4] 2> 487488 T3480 oejs.AbstractConnector.doStart Started SelectChannelConnector@127.0.0.1:51853
[junit4] 2> 487488 T3480 oascse.JettySolrRunner$1.lifeCycleStarted Jetty properties: {hostPort=50328, solr.data.dir=/home/jenkins/workspace/Lucene-Solr-5.1-Linux/solr/build/solr-core/test/J0/temp/solr.cloud.RecoveryAfterSoftCommitTest 7263C8E56603AAB3-001/tempDir-001/jetty1, solrconfig=solrconfig.xml, hostContext=/, coreRootDirectory=/home/jenkins/workspace/Lucene-Solr-5.1-Linux/solr/build/solr-core/test/J0/temp/solr.cloud.RecoveryAfterSoftCommitTest 7263C8E56603AAB3-001/shard-1-001/cores}
[junit4] 2> 487488 T3480 oass.SolrDispatchFilter.init SolrDispatchFilter.init()sun.misc.Launcher$AppClassLoader@12b0f0ae
[junit4] 2> 487488 T3480 oasc.SolrResourceLoader.<init> new SolrResourceLoader for directory: '/home/jenkins/workspace/Lucene-Solr-5.1-Linux/solr/build/solr-core/test/J0/temp/solr.cloud.RecoveryAfterSoftCommitTest 7263C8E56603AAB3-001/shard-1-001/'
[junit4] 2> 487499 T3480 oasc.SolrXmlConfig.fromFile Loading container configuration from /home/jenkins/workspace/Lucene-Solr-5.1-Linux/solr/build/solr-core/test/J0/temp/solr.cloud.RecoveryAfterSoftCommitTest 7263C8E56603AAB3-001/shard-1-001/solr.xml
[junit4] 2> 487506 T3480 oasc.CorePropertiesLocator.<init> Config-defined core root directory: /home/jenkins/workspace/Lucene-Solr-5.1-Linux/solr/build/solr-core/test/J0/temp/solr.cloud.RecoveryAfterSoftCommitTest 7263C8E56603AAB3-001/shard-1-001/cores
[junit4] 2> 487506 T3480 oasc.CoreContainer.<init> New CoreContainer 1761657233
[junit4] 2> 487507 T3480 oasc.CoreContainer.load Loading cores into CoreContainer [instanceDir=/home/jenkins/workspace/Lucene-Solr-5.1-Linux/solr/build/solr-core/test/J0/temp/solr.cloud.RecoveryAfterSoftCommitTest 7263C8E56603AAB3-001/shard-1-001/]
[junit4] 2> 487507 T3480 oasc.CoreContainer.load loading shared library: /home/jenkins/workspace/Lucene-Solr-5.1-Linux/solr/build/solr-core/test/J0/temp/solr.cloud.RecoveryAfterSoftCommitTest 7263C8E56603AAB3-001/shard-1-001/lib
[junit4] 2> 487507 T3480 oasc.SolrResourceLoader.addToClassLoader WARN Can't find (or read) directory to add to classloader: lib (resolved as: /home/jenkins/workspace/Lucene-Solr-5.1-Linux/solr/build/solr-core/test/J0/temp/solr.cloud.RecoveryAfterSoftCommitTest 7263C8E56603AAB3-001/shard-1-001/lib).
[junit4] 2> 487511 T3480 oashc.HttpShardHandlerFactory.getParameter Setting socketTimeout to: 90000
[junit4] 2> 487511 T3480 oashc.HttpShardHandlerFactory.getParameter Setting urlScheme to:
[junit4] 2> 487511 T3480 oashc.HttpShardHandlerFactory.getParameter Setting connTimeout to: 15000
[junit4] 2> 487512 T3480 oashc.HttpShardHandlerFactory.getParameter Setting maxConnectionsPerHost to: 20
[junit4] 2> 487512 T3480 oashc.HttpShardHandlerFactory.getParameter Setting maxConnections to: 10000
[junit4] 2> 487512 T3480 oashc.HttpShardHandlerFactory.getParameter Setting corePoolSize to: 0
[junit4] 2> 487512 T3480 oashc.HttpShardHandlerFactory.getParameter Setting maximumPoolSize to: 2147483647
[junit4] 2> 487512 T3480 oashc.HttpShardHandlerFactory.getParameter Setting maxThreadIdleTime to: 5
[junit4] 2> 487512 T3480 oashc.HttpShardHandlerFactory.getParameter Setting sizeOfQueue to: -1
[junit4] 2> 487512 T3480 oashc.HttpShardHandlerFactory.getParameter Setting fairnessPolicy to: false
[junit4] 2> 487512 T3480 oashc.HttpShardHandlerFactory.getParameter Setting useRetries to: false
[junit4] 2> 487513 T3480 oasu.UpdateShardHandler.<init> Creating UpdateShardHandler HTTP client with params: socketTimeout=340000&connTimeout=45000&retry=true
[junit4] 2> 487513 T3480 oasl.LogWatcher.createWatcher SLF4J impl is org.slf4j.impl.Log4jLoggerFactory
[junit4] 2> 487513 T3480 oasl.LogWatcher.newRegisteredLogWatcher Registering Log Listener [Log4j (org.slf4j.impl.Log4jLoggerFactory)]
[junit4] 2> 487513 T3480 oasc.CoreContainer.load Node Name: 127.0.0.1
[junit4] 2> 487513 T3480 oasc.ZkContainer.initZooKeeper Zookeeper client=127.0.0.1:48812/solr
[junit4] 2> 487513 T3480 oasc.ZkController.checkChrootPath zkHost includes chroot
[junit4] 2> 487514 T3480 oascc.SolrZkClient.createZkCredentialsToAddAutomatically Using default ZkCredentialsProvider
[junit4] 2> 487514 T3480 oascc.ConnectionManager.waitForConnected Waiting for client to connect to ZooKeeper
[junit4] 2> 487515 T3530 oascc.ConnectionManager.process Watcher org.apache.solr.common.cloud.ConnectionManager@60e7cc69 name:ZooKeeperConnection Watcher:127.0.0.1:48812 got event WatchedEvent state:SyncConnected type:None path:null path:null type:None
[junit4] 2> 487515 T3480 oascc.ConnectionManager.waitForConnected Client is connected to ZooKeeper
[junit4] 2> 487516 T3480 oascc.SolrZkClient.createZkACLProvider Using default ZkACLProvider
[junit4] 2> 487517 T3480 oascc.ConnectionManager.waitForConnected Waiting for client to connect to ZooKeeper
[junit4] 2> 487518 T3533 oascc.ConnectionManager.process Watcher org.apache.solr.common.cloud.ConnectionManager@2e887b88 name:ZooKeeperConnection Watcher:127.0.0.1:48812/solr got event WatchedEvent state:SyncConnected type:None path:null path:null type:None
[junit4] 2> 487518 T3480 oascc.ConnectionManager.waitForConnected Client is connected to ZooKeeper
[junit4] 2> 487521 T3480 oascc.ZkStateReader.createClusterStateWatchersAndUpdate Updating cluster state from ZooKeeper...
[junit4] 2> 487545 T3506 oascc.ZkStateReader$2.process A cluster state change: WatchedEvent state:SyncConnected type:NodeDataChanged path:/clusterstate.json, has occurred - updating... (live nodes size: 1)
[junit4] 2> 487545 T3518 oascc.ZkStateReader$2.process A cluster state change: WatchedEvent state:SyncConnected type:NodeDataChanged path:/clusterstate.json, has occurred - updating... (live nodes size: 1)
[junit4] 2> 487545 T3533 oascc.ZkStateReader$2.process A cluster state change: WatchedEvent state:SyncConnected type:NodeDataChanged path:/clusterstate.json, has occurred - updating... (live nodes size: 1)
[junit4] 2> 487593 T3514 C:control_collection S:shard1 oasc.ZkController.register We are http://127.0.0.1:40994/collection1/ and leader is http://127.0.0.1:40994/collection1/
[junit4] 2> 487594 T3514 C:control_collection S:shard1 oasc.ZkController.register No LogReplay needed for core=collection1 baseURL=http://127.0.0.1:40994
[junit4] 2> 487594 T3514 C:control_collection S:shard1 oasc.ZkController.checkRecovery I am the leader, no recovery necessary
[junit4] 2> 487594 T3514 C:control_collection S:shard1 c:collection1 oasc.ZkController.publish publishing core=collection1 state=active collection=control_collection
[junit4] 2> 487594 T3514 C:control_collection S:shard1 c:collection1 oasc.ZkController.publish numShards not found on descriptor - reading it from system property
[junit4] 2> 487595 T3506 oasc.DistributedQueue$LatchWatcher.process NodeChildrenChanged fired on path /overseer/queue state SyncConnected
[junit4] 2> 487595 T3507 oasc.Overseer$ClusterStateUpdater.run processMessage: queueSize: 1, message = {
[junit4] 2> "operation":"state",
[junit4] 2> "numShards":"1",
[junit4] 2> "state":"active",
[junit4] 2> "collection":"control_collection",
[junit4] 2> "core_node_name":"core_node1",
[junit4] 2> "node_name":"127.0.0.1:40994_",
[junit4] 2> "core":"collection1",
[junit4] 2> "base_url":"http://127.0.0.1:40994",
[junit4] 2> "roles":null,
[junit4] 2> "shard":"shard1"} current state version: 2
[junit4] 2> 487595 T3507 oasco.ReplicaMutator.updateState Update state numShards=1 message={
[junit4] 2> "operation":"state",
[junit4] 2> "numShards":"1",
[junit4] 2> "state":"active",
[junit4] 2> "collection":"control_collection",
[junit4] 2> "core_node_name":"core_node1",
[junit4] 2> "node_name":"127.0.0.1:40994_",
[junit4] 2> "core":"collection1",
[junit4] 2> "base_url":"http://127.0.0.1:40994",
[junit4] 2> "roles":null,
[junit4] 2> "shard":"shard1"}
[junit4] 2> 487697 T3533 oascc.ZkStateReader$2.process A cluster state change: WatchedEvent state:SyncConnected type:NodeDataChanged path:/clusterstate.json, has occurred - updating... (live nodes size: 1)
[junit4] 2> 487697 T3506 oascc.ZkStateReader$2.process A cluster state change: WatchedEvent state:SyncConnected type:NodeDataChanged path:/clusterstate.json, has occurred - updating... (live nodes size: 1)
[junit4] 2> 487697 T3518 oascc.ZkStateReader$2.process A cluster state change: WatchedEvent state:SyncConnected type:NodeDataChanged path:/clusterstate.json, has occurred - updating... (live nodes size: 1)
[junit4] 2> 488523 T3480 oasc.ZkController.createEphemeralLiveNode Register node as live in ZooKeeper:/live_nodes/127.0.0.1:50328_
[junit4] 2> 488523 T3480 oascc.SolrZkClient.makePath makePath: /live_nodes/127.0.0.1:50328_
[junit4] 2> 488524 T3480 oasc.Overseer.close Overseer (id=null) closing
[junit4] 2> 488525 T3480 oasc.CorePropertiesLocator.discover Looking for core definitions underneath /home/jenkins/workspace/Lucene-Solr-5.1-Linux/solr/build/solr-core/test/J0/temp/solr.cloud.RecoveryAfterSoftCommitTest 7263C8E56603AAB3-001/shard-1-001/cores
[junit4] 2> 488526 T3480 oasc.CoreDescriptor.<init> CORE DESCRIPTOR: {instanceDir=/home/jenkins/workspace/Lucene-Solr-5.1-Linux/solr/build/solr-core/test/J0/temp/solr.cloud.RecoveryAfterSoftCommitTest 7263C8E56603AAB3-001/shard-1-001/cores/collection1, transient=false, coreNodeName=, dataDir=data/, absoluteInstDir=/home/jenkins/workspace/Lucene-Solr-5.1-Linux/solr/build/solr-core/test/J0/temp/solr.cloud.RecoveryAfterSoftCommitTest 7263C8E56603AAB3-001/shard-1-001/cores/collection1/, shard=, config=solrconfig.xml, schema=schema.xml, loadOnStartup=true, collection=collection1, name=collection1}
[junit4] 2> 488526 T3480 oasc.CorePropertiesLocator.discoverUnder Found core collection1 in /home/jenkins/workspace/Lucene-Solr-5.1-Linux/solr/build/solr-core/test/J0/temp/solr.cloud.RecoveryAfterSoftCommitTest 7263C8E56603AAB3-001/shard-1-001/cores/collection1/
[junit4] 2> 488526 T3480 oasc.CorePropertiesLocator.discover Found 1 core definitions
[junit4] 2> 488527 T3534 C:collection1 c:collection1 oasc.ZkController.publish publishing core=collection1 state=down collection=collection1
[junit4] 2> 488527 T3534 C:collection1 c:collection1 oasc.ZkController.publish numShards not found on descriptor - reading it from system property
[junit4] 2> 488527 T3534 C:collection1 c:collection1 oasc.ZkController.waitForCoreNodeName look for our core node name
[junit4] 2> 488527 T3506 oasc.DistributedQueue$LatchWatcher.process NodeChildrenChanged fired on path /overseer/queue state SyncConnected
[junit4] 2> 488528 T3507 oasc.Overseer$ClusterStateUpdater.run processMessage: queueSize: 1, message = {
[junit4] 2> "operation":"state",
[junit4] 2> "numShards":"1",
[junit4] 2> "state":"down",
[junit4] 2> "collection":"collection1",
[junit4] 2> "node_name":"127.0.0.1:50328_",
[junit4] 2> "core":"collection1",
[junit4] 2> "base_url":"http://127.0.0.1:50328",
[junit4] 2> "roles":null,
[junit4] 2> "shard":null} current state version: 3
[junit4] 2> 488528 T3507 oasco.ReplicaMutator.updateState Update state numShards=1 message={
[junit4] 2> "operation":"state",
[junit4] 2> "numShards":"1",
[junit4] 2> "state":"down",
[junit4] 2> "collection":"collection1",
[junit4] 2> "node_name":"127.0.0.1:50328_",
[junit4] 2> "core":"collection1",
[junit4] 2> "base_url":"http://127.0.0.1:50328",
[junit4] 2> "roles":null,
[junit4] 2> "shard":null}
[junit4] 2> 488528 T3507 oasco.ClusterStateMutator.createCollection building a new cName: collection1
[junit4] 2> 488528 T3507 oasco.ReplicaMutator.updateState Assigning new node to shard shard=shard1
[junit4] 2> 488630 T3506 oascc.ZkStateReader$2.process A cluster state change: WatchedEvent state:SyncConnected type:NodeDataChanged path:/clusterstate.json, has occurred - updating... (live nodes size: 2)
[junit4] 2> 488630 T3533 oascc.ZkStateReader$2.process A cluster state change: WatchedEvent state:SyncConnected type:NodeDataChanged path:/clusterstate.json, has occurred - updating... (live nodes size: 2)
[junit4] 2> 488630 T3518 oascc.ZkStateReader$2.process A cluster state change: WatchedEvent state:SyncConnected type:NodeDataChanged path:/clusterstate.json, has occurred - updating... (live nodes size: 2)
[junit4] 2> 489527 T3534 C:collection1 c:collection1 oasc.ZkController.waitForShardId waiting to find shard id in clusterstate for collection1
[junit4] 2> 489528 T3534 C:collection1 c:collection1 oasc.ZkController.createCollectionZkNode Check for collection zkNode:collection1
[junit4] 2> 489528 T3534 C:collection1 c:collection1 oasc.ZkController.createCollectionZkNode Collection zkNode exists
[junit4] 2> 489528 T3534 C:collection1 c:collection1 oascc.ZkStateReader.readConfigName Load collection config from:/collections/collection1
[junit4] 2> 489528 T3534 C:collection1 c:collection1 oascc.ZkStateReader.readConfigName path=/collections/collection1 configName=conf1 specified config exists in ZooKeeper
[junit4] 2> 489528 T3534 C:collection1 c:collection1 oasc.SolrResourceLoader.<init> new SolrResourceLoader for directory: '/home/jenkins/workspace/Lucene-Solr-5.1-Linux/solr/build/solr-core/test/J0/temp/solr.cloud.RecoveryAfterSoftCommitTest 7263C8E56603AAB3-001/shard-1-001/cores/collection1/'
[junit4] 2> 489536 T3534 C:collection1 c:collection1 oasc.ZkController.watchZKConfDir watch zkdir /configs/conf1
[junit4] 2> 489537 T3534 C:collection1 c:collection1 oasc.Config.<init> loaded config solrconfig.xml with version 0
[junit4] 2> 489540 T3534 C:collection1 c:collection1 oasc.SolrConfig.refreshRequestParams current version of requestparams : -1
[junit4] 2> 489548 T3534 C:collection1 c:collection1 oasc.SolrConfig.<init> Using Lucene MatchVersion: 5.1.0
[junit4] 2> 489564 T3534 C:collection1 c:collection1 oasc.SolrConfig.<init> Loaded SolrConfig: solrconfig.xml
[junit4] 2> 489565 T3534 C:collection1 c:collection1 oass.IndexSchema.readSchema Reading Solr Schema from /configs/conf1/schema.xml
[junit4] 2> 489569 T3534 C:collection1 c:collection1 oass.IndexSchema.readSchema [collection1] Schema name=test
[junit4] 2> 489731 T3534 C:collection1 c:collection1 oass.OpenExchangeRatesOrgProvider.init Initialized with rates=open-exchange-rates.json, refreshInterval=1440.
[junit4] 2> 489736 T3534 C:collection1 c:collection1 oass.IndexSchema.readSchema default search field in schema is text
[junit4] 2> 489738 T3534 C:collection1 c:collection1 oass.IndexSchema.readSchema unique key field: id
[junit4] 2> 489742 T3534 C:collection1 c:collection1 oass.FileExchangeRateProvider.reload Reloading exchange rates from file currency.xml
[junit4] 2> 489744 T3534 C:collection1 c:collection1 oass.FileExchangeRateProvider.reload Reloading exchange rates from file currency.xml
[junit4] 2> 489746 T3534 C:collection1 c:collection1 oass.OpenExchangeRatesOrgProvider.reload Reloading exchange rates from open-exchange-rates.json
[junit4] 2> 489746 T3534 C:collection1 c:collection1 oass.OpenExchangeRatesOrgProvider$OpenExchangeRates.<init> WARN Unknown key IMPORTANT NOTE
[junit4] 2> 489747 T3534 C:collection1 c:collection1 oass.OpenExchangeRatesOrgProvider$OpenExchangeRates.<init> WARN Expected key, got STRING
[junit4] 2> 489747 T3534 C:collection1 c:collection1 oass.OpenExchangeRatesOrgProvider.reload Reloading exchange rates from open-exchange-rates.json
[junit4] 2> 489747 T3534 C:collection1 c:collection1 oass.OpenExchangeRatesOrgProvider$OpenExchangeRates.<init> WARN Unknown key IMPORTANT NOTE
[junit4] 2> 489747 T3534 C:collection1 c:collection1 oass.OpenExchangeRatesOrgProvider$OpenExchangeRates.<init> WARN Expected key, got STRING
[junit4] 2> 489747 T3534 C:collection1 c:collection1 oasc.CoreContainer.create Creating SolrCore 'collection1' using configuration from collection collection1
[junit4] 2> 489747 T3534 C:collection1 c:collection1 oasc.SolrCore.initDirectoryFactory org.apache.solr.core.MockDirectoryFactory
[junit4] 2> 489748 T3534 C:collection1 c:collection1 oasc.SolrCore.<init> [collection1] Opening new SolrCore at /home/jenkins/workspace/Lucene-Solr-5.1-Linux/solr/build/solr-core/test/J0/temp/solr.cloud.RecoveryAfterSoftCommitTest 7263C8E56603AAB3-001/shard-1-001/cores/collection1/, dataDir=/home/jenkins/workspace/Lucene-Solr-5.1-Linux/solr/build/solr-core/test/J0/temp/solr.cloud.RecoveryAfterSoftCommitTest 7263C8E56603AAB3-001/shard-1-001/cores/collection1/data/
[junit4] 2> 489748 T3534 C:collection1 c:collection1 oasc.JmxMonitoredMap.<init> JMX monitoring is enabled. Adding Solr mbeans to JMX Server: com.sun.jmx.mbeanserver.JmxMBeanServer@1298ab34
[junit4] 2> 489748 T3534 C:collection1 c:collection1 oasc.CachingDirectoryFactory.get return new directory for /home/jenkins/workspace/Lucene-Solr-5.1-Linux/solr/build/solr-core/test/J0/temp/solr.cloud.RecoveryAfterSoftCommitTest 7263C8E56603AAB3-001/shard-1-001/cores/collection1/data
[junit4] 2> 489748 T3534 C:collection1 c:collection1 oasc.SolrCore.getNewIndexDir New index directory detected: old=null new=/home/jenkins/workspace/Lucene-Solr-5.1-Linux/solr/build/solr-core/test/J0/temp/solr.cloud.RecoveryAfterSoftCommitTest 7263C8E56603AAB3-001/shard-1-001/cores/collection1/data/index/
[junit4] 2> 489748 T3534 C:collection1 c:collection1 oasc.SolrCore.initIndex WARN [collection1] Solr index directory '/home/jenkins/workspace/Lucene-Solr-5.1-Linux/solr/build/solr-core/test/J0/temp/solr.cloud.RecoveryAfterSoftCommitTest 7263C8E56603AAB3-001/shard-1-001/cores/collection1/data/index' doesn't exist. Creating new index...
[junit4] 2> 489749 T3534 C:collection1 c:collection1 oasc.CachingDirectoryFactory.get return new directory for /home/jenkins/workspace/Lucene-Solr-5.1-Linux/solr/build/solr-core/test/J0/temp/solr.cloud.RecoveryAfterSoftCommitTest 7263C8E56603AAB3-001/shard-1-001/cores/collection1/data/index
[junit4] 2> 489749 T3534 C:collection1 c:collection1 oasu.RandomMergePolicy.<init> RandomMergePolicy wrapping class org.apache.lucene.index.TieredMergePolicy: [TieredMergePolicy: maxMergeAtOnce=21, maxMergeAtOnceExplicit=44, maxMergedSegmentMB=57.36328125, floorSegmentMB=1.2392578125, forceMergeDeletesPctAllowed=19.099248297185753, segmentsPerTier=44.0, maxCFSSegmentSizeMB=8.796093022207999E12, noCFSRatio=1.0
[junit4] 2> 489749 T3534 C:collection1 c:collection1 oasc.SolrDeletionPolicy.onCommit SolrDeletionPolicy.onCommit: commits: num=1
[junit4] 2> commit{dir=MockDirectoryWrapper(RAMDirectory@13117afa lockFactory=org.apache.lucene.store.SingleInstanceLockFactory@60a0bcdd),segFN=segments_1,generation=1}
[junit4] 2> 489749 T3534 C:collection1 c:collection1 oasc.SolrDeletionPolicy.updateCommits newest commit generation = 1
[junit4] 2> 489752 T3534 C:collection1 c:collection1 oasup.UpdateRequestProcessorChain.init creating updateRequestProcessorChain "nodistrib"
[junit4] 2> 489753 T3534 C:collection1 c:collection1 oasup.UpdateRequestProcessorChain.init creating updateRequestProcessorChain "dedupe"
[junit4] 2> 489753 T3534 C:collection1 c:collection1 oasup.UpdateRequestProcessorChain.init inserting DistributedUpdateProcessorFactory into updateRequestProcessorChain "dedupe"
[junit4] 2> 489753 T3534 C:collection1 c:collection1 oasup.UpdateRequestProcessorChain.init creating updateRequestProcessorChain "stored_sig"
[junit4] 2> 489753 T3534 C:collection1 c:collection1 oasup.UpdateRequestProcessorChain.init inserting DistributedUpdateProcessorFactory into updateRequestProcessorChain "stored_sig"
[junit4] 2> 489753 T3534 C:collection1 c:collection1 oasup.UpdateRequestProcessorChain.init creating updateRequestProcessorChain "distrib-dup-test-chain-explicit"
[junit4] 2> 489753 T3534 C:collection1 c:collection1 oasup.UpdateRequestProcessorChain.init creating updateRequestProcessorChain "distrib-dup-test-chain-implicit"
[junit4] 2> 489753 T3534 C:collection1 c:collection1 oasup.UpdateRequestProcessorChain.init inserting DistributedUpdateProcessorFactory into updateRequestProcessorChain "distrib-dup-test-chain-implicit"
[junit4] 2> 489753 T3534 C:collection1 c:collection1 oasc.SolrCore.loadUpdateProcessorChains no updateRequestProcessorChain defined as default, creating implicit default
[junit4] 2> 489755 T3534 C:collection1 c:collection1 oashl.XMLLoader.init xsltCacheLifetimeSeconds=60
[junit4] 2> 489756 T3534 C:collection1 c:collection1 oashl.XMLLoader.init xsltCacheLifetimeSeconds=60
[junit4] 2> 489757 T3534 C:collection1 c:collection1 oashl.XMLLoader.init xsltCacheLifetimeSeconds=60
[junit4] 2> 489758 T3534 C:collection1 c:collection1 oashl.XMLLoader.init xsltCacheLifetimeSeconds=60
[junit4] 2> 489761 T3534 C:collection1 c:collection1 oasc.RequestHandlers.initHandlersFromConfig Registered paths: /admin/ping,/get,/admin/logging,/admin/properties,standard,/admin/file,/update/json,/admin/plugins,/replication,/config,/admin/threads,/admin/segments,/schema,/update/csv,/update,/admin/system,/update/json/docs,/admin/mbeans,/admin/luke
[junit4] 2> 489761 T3534 C:collection1 c:collection1 oasc.SolrCore.initStatsCache Using default statsCache cache: org.apache.solr.search.stats.LocalStatsCache
[junit4] 2> 489762 T3534 C:collection1 c:collection1 oasu.UpdateHandler.<init> Using UpdateLog implementation: org.apache.solr.update.UpdateLog
[junit4] 2> 489762 T3534 C:collection1 c:collection1 oasu.UpdateLog.init Initializing UpdateLog: dataDir= defaultSyncLevel=FLUSH numRecordsToKeep=100 maxNumLogsToKeep=10
[junit4] 2> 489762 T3534 C:collection1 c:collection1 oasu.CommitTracker.<init> Hard AutoCommit: disabled
[junit4] 2> 489762 T3534 C:collection1 c:collection1 oasu.CommitTracker.<init> Soft AutoCommit: disabled
[junit4] 2> 489763 T3534 C:collection1 c:collection1 oasu.RandomMergePolicy.<init> RandomMergePolicy wrapping class org.apache.lucene.index.TieredMergePolicy: [TieredMergePolicy: maxMergeAtOnce=33, maxMergeAtOnceExplicit=50, maxMergedSegmentMB=44.603515625, floorSegmentMB=0.546875, forceMergeDeletesPctAllowed=8.361652696730411, segmentsPerTier=34.0, maxCFSSegmentSizeMB=8.796093022207999E12, noCFSRatio=0.0
[junit4] 2> 489763 T3534 C:collection1 c:collection1 oasc.SolrDeletionPolicy.onInit SolrDeletionPolicy.onInit: commits: num=1
[junit4] 2> commit{dir=MockDirectoryWrapper(RAMDirectory@13117afa lockFactory=org.apache.lucene.store.SingleInstanceLockFactory@60a0bcdd),segFN=segments_1,generation=1}
[junit4] 2> 489763 T3534 C:collection1 c:collection1 oasc.SolrDeletionPolicy.updateCommits newest commit generation = 1
[junit4] 2> 489763 T3534 C:collection1 c:collection1 oass.SolrIndexSearcher.<init> Opening Searcher@45bfee08[collection1] main
[junit4] 2> 489763 T3534 C:collection1 c:collection1 oascc.ZkStateReader.readConfigName Load collection config from:/collections/collection1
[junit4] 2> 489764 T3534 C:collection1 c:collection1 oascc.ZkStateReader.readConfigName path=/collections/collection1 configName=conf1 specified config exists in ZooKeeper
[junit4] 2> 489764 T3534 C:collection1 c:collection1 oasr.ManagedResourceStorage.newStorageIO Setting up ZooKeeper-based storage for the RestManager with znodeBase: /configs/conf1
[junit4] 2> 489764 T3534 C:collection1 c:collection1 oasr.ManagedResourceStorage$ZooKeeperStorageIO.configure Configured ZooKeeperStorageIO with znodeBase: /configs/conf1
[junit4] 2> 489764 T3534 C:collection1 c:collection1 oasr.RestManager.init Initializing RestManager with initArgs: {}
[junit4] 2> 489764 T3534 C:collection1 c:collection1 oasr.ManagedResourceStorage.load Reading _rest_managed.json using ZooKeeperStorageIO:path=/configs/conf1
[junit4] 2> 489765 T3534 C:collection1 c:collection1 oasr.ManagedResourceStorage$ZooKeeperStorageIO.openInputStream No data found for znode /configs/conf1/_rest_managed.json
[junit4] 2> 489765 T3534 C:collection1 c:collection1 oasr.ManagedResourceStorage.load Loaded null at path _rest_managed.json using ZooKeeperStorageIO:path=/configs/conf1
[junit4] 2> 489765 T3534 C:collection1 c:collection1 oasr.RestManager.init Initializing 0 registered ManagedResources
[junit4] 2> 489765 T3534 C:collection1 c:collection1 oash.ReplicationHandler.inform Commits will be reserved for 10000
[junit4] 2> 489765 T3535 C:collection1 c:collection1 oasc.SolrCore.registerSearcher [collection1] Registered new searcher Searcher@45bfee08[collection1] main{ExitableDirectoryReader(UninvertingDirectoryReader())}
[junit4] 2> 489766 T3534 C:collection1 c:collection1 oasc.CoreContainer.registerCore registering core: collection1
[junit4] 2> 489766 T3538 C:collection1 S:shard1 oasc.ZkController.register Register replica - core:collection1 address:http://127.0.0.1:50328 collection:collection1 shard:shard1
[junit4] 2> 489766 T3480 oass.SolrDispatchFilter.init user.dir=/home/jenkins/workspace/Lucene-Solr-5.1-Linux/solr/build/solr-core/test/J0
[junit4] 2> 489766 T3480 oass.SolrDispatchFilter.init SolrDispatchFilter.init() done
[junit4] 2> 489766 T3538 C:collection1 S:shard1 oascc.SolrZkClient.makePath makePath: /collections/collection1/leader_elect/shard1/election
[junit4] 2> 489769 T3538 C:collection1 S:shard1 oasc.ShardLeaderElectionContext.runLeaderProcess Running the leader process for shard shard1
[junit4] 2> 489769 T3506 oasc.DistributedQueue$LatchWatcher.process NodeChildrenChanged fired on path /overseer/queue state SyncConnected
[junit4] 2> 489770 T3538 C:collection1 S:shard1 oasc.ShardLeaderElectionContext.waitForReplicasToComeUp Enough replicas found to continue.
[junit4] 2> 489770 T3538 C:collection1 S:shard1 oasc.ShardLeaderElectionContext.runLeaderProcess I may be the new leader - try and sync
[junit4] 2> ASYNC NEW_CORE C689 name=collection1 org.apache.solr.core.SolrCore@458c9099 url=http://127.0.0.1:50328/collection1 node=127.0.0.1:50328_ C689_STATE=coll:collection1 core:collection1 props:{state=down, node_name=127.0.0.1:50328_, core=collection1, base_url=http://127.0.0.1:50328}
[junit4] 2> 489770 T3538 C:collection1 S:shard1 C689 P50328 oasc.SyncStrategy.sync Sync replicas to http://127.0.0.1:50328/collection1/
[junit4] 2> 489770 T3507 oasc.Overseer$ClusterStateUpdater.run processMessage: queueSize: 1, message = {
[junit4] 2> "operation":"leader",
[junit4] 2> "shard":"shard1",
[junit4] 2> "collection":"collection1"} current state version: 4
[junit4] 2> 489770 T3538 C:collection1 S:shard1 C689 P50328 oasc.SyncStrategy.syncReplicas Sync Success - now sync replicas to me
[junit4] 2> 489770 T3538 C:collection1 S:shard1 C689 P50328 oasc.SyncStrategy.syncToMe http://127.0.0.1:50328/collection1/ has no replicas
[junit4] 2> 489770 T3538 C:collection1 S:shard1 oasc.ShardLeaderElectionContext.runLeaderProcess I am the new leader: http://127.0.0.1:50328/collection1/ shard1
[junit4] 2> 489771 T3538 C:collection1 S:shard1 oascc.SolrZkClient.makePath makePath: /collections/collection1/leaders/shard1
[junit4] 2> 489772 T3506 oasc.DistributedQueue$LatchWatcher.process NodeChildrenChanged fired on path /overseer/queue state SyncConnected
[junit4] 2> 489773 T3507 oasc.Overseer$ClusterStateUpdater.run processMessage: queueSize: 1, message = {
[junit4] 2> "operation":"leader",
[junit4] 2> "shard":"shard1",
[junit4] 2> "collection":"collection1",
[junit4] 2> "base_url":"http://127.0.0.1:50328",
[junit4] 2> "core":"collection1",
[junit4] 2> "state":"active"} current state version: 4
[junit4] 2> 489811 T3480 oas.SolrTestCaseJ4.writeCoreProperties Writing core.properties file to /home/jenkins/workspace/Lucene-Solr-5.1-Linux/solr/build/solr-core/test/J0/temp/solr.cloud.RecoveryAfterSoftCommitTest 7263C8E56603AAB3-001/shard-2-001/cores/collection1
[junit4] 2> 489812 T3480 oasc.AbstractFullDistribZkTestBase.createJettys create jetty 2 in directory /home/jenkins/workspace/Lucene-Solr-5.1-Linux/solr/build/solr-core/test/J0/temp/solr.cloud.RecoveryAfterSoftCommitTest 7263C8E56603AAB3-001/shard-2-001
[junit4] 2> 489812 T3480 oejs.Server.doStart jetty-8.1.10.v20130312
[junit4] 2> 489814 T3480 oejs.AbstractConnector.doStart Started SelectChannelConnector@127.0.0.1:52108
[junit4] 2> 489814 T3480 oascse.JettySolrRunner$1.lifeCycleStarted Jetty properties: {solr.data.dir=/home/jenkins/workspace/Lucene-Solr-5.1-Linux/solr/build/solr-core/test/J0/temp/solr.cloud.RecoveryAfterSoftCommitTest 7263C8E56603AAB3-001/tempDir-001/jetty2, hostContext=/, hostPort=45200, solrconfig=solrconfig.xml, coreRootDirectory=/home/jenkins/workspace/Lucene-Solr-5.1-Linux/solr/build/solr-core/test/J0/temp/solr.cloud.RecoveryAfterSoftCommitTest 7263C8E56603AAB3-001/shard-2-001/cores}
[junit4] 2> 489814 T3480 oass.SolrDispatchFilter.init SolrDispatchFilter.init()sun.misc.Launcher$AppClassLoader@12b0f0ae
[junit4] 2> 489814 T3480 oasc.SolrResourceLoader.<init> new SolrResourceLoader for directory: '/home/jenkins/workspace/Lucene-Solr-5.1-Linux/solr/build/solr-core/test/J0/temp/solr.cloud.RecoveryAfterSoftCommitTest 7263C8E56603AAB3-001/shard-2-001/'
[junit4] 2> 489824 T3480 oasc.SolrXmlConfig.fromFile Loading container configuration from /home/jenkins/workspace/Lucene-Solr-5.1-Linux/solr/build/solr-core/test/J0/temp/solr.cloud.RecoveryAfterSoftCommitTest 7263C8E56603AAB3-001/shard-2-001/solr.xml
[junit4] 2> 489832 T3480 oasc.CorePropertiesLocator.<init> Config-defined core root directory: /home/jenkins/workspace/Lucene-Solr-5.1-Linux/solr/build/solr-core/test/J0/temp/solr.cloud.RecoveryAfterSoftCommitTest 7263C8E56603AAB3-001/shard-2-001/cores
[junit4] 2> 489833 T3480 oasc.CoreContainer.<init> New CoreContainer 758218847
[junit4] 2> 489833 T3480 oasc.CoreContainer.load Loading cores into CoreContainer [instanceDir=/home/jenkins/workspace/Lucene-Solr-5.1-Linux/solr/build/solr-core/test/J0/temp/solr.cloud.RecoveryAfterSoftCommitTest 7263C8E56603AAB3-001/shard-2-001/]
[junit4] 2> 489833 T3480 oasc.CoreContainer.load loading shared library: /home/jenkins/workspace/Lucene-Solr-5.1-Linux/solr/build/solr-core/test/J0/temp/solr.cloud.RecoveryAfterSoftCommitTest 7263C8E56603AAB3-001/shard-2-001/lib
[junit4] 2> 489833 T3480 oasc.SolrResourceLoader.addToClassLoader WARN Can't find (or read) directory to add to classloader: lib (resolved as: /home/jenkins/workspace/Lucene-Solr-5.1-Linux/solr/build/solr-core/test/J0/temp/solr.cloud.RecoveryAfterSoftCommitTest 7263C8E56603AAB3-001/shard-2-001/lib).
[junit4] 2> 489838 T3480 oashc.HttpShardHandlerFactory.getParameter Setting socketTimeout to: 90000
[junit4] 2> 489838 T3480 oashc.HttpShardHandlerFactory.getParameter Setting urlScheme to:
[junit4] 2> 489838 T3480 oashc.HttpShardHandlerFactory.getParameter Setting connTimeout to: 15000
[junit4] 2> 489838 T3480 oashc.HttpShardHandlerFactory.getParameter Setting maxConnectionsPerHost to: 20
[junit4] 2> 489838 T3480 oashc.HttpShardHandlerFactory.getParameter Setting maxConnections to: 10000
[junit4] 2> 489838 T3480 oashc.HttpShardHandlerFactory.getParameter Setting corePoolSize to: 0
[junit4] 2> 489838 T3480 oashc.HttpShardHandlerFactory.getParameter Setting maximumPoolSize to: 2147483647
[junit4] 2> 489839 T3480 oashc.HttpShardHandlerFactory.getParameter Setting maxThreadIdleTime to: 5
[junit4] 2> 489839 T3480 oashc.HttpShardHandlerFactory.getParameter Setting sizeOfQueue to: -1
[junit4] 2> 489839 T3480 oashc.HttpShardHandlerFactory.getParameter Setting fairnessPolicy to: false
[junit4] 2> 489839 T3480 oashc.HttpShardHandlerFactory.getParameter Setting useRetries to: false
[junit4] 2> 489839 T3480 oasu.UpdateShardHandler.<init> Creating UpdateShardHandler HTTP client with params: socketTimeout=340000&connTimeout=45000&retry=true
[junit4] 2> 489839 T3480 oasl.LogWatcher.createWatcher SLF4J impl is org.slf4j.impl.Log4jLoggerFactory
[junit4] 2> 489840 T3480 oasl.LogWatcher.newRegisteredLogWatcher Registering Log Listener [Log4j (org.slf4j.impl.Log4jLoggerFactory)]
[junit4] 2> 489840 T3480 oasc.CoreContainer.load Node Name: 127.0.0.1
[junit4] 2> 489840 T3480 oasc.ZkContainer.initZooKeeper Zookeeper client=127.0.0.1:48812/solr
[junit4] 2> 489840 T3480 oasc.ZkController.checkChrootPath zkHost includes chroot
[junit4] 2> 489840 T3480 oascc.SolrZkClient.createZkCredentialsToAddAutomatically Using default ZkCredentialsProvider
[junit4] 2> 489841 T3480 oascc.ConnectionManager.waitForConnected Waiting for client to connect to ZooKeeper
[junit4] 2> 489842 T3551 oascc.ConnectionManager.process Watcher org.apache.solr.common.cloud.ConnectionManager@578b4f57 name:ZooKeeperConnection Watcher:127.0.0.1:48812 got event WatchedEvent state:SyncConnected type:None path:null path:null type:None
[junit4] 2> 489842 T3480 oascc.ConnectionManager.waitForConnected Client is connected to ZooKeeper
[junit4] 2> 489842 T3480 oascc.SolrZkClient.createZkACLProvider Using default ZkACLProvider
[junit4] 2> 489844 T3480 oascc.ConnectionManager.waitForConnected Waiting for client to connect to ZooKeeper
[junit4] 2> 489845 T3554 oascc.ConnectionManager.process Watcher org.apache.solr.common.cloud.ConnectionManager@66c7d60c name:ZooKeeperConnection Watcher:127.0.0.1:48812/solr got event WatchedEvent state:SyncConnected type:None path:null path:null type:None
[junit4] 2> 489845 T3480 oascc.ConnectionManager.waitForConnected Client is connected to ZooKeeper
[junit4] 2> 489847 T3480 oascc.ZkStateReader.createClusterStateWatchersAndUpdate Updating cluster state from ZooKeeper...
[junit4] 2> 489874 T3554 oascc.ZkStateReader$2.process A cluster state change: WatchedEvent state:SyncConnected type:NodeDataChanged path:/clusterstate.json, has occurred - updating... (live nodes size: 2)
[junit4] 2> 489875 T3533 oascc.ZkStateReader$2.process A cluster state change: WatchedEvent state:SyncConnected type:NodeDataChanged path:/clusterstate.json, has occurred - updating... (live nodes size: 2)
[junit4] 2> 489874 T3518 oascc.ZkStateReader$2.process A cluster state change: WatchedEvent state:SyncConnected type:NodeDataChanged path:/clusterstate.json, has occurred - updating... (live nodes size: 2)
[junit4] 2> 489874 T3506 oascc.ZkStateReader$2.process A cluster state change: WatchedEvent state:SyncConnected type:NodeDataChanged path:/clusterstate.json, has occurred - updating... (live nodes size: 2)
[junit4] 2> 489923 T3538 C:collection1 S:shard1 oasc.ZkController.register We are http://127.0.0.1:50328/collection1/ and leader is http://127.0.0.1:50328/collection1/
[junit4] 2> 489923 T3538 C:collection1 S:shard1 oasc.ZkController.register No LogReplay needed for core=collection1 baseURL=http://127.0.0.1:50328
[junit4] 2> 489923 T3538 C:collection1 S:shard1 oasc.ZkController.checkRecovery I am the leader, no recovery necessary
[junit4] 2> 489923 T3538 C:collection1 S:shard1 c:collection1 oasc.ZkController.publish publishing core=collection1 state=active collection=collection1
[junit4] 2> 489923 T3538 C:collection1 S:shard1 c:collection1 oasc.ZkController.publish numShards not found on descriptor - reading it from system property
[junit4] 2> 489924 T3506 oasc.DistributedQueue$LatchWatcher.process NodeChildrenChanged fired on path /overseer/queue state SyncConnected
[junit4] 2> 489925 T3507 oasc.Overseer$ClusterStateUpdater.run processMessage: queueSize: 1, message = {
[junit4] 2> "operation":"state",
[junit4] 2> "numShards":"1",
[junit4] 2> "state":"active",
[junit4] 2> "collection":"collection1",
[junit4] 2> "core_node_name":"core_node1",
[junit4] 2> "node_name":"127.0.0.1:50328_",
[junit4] 2> "core":"collection1",
[junit4] 2> "base_url":"http://127.0.0.1:50328",
[junit4] 2> "roles":null,
[junit4] 2> "shard":"shard1"} current state version: 5
[junit4] 2> 489926 T3507 oasco.ReplicaMutator.updateState Update state numShards=1 message={
[junit4] 2> "operation":"state",
[junit4] 2> "numShards":"1",
[junit4] 2> "state":"active",
[junit4] 2> "collection":"collection1",
[junit4] 2> "core_node_name":"core_node1",
[junit4] 2> "node_name":"127.0.0.1:50328_",
[junit4] 2> "core":"collection1",
[junit4] 2> "base_url":"http://127.0.0.1:50328",
[junit4] 2> "roles":null,
[junit4] 2> "shard":"shard1"}
[junit4] 2> 490027 T3533 oascc.ZkStateReader$2.process A cluster state change: WatchedEvent state:SyncConnected type:NodeDataChanged path:/clusterstate.json, has occurred - updating... (live nodes size: 2)
[junit4] 2> 490027 T3554 oascc.ZkStateReader$2.process A cluster state change: WatchedEvent state:SyncConnected type:NodeDataChanged path:/clusterstate.json, has occurred - updating... (live nodes size: 2)
[junit4] 2> 490027 T3518 oascc.ZkStateReader$2.process A cluster state change: WatchedEvent state:SyncConnected type:NodeDataChanged path:/clusterstate.json, has occurred - updating... (live nodes size: 2)
[junit4] 2> 490027 T3506 oascc.ZkStateReader$2.process A cluster state change: WatchedEvent state:SyncConnected type:NodeDataChanged path:/clusterstate.json, has occurred - updating... (live nodes size: 2)
[junit4] 2> 490849 T3480 oasc.ZkController.createEphemeralLiveNode Register node as live in ZooKeeper:/live_nodes/127.0.0.1:45200_
[junit4] 2> 490850 T3480 oascc.SolrZkClient.makePath makePath: /live_nodes/127.0.0.1:45200_
[junit4] 2> 490851 T3480 oasc.Overseer.close Overseer (id=null) closing
[junit4] 2> 490852 T3480 oasc.CorePropertiesLocator.discover Looking for core definitions underneath /home/jenkins/workspace/Lucene-Solr-5.1-Linux/solr/build/solr-core/test/J0/temp/solr.cloud.RecoveryAfterSoftCommitTest 7263C8E56603AAB3-001/shard-2-001/cores
[junit4] 2> 490853 T3480 oasc.CoreDescriptor.<init> CORE DESCRIPTOR: {name=collection1, shard=, coreNodeName=, collection=collection1, instanceDir=/home/jenkins/workspace/Lucene-Solr-5.1-Linux/solr/build/solr-core/test/J0/temp/solr.cloud.RecoveryAfterSoftCommitTest 7263C8E56603AAB3-001/shard-2-001/cores/collection1, dataDir=data/, absoluteInstDir=/home/jenkins/workspace/Lucene-Solr-5.1-Linux/solr/build/solr-core/test/J0/temp/solr.cloud.RecoveryAfterSoftCommitTest 7263C8E56603AAB3-001/shard-2-001/cores/collection1/, config=solrconfig.xml, schema=schema.xml, loadOnStartup=true, transient=false}
[junit4] 2> 490853 T3480 oasc.CorePropertiesLocator.discoverUnder Found core collection1 in /home/jenkins/workspace/Lucene-Solr-5.1-Linux/solr/build/solr-core/test/J0/temp/solr.cloud.RecoveryAfterSoftCommitTest 7263C8E56603AAB3-001/shard-2-001/cores/collection1/
[junit4] 2> 490853 T3480 oasc.CorePropertiesLocator.discover Found 1 core definitions
[junit4] 2> 490854 T3555 C:collection1 c:collection1 oasc.ZkController.publish publishing core=collection1 state=down collection=collection1
[junit4] 2> 490854 T3555 C:collection1 c:collection1 oasc.ZkController.publish numShards not found on descriptor - reading it from system property
[junit4] 2> 490855 T3555 C:collection1 c:collection1 oasc.ZkController.waitForCoreNodeName look for our core node name
[junit4] 2> 490855 T3506 oasc.DistributedQueue$LatchWatcher.process NodeChildrenChanged fired on path /overseer/queue state SyncConnected
[junit4] 2> 490855 T3507 oasc.Overseer$ClusterStateUpdater.run processMessage: queueSize: 1, message = {
[junit4] 2> "operation":"state",
[junit4] 2> "numShards":"1",
[junit4] 2> "state":"down",
[junit4] 2> "collection":"collection1",
[junit4] 2> "node_name":"127.0.0.1:45200_",
[junit4] 2> "core":"collection1",
[junit4] 2> "base_url":"http://127.0.0.1:45200",
[junit4] 2> "roles":null,
[junit4] 2> "shard":null} current state version: 6
[junit4] 2> 490856 T3507 oasco.ReplicaMutator.updateState Update state numShards=1 message={
[junit4] 2> "operation":"state",
[junit4] 2> "numShards":"1",
[junit4] 2> "state":"down",
[junit4] 2> "collection":"collection1",
[junit4] 2> "node_name":"127.0.0.1:45200_",
[junit4] 2> "core":"collection1",
[junit4] 2> "base_url":"http://127.0.0.1:45200",
[junit4] 2> "roles":null,
[junit4] 2> "shard":null}
[junit4] 2> 490856 T3507 oasco.ReplicaMutator.updateState Collection already exists with numShards=1
[junit4] 2> 490856 T3507 oasco.ReplicaMutator.updateState Assigning new node to shard shard=shard1
[junit4] 2> 490957 T3533 oascc.ZkStateReader$2.process A cluster state change: WatchedEvent state:SyncConnected type:NodeDataChanged path:/clusterstate.json, has occurred - updating... (live nodes size: 3)
[junit4] 2> 490957 T3554 oascc.ZkStateReader$2.process A cluster state change: WatchedEvent state:SyncConnected type:NodeDataChanged path:/clusterstate.json, has occurred - updating... (live nodes size: 3)
[junit4] 2> 490957 T3518 oascc.ZkStateReader$2.process A cluster state change: WatchedEvent state:SyncConnected type:NodeDataChanged path:/clusterstate.json, has occurred - updating... (live nodes size: 3)
[junit4] 2> 490957 T3506 oascc.ZkStateReader$2.process A cluster state change: WatchedEvent state:SyncConnected type:NodeDataChanged path:/clusterstate.json, has occurred - updating... (live nodes size: 3)
[junit4] 2> 491855 T3555 C:collection1 c:collection1 oasc.ZkController.waitForShardId waiting to find shard id in clusterstate for collection1
[junit4] 2> 491855 T3555 C:collection1 c:collection1 oasc.ZkController.createCollectionZkNode Check for collection zkNode:collection1
[junit4] 2> 491856 T3555 C:collection1 c:collection1 oasc.ZkController.createCollectionZkNode Collection zkNode exists
[junit4] 2> 491856 T3555 C:collection1 c:collection1 oascc.ZkStateReader.readConfigName Load collection config from:/collections/collection1
[junit4] 2> 491856 T3555 C:collection1 c:collection1 oascc.ZkStateReader.readConfigName path=/collections/collection1 configName=conf1 specified config exists in ZooKeeper
[junit4] 2> 491856 T3555 C:collection1 c:collection1 oasc.SolrResourceLoader.<init> new SolrResourceLoader for directory: '/home/jenkins/workspace/Lucene-Solr-5.1-Linux/solr/build/solr-core/test/J0/temp/solr.cloud.RecoveryAfterSoftCommitTest 7263C8E56603AAB3-001/shard-2-001/cores/collection1/'
[junit4] 2> 491864 T3555 C:collection1 c:collection1 oasc.ZkController.watchZKConfDir watch zkdir /configs/conf1
[junit4] 2> 491865 T3555 C:collection1 c:collection1 oasc.Config.<init> loaded config solrconfig.xml with version 0
[junit4] 2> 491869 T3555 C:collection1 c:collection1 oasc.SolrConfig.refreshRequestParams current version of requestparams : -1
[junit4] 2> 491876 T3555 C:collection1 c:collection1 oasc.SolrConfig.<init> Using Lucene MatchVersion: 5.1.0
[junit4] 2> 491892 T3555 C:collection1 c:collection1 oasc.SolrConfig.<init> Loaded SolrConfig: solrconfig.xml
[junit4] 2> 491893 T3555 C:collection1 c:collection1 oass.IndexSchema.readSchema Reading Solr Schema from /configs/conf1/schema.xml
[junit4] 2> 491897 T3555 C:collection1 c:collection1 oass.IndexSchema.readSchema [collection1] Schema name=test
[junit4] 2> 492094 T3555 C:collection1 c:collection1 oass.OpenExchangeRatesOrgProvider.init Initialized with rates=open-exchange-rates.json, refreshInterval=1440.
[junit4] 2> 492102 T3555 C:collection1 c:collection1 oass.IndexSchema.readSchema default search field in schema is text
[junit4] 2> 492104 T3555 C:collection1 c:collection1 oass.IndexSchema.readSchema unique key field: id
[junit4] 2> 492111 T3555 C:collection1 c:collection1 oass.FileExchangeRateProvider.reload Reloading exchange rates from file currency.xml
[junit4] 2> 492114 T3555 C:collection1 c:collection1 oass.FileExchangeRateProvider.reload Reloading exchange rates from file currency.xml
[junit4] 2> 492116 T3555 C:collection1 c:collection1 oass.OpenExchangeRatesOrgProvider.reload Reloading exchange rates from open-exchange-rates.json
[junit4] 2> 492116 T3555 C:collection1 c:collection1 oass.OpenExchangeRatesOrgProvider$OpenExchangeRates.<init> WARN Unknown key IMPORTANT NOTE
[junit4] 2> 492117 T3555 C:collection1 c:collection1 oass.OpenExchangeRatesOrgProvider$OpenExchangeRates.<init> WARN Expected key, got STRING
[junit4] 2> 492117 T3555 C:collection1 c:collection1 oass.OpenExchangeRatesOrgProvider.reload Reloading exchange rates from open-exchange-rates.json
[junit4] 2> 492117 T3555 C:collection1 c:collection1 oass.OpenExchangeRatesOrgProvider$OpenExchangeRates.<init> WARN Unknown key IMPORTANT NOTE
[junit4] 2> 492117 T3555 C:collection1 c:collection1 oass.OpenExchangeRatesOrgProvider$OpenExchangeRates.<init> WARN Expected key, got STRING
[junit4] 2> 492117 T3555 C:collection1 c:collection1 oasc.CoreContainer.create Creating SolrCore 'collection1' using configuration from collection collection1
[junit4] 2> 492118 T3555 C:collection1 c:collection1 oasc.SolrCore.initDirectoryFactory org.apache.solr.core.MockDirectoryFactory
[junit4] 2> 492118 T3555 C:collection1 c:collection1 oasc.SolrCore.<init> [collection1] Opening new SolrCore at /home/jenkins/workspace/Lucene-Solr-5.1-Linux/solr/build/solr-core/test/J0/temp/solr.cloud.RecoveryAfterSoftCommitTest 7263C8E56603AAB3-001/shard-2-001/cores/collection1/, dataDir=/home/jenkins/workspace/Lucene-Solr-5.1-Linux/solr/build/solr-core/test/J0/temp/solr.cloud.RecoveryAfterSoftCommitTest 7263C8E56603AAB3-001/shard-2-001/cores/collection1/data/
[junit4] 2> 492118 T3555 C:collection1 c:collection1 oasc.JmxMonitoredMap.<init> JMX monitoring is enabled. Adding Solr mbeans to JMX Server: com.sun.jmx.mbeanserver.JmxMBeanServer@1298ab34
[junit4] 2> 492119 T3555 C:collection1 c:collection1 oasc.CachingDirectoryFactory.get return new directory for /home/jenkins/workspace/Lucene-Solr-5.1-Linux/solr/build/solr-core/test/J0/temp/solr.cloud.RecoveryAfterSoftCommitTest 7263C8E56603AAB3-001/shard-2-001/cores/collection1/data
[junit4] 2> 492120 T3555 C:collection1 c:collection1 oasc.SolrCore.getNewIndexDir New index directory detected: old=null new=/home/jenkins/workspace/Lucene-Solr-5.1-Linux/solr/build/solr-core/test/J0/temp/solr.cloud.RecoveryAfterSoftCommitTest 7263C8E56603AAB3-001/shard-2-001/cores/collection1/data/index/
[junit4] 2> 492120 T3555 C:collection1 c:collection1 oasc.SolrCore.initIndex WARN [collection1] Solr index directory '/home/jenkins/workspace/Lucene-Solr-5.1-Linux/solr/build/solr-core/test/J0/temp/solr.cloud.RecoveryAfterSoftCommitTest 7263C8E56603AAB3-001/shard-2-001/cores/collection1/data/index' doesn't exist. Creating new index...
[junit4] 2> 492120 T3555 C:collection1 c:collection1 oasc.CachingDirectoryFactory.get return new directory for /home/jenkins/workspace/Lucene-Solr-5.1-Linux/solr/build/solr-core/test/J0/temp/solr.cloud.RecoveryAfterSoftCommitTest 7263C8E56603AAB3-001/shard-2-001/cores/collection1/data/index
[junit4] 2> 492120 T3555 C:collection1 c:collection1 oasu.RandomMergePolicy.<i
[...truncated too long message...]
Client$3$1.run(SolrZkClient.java:264)
[junit4] 2> at java.util.concurrent.Executors$RunnableAdapter.call(Executors.java:471)
[junit4] 2> at java.util.concurrent.FutureTask.run(FutureTask.java:262)
[junit4] 2> at java.util.concurrent.ThreadPoolExecutor.runWorker(ThreadPoolExecutor.java:1145)
[junit4] 2> at java.util.concurrent.ThreadPoolExecutor$Worker.run(ThreadPoolExecutor.java:615)
[junit4] 2> at java.lang.Thread.run(Thread.java:745)
[junit4] 2> Caused by: org.apache.zookeeper.KeeperException$SessionExpiredException: KeeperErrorCode = Session expired for /collections
[junit4] 2> at org.apache.zookeeper.KeeperException.create(KeeperException.java:127)
[junit4] 2> at org.apache.zookeeper.KeeperException.create(KeeperException.java:51)
[junit4] 2> at org.apache.zookeeper.ZooKeeper.exists(ZooKeeper.java:1045)
[junit4] 2> at org.apache.solr.common.cloud.SolrZkClient$4.execute(SolrZkClient.java:294)
[junit4] 2> at org.apache.solr.common.cloud.SolrZkClient$4.execute(SolrZkClient.java:291)
[junit4] 2> at org.apache.solr.common.cloud.ZkCmdExecutor.retryOperation(ZkCmdExecutor.java:61)
[junit4] 2> at org.apache.solr.common.cloud.SolrZkClient.exists(SolrZkClient.java:291)
[junit4] 2> at org.apache.solr.common.cloud.SolrZkClient.makePath(SolrZkClient.java:486)
[junit4] 2> at org.apache.solr.common.cloud.SolrZkClient.makePath(SolrZkClient.java:455)
[junit4] 2> at org.apache.solr.common.cloud.SolrZkClient.makePath(SolrZkClient.java:442)
[junit4] 2> at org.apache.solr.cloud.ShardLeaderElectionContextBase$1.execute(ElectionContext.java:146)
[junit4] 2> at org.apache.solr.common.util.RetryUtil.retryOnThrowable(RetryUtil.java:31)
[junit4] 2> at org.apache.solr.cloud.ShardLeaderElectionContextBase.runLeaderProcess(ElectionContext.java:142)
[junit4] 2> ... 11 more
[junit4] 2>
[junit4] 2> 541588 T3554 oascc.ZkStateReader$3.process WARN ZooKeeper watch triggered, but Solr cannot talk to ZK
[junit4] 2> 541619 T3480 C:control_collection S:shard1 c:collection1 oejsh.ContextHandler.doStop stopped o.e.j.s.ServletContextHandler{/,null}
[junit4] 2> 541810 T3480 C:control_collection S:shard1 c:collection1 oasc.ZkTestServer.send4LetterWord connecting to 127.0.0.1:48812 48812
[junit4] 2> 541829 T3481 oasc.ZkTestServer.send4LetterWord connecting to 127.0.0.1:48812 48812
[junit4] 2> 541830 T3481 oasc.ZkTestServer$ZKServerMain.runFromConfig WARN Watch limit violations:
[junit4] 2> Maximum concurrent create/delete watches above limit:
[junit4] 2>
[junit4] 2> 4 /solr/clusterstate.json
[junit4] 2> 4 /solr/aliases.json
[junit4] 2> 3 /solr/configs/conf1
[junit4] 2>
[junit4] 2> Maximum concurrent children watches above limit:
[junit4] 2>
[junit4] 2> 4 /solr/live_nodes
[junit4] 2> 3 /solr/overseer/queue
[junit4] 2> 3 /solr/overseer/collection-queue-work
[junit4] 2>
[junit4] 2> 541830 T3480 C:control_collection S:shard1 c:collection1 oasc.SocketProxy.close WARN Closing 1 connections to: http://127.0.0.1:45200/
[junit4] 2> 541830 T3480 C:control_collection S:shard1 c:collection1 oasc.SocketProxy.close WARN Closing 8 connections to: http://127.0.0.1:50328/
[junit4] 2> 541830 T3480 C:control_collection S:shard1 c:collection1 oasc.SocketProxy.close WARN Closing 0 connections to: http://127.0.0.1:40994/
[junit4] 2> NOTE: reproduce with: ant test -Dtestcase=RecoveryAfterSoftCommitTest -Dtests.method=test -Dtests.seed=7263C8E56603AAB3 -Dtests.multiplier=3 -Dtests.slow=true -Dtests.locale=sv -Dtests.timezone=BET -Dtests.asserts=true -Dtests.file.encoding=US-ASCII
[junit4] FAILURE 55.9s J0 | RecoveryAfterSoftCommitTest.test <<<
[junit4] > Throwable #1: java.lang.AssertionError: Didn't see all replicas for shard shard1 in collection1 come up within 30000 ms! ClusterState: {
[junit4] > "collection1":{
[junit4] > "shards":{"shard1":{
[junit4] > "range":"80000000-7fffffff",
[junit4] > "state":"active",
[junit4] > "replicas":{
[junit4] > "core_node1":{
[junit4] > "state":"active",
[junit4] > "node_name":"127.0.0.1:50328_",
[junit4] > "core":"collection1",
[junit4] > "base_url":"http://127.0.0.1:50328",
[junit4] > "leader":"true"},
[junit4] > "core_node2":{
[junit4] > "state":"recovering",
[junit4] > "node_name":"127.0.0.1:45200_",
[junit4] > "core":"collection1",
[junit4] > "base_url":"http://127.0.0.1:45200"}}}},
[junit4] > "autoAddReplicas":"false",
[junit4] > "replicationFactor":"1",
[junit4] > "router":{"name":"compositeId"},
[junit4] > "maxShardsPerNode":"1",
[junit4] > "autoCreated":"true"},
[junit4] > "control_collection":{
[junit4] > "shards":{"shard1":{
[junit4] > "range":"80000000-7fffffff",
[junit4] > "state":"active",
[junit4] > "replicas":{"core_node1":{
[junit4] > "state":"active",
[junit4] > "node_name":"127.0.0.1:40994_",
[junit4] > "core":"collection1",
[junit4] > "base_url":"http://127.0.0.1:40994",
[junit4] > "leader":"true"}}}},
[junit4] > "autoAddReplicas":"false",
[junit4] > "replicationFactor":"1",
[junit4] > "router":{"name":"compositeId"},
[junit4] > "maxShardsPerNode":"1",
[junit4] > "autoCreated":"true"}}
[junit4] > at __randomizedtesting.SeedInfo.seed([7263C8E56603AAB3:FA37F73FC8FFC74B]:0)
[junit4] > at org.apache.solr.cloud.AbstractFullDistribZkTestBase.ensureAllReplicasAreActive(AbstractFullDistribZkTestBase.java:1925)
[junit4] > at org.apache.solr.cloud.RecoveryAfterSoftCommitTest.test(RecoveryAfterSoftCommitTest.java:102)
[junit4] > at org.apache.solr.BaseDistributedSearchTestCase$ShardsRepeatRule$ShardsFixedStatement.callStatement(BaseDistributedSearchTestCase.java:960)
[junit4] > at org.apache.solr.BaseDistributedSearchTestCase$ShardsRepeatRule$ShardsStatement.evaluate(BaseDistributedSearchTestCase.java:935)
[junit4] > at java.lang.Thread.run(Thread.java:745)
[junit4] 2> 541841 T3480 C:control_collection S:shard1 c:collection1 oas.SolrTestCaseJ4.deleteCore ###deleteCore
[junit4] 2> NOTE: leaving temporary files on disk at: /home/jenkins/workspace/Lucene-Solr-5.1-Linux/solr/build/solr-core/test/J0/temp/solr.cloud.RecoveryAfterSoftCommitTest 7263C8E56603AAB3-001
[junit4] 2> 55929 T3479 ccr.ThreadLeakControl.checkThreadLeaks WARNING Will linger awaiting termination of 1 leaked thread(s).
[junit4] 2> NOTE: test params are: codec=Asserting(Lucene50): {text=PostingsFormat(name=MockRandom), _version_=Lucene50(blocksize=128), range_facet_l=Lucene50(blocksize=128), intDefault=Lucene50(blocksize=128), multiDefault=PostingsFormat(name=Asserting), a_t=Lucene50(blocksize=128), timestamp=Lucene50(blocksize=128), id=PostingsFormat(name=Memory doPackFST= false)}, docValues:{timestamp=DocValuesFormat(name=Direct)}, sim=RandomSimilarityProvider(queryNorm=false,coord=crazy): {}, locale=sv, timezone=BET
[junit4] 2> NOTE: Linux 3.13.0-46-generic amd64/Oracle Corporation 1.7.0_76 (64-bit)/cpus=12,threads=1,free=439292744,total=535822336
[junit4] 2> NOTE: All tests run in this JVM: [BasicZkTest, BJQParserTest, TestAnalyzeInfixSuggestions, TestRandomDVFaceting, TestBulkSchemaAPI, IndexBasedSpellCheckerTest, DocExpirationUpdateProcessorFactoryTest, RequestHandlersTest, TestRandomFaceting, TestDocumentBuilder, TestReqParamsAPI, ParsingFieldUpdateProcessorsTest, TestSolrQueryParserResource, TestLazyCores, TestRangeQuery, HdfsChaosMonkeySafeLeaderTest, UpdateRequestProcessorFactoryTest, TestSimpleTrackingShardHandler, CustomCollectionTest, TestSchemaNameResource, MultiTermTest, TestManagedSchema, OverseerStatusTest, SuggesterFSTTest, TestCodecSupport, ConnectionManagerTest, TestQuerySenderListener, TestSolr4Spatial, LeaderElectionIntegrationTest, TestFunctionQuery, TermsComponentTest, PeerSyncTest, TestMaxScoreQueryParser, TestConfigReload, TestCopyFieldCollectionResource, TestSolrConfigHandlerConcurrent, ChaosMonkeyNothingIsSafeTest, TestConfig, CoreAdminCreateDiscoverTest, RecoveryAfterSoftCommitTest]
[junit4] Completed on J0 in 56.95s, 1 test, 1 failure <<< FAILURES!
[...truncated 971 lines...]
BUILD FAILED
/home/jenkins/workspace/Lucene-Solr-5.1-Linux/build.xml:529: The following error occurred while executing this line:
/home/jenkins/workspace/Lucene-Solr-5.1-Linux/build.xml:477: The following error occurred while executing this line:
/home/jenkins/workspace/Lucene-Solr-5.1-Linux/build.xml:61: The following error occurred while executing this line:
/home/jenkins/workspace/Lucene-Solr-5.1-Linux/extra-targets.xml:39: The following error occurred while executing this line:
/home/jenkins/workspace/Lucene-Solr-5.1-Linux/solr/build.xml:191: The following error occurred while executing this line:
/home/jenkins/workspace/Lucene-Solr-5.1-Linux/solr/common-build.xml:509: The following error occurred while executing this line:
/home/jenkins/workspace/Lucene-Solr-5.1-Linux/lucene/common-build.xml:1370: The following error occurred while executing this line:
/home/jenkins/workspace/Lucene-Solr-5.1-Linux/lucene/common-build.xml:976: There were test failures: 478 suites, 1902 tests, 1 failure, 47 ignored (20 assumptions)
Total time: 46 minutes 2 seconds
Build step 'Invoke Ant' marked build as failure
[description-setter] Description set: Java: 64bit/jdk1.7.0_76 -XX:+UseCompressedOops -XX:+UseG1GC
Archiving artifacts
Recording test results
Email was triggered for: Failure - Any
Sending email for trigger: Failure - Any