You are viewing a plain text version of this content. The canonical link for it is here.
Posted to dev@jclouds.apache.org by je...@cloudbees.com on 2014/01/03 20:36:47 UTC
Build failed in Jenkins: jclouds-labs #396
See <https://jclouds.ci.cloudbees.com/job/jclouds-labs/396/>
------------------------------------------
[...truncated 2599 lines...]
INFO: jclouds CloudSigma v2 Zurich Provider ............. SKIPPED
Jan 3, 2014 2:36:35 PM org.apache.maven.cli.event.ExecutionEventLogger logReactorSummary
INFO: jclouds joyent-cloudapi api ....................... SKIPPED
Jan 3, 2014 2:36:35 PM org.apache.maven.cli.event.ExecutionEventLogger logReactorSummary
INFO: jclouds joyentcloud provider ...................... SKIPPED
Jan 3, 2014 2:36:35 PM org.apache.maven.cli.event.ExecutionEventLogger logReactorSummary
INFO: jclouds Fujitsu Global Cloud Platform ............. SKIPPED
Jan 3, 2014 2:36:35 PM org.apache.maven.cli.event.ExecutionEventLogger logReactorSummary
INFO: jclouds Fujitsu Global Cloud Platform AU provider . SKIPPED
Jan 3, 2014 2:36:35 PM org.apache.maven.cli.event.ExecutionEventLogger logReactorSummary
INFO: jclouds Fujitsu Global Cloud Platform DE provider . SKIPPED
Jan 3, 2014 2:36:35 PM org.apache.maven.cli.event.ExecutionEventLogger logReactorSummary
INFO: jclouds Abiquo api ................................ SKIPPED
Jan 3, 2014 2:36:35 PM org.apache.maven.cli.event.ExecutionEventLogger logReactorSummary
INFO: jclouds :: represetations ......................... SKIPPED
Jan 3, 2014 2:36:35 PM org.apache.maven.cli.event.ExecutionEventLogger logReactorSummary
INFO: jclouds :: representations :: core ................ SKIPPED
Jan 3, 2014 2:36:35 PM org.apache.maven.cli.event.ExecutionEventLogger logReactorSummary
INFO: jclouds :: representations :: codec ............... SKIPPED
Jan 3, 2014 2:36:35 PM org.apache.maven.cli.event.ExecutionEventLogger logReactorSummary
INFO: jclouds :: management ............................. SKIPPED
Jan 3, 2014 2:36:35 PM org.apache.maven.cli.event.ExecutionEventLogger logReactorSummary
INFO: jclouds :: management :: core ..................... SKIPPED
Jan 3, 2014 2:36:35 PM org.apache.maven.cli.event.ExecutionEventLogger logReactorSummary
INFO: jclouds :: management :: compute .................. SKIPPED
Jan 3, 2014 2:36:35 PM org.apache.maven.cli.event.ExecutionEventLogger logReactorSummary
INFO: jclouds :: management :: blobstore ................ SKIPPED
Jan 3, 2014 2:36:35 PM org.apache.maven.cli.event.ExecutionEventLogger logResult
INFO: ------------------------------------------------------------------------
Jan 3, 2014 2:36:35 PM org.apache.maven.cli.event.ExecutionEventLogger logResult
INFO: BUILD FAILURE
Jan 3, 2014 2:36:35 PM org.apache.maven.cli.event.ExecutionEventLogger logStats
INFO: ------------------------------------------------------------------------
Jan 3, 2014 2:36:35 PM org.apache.maven.cli.event.ExecutionEventLogger logStats
INFO: Total time: 3:59.770s
Jan 3, 2014 2:36:35 PM org.apache.maven.cli.event.ExecutionEventLogger logStats
INFO: Finished at: Fri Jan 03 14:36:35 EST 2014
[Unloading class GregorSamsa$2]
[Unloading class GregorSamsa$1]
[Unloading class GregorSamsa]
[Unloading class GregorSamsa$0]
Jan 3, 2014 2:36:36 PM org.apache.maven.cli.event.ExecutionEventLogger logStats
INFO: Final Memory: 27M/181M
Jan 3, 2014 2:36:36 PM org.apache.maven.cli.event.ExecutionEventLogger sessionEnded
INFO: ------------------------------------------------------------------------
[JENKINS] Archiving <https://jclouds.ci.cloudbees.com/job/jclouds-labs/ws/cloudsigma2-lvs/pom.xml> to /home/jclouds/hudson_home/jobs/jclouds-labs/modules/org.apache.jclouds.labs$cloudsigma2-lvs/builds/2014-01-03_19-32-23/archive/org.apache.jclouds.labs/cloudsigma2-lvs/1.8.0-SNAPSHOT/cloudsigma2-lvs-1.8.0-SNAPSHOT.pom
[JENKINS] Archiving <https://jclouds.ci.cloudbees.com/job/jclouds-labs/ws/cloudsigma2-zrh/pom.xml> to /home/jclouds/hudson_home/jobs/jclouds-labs/modules/org.apache.jclouds.labs$cloudsigma2-zrh/builds/2014-01-03_19-32-23/archive/org.apache.jclouds.labs/cloudsigma2-zrh/1.8.0-SNAPSHOT/cloudsigma2-zrh-1.8.0-SNAPSHOT.pom
[JENKINS] Archiving <https://jclouds.ci.cloudbees.com/job/jclouds-labs/ws/fgcp-au/pom.xml> to /home/jclouds/hudson_home/jobs/jclouds-labs/modules/org.apache.jclouds.labs$fgcp-au/builds/2014-01-03_19-32-23/archive/org.apache.jclouds.labs/fgcp-au/1.8.0-SNAPSHOT/fgcp-au-1.8.0-SNAPSHOT.pom
[JENKINS] Archiving <https://jclouds.ci.cloudbees.com/job/jclouds-labs/ws/abiquo/pom.xml> to /home/jclouds/hudson_home/jobs/jclouds-labs/modules/org.apache.jclouds.labs$abiquo/builds/2014-01-03_19-32-23/archive/org.apache.jclouds.labs/abiquo/1.8.0-SNAPSHOT/abiquo-1.8.0-SNAPSHOT.pom
[JENKINS] Archiving <https://jclouds.ci.cloudbees.com/job/jclouds-labs/ws/jclouds-management/management-compute/pom.xml> to /home/jclouds/hudson_home/jobs/jclouds-labs/modules/org.apache.jclouds.labs.management$management-compute/builds/2014-01-03_19-32-24/archive/org.apache.jclouds.labs.management/management-compute/1.8.0-SNAPSHOT/management-compute-1.8.0-SNAPSHOT.pom
[JENKINS] Archiving <https://jclouds.ci.cloudbees.com/job/jclouds-labs/ws/fgcp-de/pom.xml> to /home/jclouds/hudson_home/jobs/jclouds-labs/modules/org.apache.jclouds.labs$fgcp-de/builds/2014-01-03_19-32-23/archive/org.apache.jclouds.labs/fgcp-de/1.8.0-SNAPSHOT/fgcp-de-1.8.0-SNAPSHOT.pom
[JENKINS] Archiving <https://jclouds.ci.cloudbees.com/job/jclouds-labs/ws/dmtf/pom.xml> to /home/jclouds/hudson_home/jobs/jclouds-labs/modules/org.apache.jclouds.labs$dmtf/builds/2014-01-03_19-32-23/archive/org.apache.jclouds.labs/dmtf/1.8.0-SNAPSHOT/dmtf-1.8.0-SNAPSHOT.pom
[JENKINS] Archiving <https://jclouds.ci.cloudbees.com/job/jclouds-labs/ws/joyentcloud/pom.xml> to /home/jclouds/hudson_home/jobs/jclouds-labs/modules/org.apache.jclouds.labs$joyentcloud/builds/2014-01-03_19-32-23/archive/org.apache.jclouds.labs/joyentcloud/1.8.0-SNAPSHOT/joyentcloud-1.8.0-SNAPSHOT.pom
[JENKINS] Archiving <https://jclouds.ci.cloudbees.com/job/jclouds-labs/ws/jclouds-representations/pom.xml> to /home/jclouds/hudson_home/jobs/jclouds-labs/modules/org.apache.jclouds.labs$jclouds-represetations/builds/2014-01-03_19-32-23/archive/org.apache.jclouds.labs/jclouds-represetations/1.8.0-SNAPSHOT/jclouds-represetations-1.8.0-SNAPSHOT.pom
[JENKINS] Archiving <https://jclouds.ci.cloudbees.com/job/jclouds-labs/ws/jclouds-representations/representations-core/pom.xml> to /home/jclouds/hudson_home/jobs/jclouds-labs/modules/org.apache.jclouds.labs.representations$representations-core/builds/2014-01-03_19-32-23/archive/org.apache.jclouds.labs.representations/representations-core/1.8.0-SNAPSHOT/representations-core-1.8.0-SNAPSHOT.pom
[JENKINS] Archiving <https://jclouds.ci.cloudbees.com/job/jclouds-labs/ws/jclouds-management/management-core/pom.xml> to /home/jclouds/hudson_home/jobs/jclouds-labs/modules/org.apache.jclouds.labs.management$management-core/builds/2014-01-03_19-32-24/archive/org.apache.jclouds.labs.management/management-core/1.8.0-SNAPSHOT/management-core-1.8.0-SNAPSHOT.pom
[JENKINS] Archiving <https://jclouds.ci.cloudbees.com/job/jclouds-labs/ws/joyent-cloudapi/pom.xml> to /home/jclouds/hudson_home/jobs/jclouds-labs/modules/org.apache.jclouds.labs$joyent-cloudapi/builds/2014-01-03_19-32-23/archive/org.apache.jclouds.labs/joyent-cloudapi/1.8.0-SNAPSHOT/joyent-cloudapi-1.8.0-SNAPSHOT.pom
[JENKINS] Archiving <https://jclouds.ci.cloudbees.com/job/jclouds-labs/ws/fgcp/pom.xml> to /home/jclouds/hudson_home/jobs/jclouds-labs/modules/org.apache.jclouds.labs$fgcp/builds/2014-01-03_19-32-23/archive/org.apache.jclouds.labs/fgcp/1.8.0-SNAPSHOT/fgcp-1.8.0-SNAPSHOT.pom
[JENKINS] Archiving <https://jclouds.ci.cloudbees.com/job/jclouds-labs/ws/jclouds-management/pom.xml> to /home/jclouds/hudson_home/jobs/jclouds-labs/modules/org.apache.jclouds.labs$jclouds-management/builds/2014-01-03_19-32-24/archive/org.apache.jclouds.labs/jclouds-management/1.8.0-SNAPSHOT/jclouds-management-1.8.0-SNAPSHOT.pom
[JENKINS] Archiving <https://jclouds.ci.cloudbees.com/job/jclouds-labs/ws/cloudsigma2/pom.xml> to /home/jclouds/hudson_home/jobs/jclouds-labs/modules/org.apache.jclouds.labs$cloudsigma2/builds/2014-01-03_19-32-23/archive/org.apache.jclouds.labs/cloudsigma2/1.8.0-SNAPSHOT/cloudsigma2-1.8.0-SNAPSHOT.pom
[JENKINS] Archiving <https://jclouds.ci.cloudbees.com/job/jclouds-labs/ws/jclouds-management/management-blobstore/pom.xml> to /home/jclouds/hudson_home/jobs/jclouds-labs/modules/org.apache.jclouds.labs.management$management-blobstore/builds/2014-01-03_19-32-24/archive/org.apache.jclouds.labs.management/management-blobstore/1.8.0-SNAPSHOT/management-blobstore-1.8.0-SNAPSHOT.pom
[JENKINS] Archiving <https://jclouds.ci.cloudbees.com/job/jclouds-labs/ws/jclouds-representations/representations-codec/pom.xml> to /home/jclouds/hudson_home/jobs/jclouds-labs/modules/org.apache.jclouds.labs.representations$representations-codec/builds/2014-01-03_19-32-24/archive/org.apache.jclouds.labs.representations/representations-codec/1.8.0-SNAPSHOT/representations-codec-1.8.0-SNAPSHOT.pom
[JENKINS] Archiving <https://jclouds.ci.cloudbees.com/job/jclouds-labs/ws/virtualbox/pom.xml> to /home/jclouds/hudson_home/jobs/jclouds-labs/modules/org.apache.jclouds.labs$virtualbox/builds/2014-01-03_19-32-23/archive/org.apache.jclouds.labs/virtualbox/1.8.0-SNAPSHOT/virtualbox-1.8.0-SNAPSHOT.pom
[JENKINS] Archiving <https://jclouds.ci.cloudbees.com/job/jclouds-labs/ws/cdmi/pom.xml> to /home/jclouds/hudson_home/jobs/jclouds-labs/modules/org.apache.jclouds.labs$cdmi/builds/2014-01-03_19-32-23/archive/org.apache.jclouds.labs/cdmi/1.8.0-SNAPSHOT/cdmi-1.8.0-SNAPSHOT.pom
[JENKINS] Archiving <https://jclouds.ci.cloudbees.com/job/jclouds-labs/ws/vcloud-director/pom.xml> to /home/jclouds/hudson_home/jobs/jclouds-labs/modules/org.apache.jclouds.labs$vcloud-director/builds/2014-01-03_19-32-23/archive/org.apache.jclouds.labs/vcloud-director/1.8.0-SNAPSHOT/vcloud-director-1.8.0-SNAPSHOT.pom
[JENKINS] Archiving <https://jclouds.ci.cloudbees.com/job/jclouds-labs/ws/pom.xml> to /home/jclouds/hudson_home/jobs/jclouds-labs/modules/org.apache.jclouds.labs$jclouds-labs/builds/2014-01-03_19-32-23/archive/org.apache.jclouds.labs/jclouds-labs/1.8.0-SNAPSHOT/jclouds-labs-1.8.0-SNAPSHOT.pom
[JENKINS] Archiving <https://jclouds.ci.cloudbees.com/job/jclouds-labs/ws/target/jclouds-labs-1.8.0-SNAPSHOT-tests.jar> to /home/jclouds/hudson_home/jobs/jclouds-labs/modules/org.apache.jclouds.labs$jclouds-labs/builds/2014-01-03_19-32-23/archive/org.apache.jclouds.labs/jclouds-labs/1.8.0-SNAPSHOT/jclouds-labs-1.8.0-SNAPSHOT-tests.jar
Waiting for Jenkins to finish collecting data
mavenExecutionResult exceptions not empty
message : Failed to execute goal org.apache.maven.plugins:maven-javadoc-plugin:2.9:aggregate-jar (javadoc) on project jclouds-labs: MavenReportException: Error while creating archive: Could not transfer artifact org.apache.jclouds:jclouds-blobstore:jar:tests:1.8.0-20140103.183721-80 from/to apache-snapshots (https://repository.apache.org/content/repositories/snapshots): Error transferring file: Server returned HTTP response code: 503 for URL: https://repository.apache.org/content/repositories/snapshots/org/apache/jclouds/jclouds-blobstore/1.8.0-SNAPSHOT/jclouds-blobstore-1.8.0-20140103.183721-80-tests.jar
org.apache.jclouds:jclouds-blobstore:test-jar:1.8.0-SNAPSHOT
from the specified remote repositories:
central (http://repo.cloudbees.com/content/repositories/central, releases=true, snapshots=false),
cloudbees-private-snapshot-repository (https://repository-jclouds.forge.cloudbees.com/snapshot, releases=false, snapshots=true),
cloudbees-private-release-repository (https://repository-jclouds.forge.cloudbees.com/release, releases=true, snapshots=false),
apache-snapshots (https://repository.apache.org/content/repositories/snapshots, releases=false, snapshots=true),
sonatype-nexus-snapshots (https://oss.sonatype.org/content/repositories/snapshots, releases=false, snapshots=true),
apache.snapshots (http://repository.apache.org/snapshots, releases=false, snapshots=true)
Path to dependency:
1) org.apache.jclouds.labs:cdmi:bundle:1.8.0-SNAPSHOT
2) org.apache.jclouds:jclouds-blobstore:test-jar:tests:1.8.0-SNAPSHOT
cause : MavenReportException: Error while creating archive: Could not transfer artifact org.apache.jclouds:jclouds-blobstore:jar:tests:1.8.0-20140103.183721-80 from/to apache-snapshots (https://repository.apache.org/content/repositories/snapshots): Error transferring file: Server returned HTTP response code: 503 for URL: https://repository.apache.org/content/repositories/snapshots/org/apache/jclouds/jclouds-blobstore/1.8.0-SNAPSHOT/jclouds-blobstore-1.8.0-20140103.183721-80-tests.jar
org.apache.jclouds:jclouds-blobstore:test-jar:1.8.0-SNAPSHOT
from the specified remote repositories:
central (http://repo.cloudbees.com/content/repositories/central, releases=true, snapshots=false),
cloudbees-private-snapshot-repository (https://repository-jclouds.forge.cloudbees.com/snapshot, releases=false, snapshots=true),
cloudbees-private-release-repository (https://repository-jclouds.forge.cloudbees.com/release, releases=true, snapshots=false),
apache-snapshots (https://repository.apache.org/content/repositories/snapshots, releases=false, snapshots=true),
sonatype-nexus-snapshots (https://oss.sonatype.org/content/repositories/snapshots, releases=false, snapshots=true),
apache.snapshots (http://repository.apache.org/snapshots, releases=false, snapshots=true)
Path to dependency:
1) org.apache.jclouds.labs:cdmi:bundle:1.8.0-SNAPSHOT
2) org.apache.jclouds:jclouds-blobstore:test-jar:tests:1.8.0-SNAPSHOT
Stack trace :
org.apache.maven.lifecycle.LifecycleExecutionException: Failed to execute goal org.apache.maven.plugins:maven-javadoc-plugin:2.9:aggregate-jar (javadoc) on project jclouds-labs: MavenReportException: Error while creating archive: Could not transfer artifact org.apache.jclouds:jclouds-blobstore:jar:tests:1.8.0-20140103.183721-80 from/to apache-snapshots (https://repository.apache.org/content/repositories/snapshots): Error transferring file: Server returned HTTP response code: 503 for URL: https://repository.apache.org/content/repositories/snapshots/org/apache/jclouds/jclouds-blobstore/1.8.0-SNAPSHOT/jclouds-blobstore-1.8.0-20140103.183721-80-tests.jar
org.apache.jclouds:jclouds-blobstore:test-jar:1.8.0-SNAPSHOT
from the specified remote repositories:
central (http://repo.cloudbees.com/content/repositories/central, releases=true, snapshots=false),
cloudbees-private-snapshot-repository (https://repository-jclouds.forge.cloudbees.com/snapshot, releases=false, snapshots=true),
cloudbees-private-release-repository (https://repository-jclouds.forge.cloudbees.com/release, releases=true, snapshots=false),
apache-snapshots (https://repository.apache.org/content/repositories/snapshots, releases=false, snapshots=true),
sonatype-nexus-snapshots (https://oss.sonatype.org/content/repositories/snapshots, releases=false, snapshots=true),
apache.snapshots (http://repository.apache.org/snapshots, releases=false, snapshots=true)
Path to dependency:
1) org.apache.jclouds.labs:cdmi:bundle:1.8.0-SNAPSHOT
2) org.apache.jclouds:jclouds-blobstore:test-jar:tests:1.8.0-SNAPSHOT
at org.apache.maven.lifecycle.internal.MojoExecutor.execute(MojoExecutor.java:217)
at org.apache.maven.lifecycle.internal.MojoExecutor.execute(MojoExecutor.java:153)
at org.apache.maven.lifecycle.internal.MojoExecutor.execute(MojoExecutor.java:145)
at org.apache.maven.lifecycle.internal.LifecycleModuleBuilder.buildProject(LifecycleModuleBuilder.java:84)
at org.apache.maven.lifecycle.internal.LifecycleModuleBuilder.buildProject(LifecycleModuleBuilder.java:59)
at org.apache.maven.lifecycle.internal.LifecycleStarter.singleThreadedBuild(LifecycleStarter.java:183)
at org.apache.maven.lifecycle.internal.LifecycleStarter.execute(LifecycleStarter.java:161)
at org.apache.maven.DefaultMaven.doExecute(DefaultMaven.java:319)
at org.apache.maven.DefaultMaven.execute(DefaultMaven.java:156)
at org.jvnet.hudson.maven3.launcher.Maven3Launcher.main(Maven3Launcher.java:117)
at sun.reflect.NativeMethodAccessorImpl.invoke0(Native Method)
at sun.reflect.NativeMethodAccessorImpl.invoke(NativeMethodAccessorImpl.java:39)
at sun.reflect.DelegatingMethodAccessorImpl.invoke(DelegatingMethodAccessorImpl.java:25)
at java.lang.reflect.Method.invoke(Method.java:597)
at org.codehaus.plexus.classworlds.launcher.Launcher.launchStandard(Launcher.java:329)
at org.codehaus.plexus.classworlds.launcher.Launcher.launch(Launcher.java:239)
at org.jvnet.hudson.maven3.agent.Maven3Main.launch(Maven3Main.java:178)
at sun.reflect.NativeMethodAccessorImpl.invoke0(Native Method)
at sun.reflect.NativeMethodAccessorImpl.invoke(NativeMethodAccessorImpl.java:39)
at sun.reflect.DelegatingMethodAccessorImpl.invoke(DelegatingMethodAccessorImpl.java:25)
at java.lang.reflect.Method.invoke(Method.java:597)
at hudson.maven.Maven3Builder.call(Maven3Builder.java:129)
at hudson.maven.Maven3Builder.call(Maven3Builder.java:67)
at hudson.remoting.UserRequest.perform(UserRequest.java:118)
at hudson.remoting.UserRequest.perform(UserRequest.java:48)
at hudson.remoting.Request$2.run(Request.java:326)
at hudson.remoting.InterceptingExecutorService$1.call(InterceptingExecutorService.java:72)
at java.util.concurrent.FutureTask$Sync.innerRun(FutureTask.java:303)
at java.util.concurrent.FutureTask.run(FutureTask.java:138)
at java.util.concurrent.ThreadPoolExecutor$Worker.runTask(ThreadPoolExecutor.java:895)
at java.util.concurrent.ThreadPoolExecutor$Worker.run(ThreadPoolExecutor.java:918)
at java.lang.Thread.run(Thread.java:662)
Caused by: org.apache.maven.plugin.MojoExecutionException: MavenReportException: Error while creating archive: Could not transfer artifact org.apache.jclouds:jclouds-blobstore:jar:tests:1.8.0-20140103.183721-80 from/to apache-snapshots (https://repository.apache.org/content/repositories/snapshots): Error transferring file: Server returned HTTP response code: 503 for URL: https://repository.apache.org/content/repositories/snapshots/org/apache/jclouds/jclouds-blobstore/1.8.0-SNAPSHOT/jclouds-blobstore-1.8.0-20140103.183721-80-tests.jar
org.apache.jclouds:jclouds-blobstore:test-jar:1.8.0-SNAPSHOT
from the specified remote repositories:
central (http://repo.cloudbees.com/content/repositories/central, releases=true, snapshots=false),
cloudbees-private-snapshot-repository (https://repository-jclouds.forge.cloudbees.com/snapshot, releases=false, snapshots=true),
cloudbees-private-release-repository (https://repository-jclouds.forge.cloudbees.com/release, releases=true, snapshots=false),
apache-snapshots (https://repository.apache.org/content/repositories/snapshots, releases=false, snapshots=true),
sonatype-nexus-snapshots (https://oss.sonatype.org/content/repositories/snapshots, releases=false, snapshots=true),
apache.snapshots (http://repository.apache.org/snapshots, releases=false, snapshots=true)
Path to dependency:
1) org.apache.jclouds.labs:cdmi:bundle:1.8.0-SNAPSHOT
2) org.apache.jclouds:jclouds-blobstore:test-jar:tests:1.8.0-SNAPSHOT
at org.apache.maven.plugin.javadoc.AbstractJavadocMojo.failOnError(AbstractJavadocMojo.java:5826)
at org.apache.maven.plugin.javadoc.JavadocJar.execute(JavadocJar.java:209)
at org.apache.maven.plugin.DefaultBuildPluginManager.executeMojo(DefaultBuildPluginManager.java:101)
at org.apache.maven.lifecycle.internal.MojoExecutor.execute(MojoExecutor.java:209)
... 31 more
Caused by: org.apache.maven.reporting.MavenReportException: Could not transfer artifact org.apache.jclouds:jclouds-blobstore:jar:tests:1.8.0-20140103.183721-80 from/to apache-snapshots (https://repository.apache.org/content/repositories/snapshots): Error transferring file: Server returned HTTP response code: 503 for URL: https://repository.apache.org/content/repositories/snapshots/org/apache/jclouds/jclouds-blobstore/1.8.0-SNAPSHOT/jclouds-blobstore-1.8.0-20140103.183721-80-tests.jar
org.apache.jclouds:jclouds-blobstore:test-jar:1.8.0-SNAPSHOT
from the specified remote repositories:
central (http://repo.cloudbees.com/content/repositories/central, releases=true, snapshots=false),
cloudbees-private-snapshot-repository (https://repository-jclouds.forge.cloudbees.com/snapshot, releases=false, snapshots=true),
cloudbees-private-release-repository (https://repository-jclouds.forge.cloudbees.com/release, releases=true, snapshots=false),
apache-snapshots (https://repository.apache.org/content/repositories/snapshots, releases=false, snapshots=true),
sonatype-nexus-snapshots (https://oss.sonatype.org/content/repositories/snapshots, releases=false, snapshots=true),
apache.snapshots (http://repository.apache.org/snapshots, releases=false, snapshots=true)
Path to dependency:
1) org.apache.jclouds.labs:cdmi:bundle:1.8.0-SNAPSHOT
2) org.apache.jclouds:jclouds-blobstore:test-jar:tests:1.8.0-SNAPSHOT
at org.apache.maven.plugin.javadoc.AbstractJavadocMojo.getClasspath(AbstractJavadocMojo.java:2447)
at org.apache.maven.plugin.javadoc.AbstractJavadocMojo.addJavadocOptions(AbstractJavadocMojo.java:4536)
at org.apache.maven.plugin.javadoc.AbstractJavadocMojo.executeReport(AbstractJavadocMojo.java:1937)
at org.apache.maven.plugin.javadoc.JavadocJar.execute(JavadocJar.java:181)
... 33 more
Caused by: org.apache.maven.artifact.resolver.ArtifactResolutionException: Could not transfer artifact org.apache.jclouds:jclouds-blobstore:jar:tests:1.8.0-20140103.183721-80 from/to apache-snapshots (https://repository.apache.org/content/repositories/snapshots): Error transferring file: Server returned HTTP response code: 503 for URL: https://repository.apache.org/content/repositories/snapshots/org/apache/jclouds/jclouds-blobstore/1.8.0-SNAPSHOT/jclouds-blobstore-1.8.0-20140103.183721-80-tests.jar
org.apache.jclouds:jclouds-blobstore:test-jar:1.8.0-SNAPSHOT
from the specified remote repositories:
central (http://repo.cloudbees.com/content/repositories/central, releases=true, snapshots=false),
cloudbees-private-snapshot-repository (https://repository-jclouds.forge.cloudbees.com/snapshot, releases=false, snapshots=true),
cloudbees-private-release-repository (https://repository-jclouds.forge.cloudbees.com/release, releases=true, snapshots=false),
apache-snapshots (https://repository.apache.org/content/repositories/snapshots, releases=false, snapshots=true),
sonatype-nexus-snapshots (https://oss.sonatype.org/content/repositories/snapshots, releases=false, snapshots=true),
apache.snapshots (http://repository.apache.org/snapshots, releases=false, snapshots=true)
Path to dependency:
1) org.apache.jclouds.labs:cdmi:bundle:1.8.0-SNAPSHOT
2) org.apache.jclouds:jclouds-blobstore:test-jar:tests:1.8.0-SNAPSHOT
at org.apache.maven.artifact.resolver.DefaultArtifactResolver.resolve(DefaultArtifactResolver.java:223)
at org.apache.maven.artifact.resolver.DefaultArtifactResolver.access$000(DefaultArtifactResolver.java:69)
at org.apache.maven.artifact.resolver.DefaultArtifactResolver$ResolveTask.run(DefaultArtifactResolver.java:580)
... 3 more
Caused by: org.sonatype.aether.resolution.ArtifactResolutionException: Could not transfer artifact org.apache.jclouds:jclouds-blobstore:jar:tests:1.8.0-20140103.183721-80 from/to apache-snapshots (https://repository.apache.org/content/repositories/snapshots): Error transferring file: Server returned HTTP response code: 503 for URL: https://repository.apache.org/content/repositories/snapshots/org/apache/jclouds/jclouds-blobstore/1.8.0-SNAPSHOT/jclouds-blobstore-1.8.0-20140103.183721-80-tests.jar
at org.sonatype.aether.impl.internal.DefaultArtifactResolver.resolve(DefaultArtifactResolver.java:541)
at org.sonatype.aether.impl.internal.DefaultArtifactResolver.resolveArtifacts(DefaultArtifactResolver.java:220)
at org.sonatype.aether.impl.internal.DefaultArtifactResolver.resolveArtifact(DefaultArtifactResolver.java:197)
at org.sonatype.aether.impl.internal.DefaultRepositorySystem.resolveArtifact(DefaultRepositorySystem.java:323)
at org.apache.maven.artifact.resolver.DefaultArtifactResolver.resolve(DefaultArtifactResolver.java:213)
... 5 more
Caused by: org.sonatype.aether.transfer.ArtifactTransferException: Could not transfer artifact org.apache.jclouds:jclouds-blobstore:jar:tests:1.8.0-20140103.183721-80 from/to apache-snapshots (https://repository.apache.org/content/repositories/snapshots): Error transferring file: Server returned HTTP response code: 503 for URL: https://repository.apache.org/content/repositories/snapshots/org/apache/jclouds/jclouds-blobstore/1.8.0-SNAPSHOT/jclouds-blobstore-1.8.0-20140103.183721-80-tests.jar
at org.sonatype.aether.connector.wagon.WagonRepositoryConnector$4.wrap(WagonRepositoryConnector.java:949)
at org.sonatype.aether.connector.wagon.WagonRepositoryConnector$4.wrap(WagonRepositoryConnector.java:940)
at org.sonatype.aether.connector.wagon.WagonRepositoryConnector$GetTask.flush(WagonRepositoryConnector.java:695)
at org.sonatype.aether.connector.wagon.WagonRepositoryConnector$GetTask.flush(WagonRepositoryConnector.java:689)
at org.sonatype.aether.connector.wagon.WagonRepositoryConnector.get(WagonRepositoryConnector.java:445)
at org.sonatype.aether.impl.internal.DefaultArtifactResolver.resolve(DefaultArtifactResolver.java:460)
... 9 more
Caused by: org.apache.maven.wagon.TransferFailedException: Error transferring file: Server returned HTTP response code: 503 for URL: https://repository.apache.org/content/repositories/snapshots/org/apache/jclouds/jclouds-blobstore/1.8.0-SNAPSHOT/jclouds-blobstore-1.8.0-20140103.183721-80-tests.jar
at org.apache.maven.wagon.providers.http.LightweightHttpWagon.fillInputData(LightweightHttpWagon.java:143)
at org.apache.maven.wagon.StreamWagon.getInputStream(StreamWagon.java:116)
at org.apache.maven.wagon.StreamWagon.getIfNewer(StreamWagon.java:88)
at org.apache.maven.wagon.StreamWagon.get(StreamWagon.java:61)
at org.sonatype.aether.connector.wagon.WagonRepositoryConnector$GetTask.run(WagonRepositoryConnector.java:608)
at org.sonatype.aether.util.concurrency.RunnableErrorForwarder$1.run(RunnableErrorForwarder.java:64)
... 3 more
Caused by: java.io.IOException: Server returned HTTP response code: 503 for URL: https://repository.apache.org/content/repositories/snapshots/org/apache/jclouds/jclouds-blobstore/1.8.0-SNAPSHOT/jclouds-blobstore-1.8.0-20140103.183721-80-tests.jar
at sun.reflect.NativeConstructorAccessorImpl.newInstance0(Native Method)
at sun.reflect.NativeConstructorAccessorImpl.newInstance(NativeConstructorAccessorImpl.java:39)
at sun.reflect.DelegatingConstructorAccessorImpl.newInstance(DelegatingConstructorAccessorImpl.java:27)
at java.lang.reflect.Constructor.newInstance(Constructor.java:513)
at sun.net.www.protocol.http.HttpURLConnection$6.run(HttpURLConnection.java:1514)
at java.security.AccessController.doPrivileged(Native Method)
at sun.net.www.protocol.http.HttpURLConnection.getChainedException(HttpURLConnection.java:1508)
at sun.net.www.protocol.http.HttpURLConnection.getInputStream(HttpURLConnection.java:1162)
at sun.net.www.protocol.https.HttpsURLConnectionImpl.getInputStream(HttpsURLConnectionImpl.java:234)
at org.apache.maven.wagon.providers.http.LightweightHttpWagon.fillInputData(LightweightHttpWagon.java:122)
... 8 more
Caused by: java.io.IOException: Server returned HTTP response code: 503 for URL: https://repository.apache.org/content/repositories/snapshots/org/apache/jclouds/jclouds-blobstore/1.8.0-SNAPSHOT/jclouds-blobstore-1.8.0-20140103.183721-80-tests.jar
at sun.net.www.protocol.http.HttpURLConnection.getInputStream(HttpURLConnection.java:1459)
at java.net.HttpURLConnection.getResponseCode(HttpURLConnection.java:379)
at sun.net.www.protocol.https.HttpsURLConnectionImpl.getResponseCode(HttpsURLConnectionImpl.java:318)
at org.apache.maven.wagon.providers.http.LightweightHttpWagon.fillInputData(LightweightHttpWagon.java:115)
... 8 more
Sending e-mails to: dev@jclouds.apache.org
channel stopped
Jenkins build is back to normal : jclouds-labs #397
Posted by je...@cloudbees.com.
See <https://jclouds.ci.cloudbees.com/job/jclouds-labs/397/>