You are viewing a plain text version of this content. The canonical link for it is here.
Posted to builds@cassandra.apache.org by Apache Jenkins Server <je...@builds.apache.org> on 2025/04/11 10:15:40 UTC

Build complete: Cassandra-5.0 #439 [UNSTABLE] bcd5c483079f3c969c775200a218d90dfa418825

-------------------------------------------------------------------------------
  Build Cassandra-5.0 #439 Still unstable
  URL: https://ci-cassandra.apache.org/job/Cassandra-5.0/439/
  -------------------------------------------------------------------------------
  Changes:
  [Brandon Williams] correct CHANGES

[Jordan West] Fix test failure with negative position in


  -------------------------------------------------------------------------------
  Failed Tests:
  6 tests failed.
FAILED:  dtest-novnode.materialized_views_test.TestMaterializedViewsConsistency.Tests / dtest-novnode jdk17 27/64 / test_multi_partition_consistent_reads_after_write
FAILED:  dtest-upgrade-novnode.upgrade_tests.bootstrap_upgrade_test.TestBootstrapUpgrade.Tests / dtest-upgrade-novnode jdk11 28/128 / test_simultaneous_bootstrap
FAILED:  dtest-upgrade.upgrade_tests.bootstrap_upgrade_test.TestBootstrapUpgrade.Tests / dtest-upgrade jdk11 20/128 / test_decommissioned_wiped_node_can_join
FAILED:  dtest-upgrade.upgrade_tests.bootstrap_upgrade_test.TestBootstrapUpgrade.Tests / dtest-upgrade jdk11 18/128 / test_shutdown_wiped_node_cannot_join
FAILED:  org.apache.cassandra.db.commitlog.BatchCommitLogTest.Tests / test jdk11 7/16 / testBatchCLShutDownImmediately[1]-_jdk11_x86_64
FAILED:  org.apache.cassandra.db.commitlog.BatchCommitLogTest.Tests / test jdk11 7/16 / testBatchCLShutDownImmediately[3]-_jdk11_x86_64

  -------------------------------------------------------------------------------
  For complete test report and logs see https://nightlies.apache.org/cassandra/Cassandra-5.0/439/