You are viewing a plain text version of this content. The canonical link for it is here.
Posted to yarn-dev@hadoop.apache.org by Apache Jenkins Server <je...@builds.apache.org> on 2014/12/11 17:51:30 UTC

Failed: YARN-2912 PreCommit Build #6085

Jira: https://issues.apache.org/jira/browse/YARN-2912
Build: https://builds.apache.org/job/PreCommit-YARN-Build/6085/

###################################################################################
########################## LAST 60 LINES OF THE CONSOLE ###########################
[...truncated 4215 lines...]

    {color:green}+1 @author{color}.  The patch does not contain any @author tags.

    {color:green}+1 tests included{color}.  The patch appears to include 14 new or modified test files.

    {color:green}+1 javac{color}.  The applied patch does not increase the total number of javac compiler warnings.

    {color:green}+1 javadoc{color}.  There were no new javadoc warning messages.

    {color:green}+1 eclipse:eclipse{color}.  The patch built with eclipse:eclipse.

    {color:red}-1 findbugs{color}.  The patch appears to introduce 70 new Findbugs (version 2.0.3) warnings.

    {color:green}+1 release audit{color}.  The applied patch does not increase the total number of release audit warnings.

    {color:red}-1 core tests{color}.  The patch failed these unit tests in hadoop-yarn-project/hadoop-yarn/hadoop-yarn-common hadoop-yarn-project/hadoop-yarn/hadoop-yarn-server/hadoop-yarn-server-applicationhistoryservice hadoop-yarn-project/hadoop-yarn/hadoop-yarn-server/hadoop-yarn-server-nodemanager hadoop-yarn-project/hadoop-yarn/hadoop-yarn-server/hadoop-yarn-server-resourcemanager:

                  org.apache.hadoop.yarn.server.resourcemanager.TestWorkPreservingRMRestart

Test results: https://builds.apache.org/job/PreCommit-YARN-Build/6085//testReport/
Findbugs warnings: https://builds.apache.org/job/PreCommit-YARN-Build/6085//artifact/patchprocess/newPatchFindbugsWarningshadoop-yarn-common.html
Findbugs warnings: https://builds.apache.org/job/PreCommit-YARN-Build/6085//artifact/patchprocess/newPatchFindbugsWarningshadoop-yarn-server-applicationhistoryservice.html
Findbugs warnings: https://builds.apache.org/job/PreCommit-YARN-Build/6085//artifact/patchprocess/newPatchFindbugsWarningshadoop-yarn-server-nodemanager.html
Findbugs warnings: https://builds.apache.org/job/PreCommit-YARN-Build/6085//artifact/patchprocess/newPatchFindbugsWarningshadoop-yarn-server-resourcemanager.html
Console output: https://builds.apache.org/job/PreCommit-YARN-Build/6085//console

This message is automatically generated.


======================================================================
======================================================================
    Adding comment to Jira.
======================================================================
======================================================================


Comment added.
4f07c487ece3c394fb9335d67c187ae8965869a6 logged out


======================================================================
======================================================================
    Finished build.
======================================================================
======================================================================


Build step 'Execute shell' marked build as failure
Archiving artifacts
Sending artifact delta relative to PreCommit-YARN-Build #6051
Archived 30 artifacts
Archive block size is 32768
Received 40 blocks and 8431715 bytes
Compression is 13.5%
Took 2 sec
[description-setter] Could not determine description.
Recording test results
Email was triggered for: Failure
Sending email for trigger: Failure



###################################################################################
############################## FAILED TESTS (if any) ##############################
1 tests failed.
FAILED:  org.apache.hadoop.yarn.server.resourcemanager.TestWorkPreservingRMRestart.testReleasedContainerNotRecovered[1]

Error Message:
test timed out after 30000 milliseconds

Stack Trace:
java.lang.Exception: test timed out after 30000 milliseconds
	at java.net.Inet4AddressImpl.lookupAllHostAddr(Native Method)
	at java.net.InetAddress$1.lookupAllHostAddr(InetAddress.java:901)
	at java.net.InetAddress.getAddressesFromNameService(InetAddress.java:1293)
	at java.net.InetAddress.getAllByName0(InetAddress.java:1246)
	at java.net.InetAddress.getAllByName(InetAddress.java:1162)
	at java.net.InetAddress.getAllByName(InetAddress.java:1098)
	at java.net.InetAddress.getByName(InetAddress.java:1048)
	at org.apache.hadoop.net.NetUtils.normalizeHostName(NetUtils.java:562)
	at org.apache.hadoop.yarn.server.resourcemanager.NodesListManager.isValidNode(NodesListManager.java:147)
	at org.apache.hadoop.yarn.server.resourcemanager.ResourceTrackerService.registerNodeManager(ResourceTrackerService.java:276)
	at org.apache.hadoop.yarn.server.resourcemanager.MockNM.registerNode(MockNM.java:123)
	at org.apache.hadoop.yarn.server.resourcemanager.TestWorkPreservingRMRestart.testReleasedContainerNotRecovered(TestWorkPreservingRMRestart.java:869)



Failed: YARN-2943 PreCommit Build #6086

Posted by Apache Jenkins Server <je...@builds.apache.org>.
Jira: https://issues.apache.org/jira/browse/YARN-2943
Build: https://builds.apache.org/job/PreCommit-YARN-Build/6086/

###################################################################################
########################## LAST 60 LINES OF THE CONSOLE ###########################
[...truncated 3935 lines...]

    {color:green}+1 @author{color}.  The patch does not contain any @author tags.

    {color:green}+1 tests included{color}.  The patch appears to include 3 new or modified test files.

    {color:green}+1 javac{color}.  The applied patch does not increase the total number of javac compiler warnings.

    {color:green}+1 javadoc{color}.  There were no new javadoc warning messages.

    {color:green}+1 eclipse:eclipse{color}.  The patch built with eclipse:eclipse.

    {color:red}-1 findbugs{color}.  The patch appears to introduce 40 new Findbugs (version 2.0.3) warnings.

    {color:green}+1 release audit{color}.  The applied patch does not increase the total number of release audit warnings.

    {color:red}-1 core tests{color}.  The patch failed these unit tests in hadoop-yarn-project/hadoop-yarn/hadoop-yarn-common hadoop-yarn-project/hadoop-yarn/hadoop-yarn-server/hadoop-yarn-server-resourcemanager:

                  org.apache.hadoop.yarn.server.resourcemanager.TestRMRestart
                  org.apache.hadoop.yarn.server.resourcemanager.TestWorkPreservingRMRestart
                  org.apache.hadoop.yarn.server.resourcemanager.TestRM

Test results: https://builds.apache.org/job/PreCommit-YARN-Build/6086//testReport/
Findbugs warnings: https://builds.apache.org/job/PreCommit-YARN-Build/6086//artifact/patchprocess/newPatchFindbugsWarningshadoop-yarn-server-resourcemanager.html
Findbugs warnings: https://builds.apache.org/job/PreCommit-YARN-Build/6086//artifact/patchprocess/newPatchFindbugsWarningshadoop-yarn-common.html
Console output: https://builds.apache.org/job/PreCommit-YARN-Build/6086//console

This message is automatically generated.


======================================================================
======================================================================
    Adding comment to Jira.
======================================================================
======================================================================


Comment added.
0fe3d5313991e7068e63860469a4c8f08f63c804 logged out


======================================================================
======================================================================
    Finished build.
======================================================================
======================================================================


Build step 'Execute shell' marked build as failure
Archiving artifacts
Sending artifact delta relative to PreCommit-YARN-Build #6051
Archived 20 artifacts
Archive block size is 32768
Received 157 blocks and 4157802 bytes
Compression is 55.3%
Took 1.4 sec
[description-setter] Could not determine description.
Recording test results
Email was triggered for: Failure
Sending email for trigger: Failure



###################################################################################
############################## FAILED TESTS (if any) ##############################
3 tests failed.
REGRESSION:  org.apache.hadoop.yarn.server.resourcemanager.TestRM.testAppOnMultiNode[0]

Error Message:
test timed out after 30000 milliseconds

Stack Trace:
java.lang.Exception: test timed out after 30000 milliseconds
	at java.net.Inet4AddressImpl.lookupAllHostAddr(Native Method)
	at java.net.InetAddress$1.lookupAllHostAddr(InetAddress.java:901)
	at java.net.InetAddress.getAddressesFromNameService(InetAddress.java:1293)
	at java.net.InetAddress.getAllByName0(InetAddress.java:1246)
	at java.net.InetAddress.getAllByName(InetAddress.java:1162)
	at java.net.InetAddress.getAllByName(InetAddress.java:1098)
	at java.net.InetAddress.getByName(InetAddress.java:1048)
	at org.apache.hadoop.security.SecurityUtil$QualifiedHostResolver.getInetAddressByName(SecurityUtil.java:598)
	at org.apache.hadoop.security.SecurityUtil$QualifiedHostResolver.getByExactName(SecurityUtil.java:571)
	at org.apache.hadoop.security.SecurityUtil$QualifiedHostResolver.getByName(SecurityUtil.java:552)
	at org.apache.hadoop.security.SecurityUtil.getByName(SecurityUtil.java:464)
	at org.apache.hadoop.net.NetUtils.createSocketAddrForHost(NetUtils.java:236)
	at org.apache.hadoop.yarn.server.utils.BuilderUtils.newContainerToken(BuilderUtils.java:255)
	at org.apache.hadoop.yarn.server.resourcemanager.security.RMContainerTokenSecretManager.createContainerToken(RMContainerTokenSecretManager.java:220)
	at org.apache.hadoop.yarn.server.resourcemanager.scheduler.SchedulerApplicationAttempt.pullNewlyAllocatedContainersAndNMTokens(SchedulerApplicationAttempt.java:448)
	at org.apache.hadoop.yarn.server.resourcemanager.scheduler.common.fica.FiCaSchedulerApp.getAllocation(FiCaSchedulerApp.java:254)
	at org.apache.hadoop.yarn.server.resourcemanager.scheduler.capacity.CapacityScheduler.allocate(CapacityScheduler.java:890)
	at org.apache.hadoop.yarn.server.resourcemanager.ApplicationMasterService.allocate(ApplicationMasterService.java:529)
	at org.apache.hadoop.yarn.server.resourcemanager.MockAM$2.run(MockAM.java:220)
	at org.apache.hadoop.yarn.server.resourcemanager.MockAM$2.run(MockAM.java:217)
	at java.security.AccessController.doPrivileged(Native Method)
	at javax.security.auth.Subject.doAs(Subject.java:415)
	at org.apache.hadoop.security.UserGroupInformation.doAs(UserGroupInformation.java:1669)
	at org.apache.hadoop.yarn.server.resourcemanager.MockAM.allocate(MockAM.java:217)
	at org.apache.hadoop.yarn.server.resourcemanager.TestRM.testAppOnMultiNode(TestRM.java:174)


REGRESSION:  org.apache.hadoop.yarn.server.resourcemanager.TestRMRestart.testRMRestartGetApplicationList[1]

Error Message:

rMAppManager.logApplicationSummary(
    isA(org.apache.hadoop.yarn.api.records.ApplicationId)
);
Wanted 3 times:
-> at org.apache.hadoop.yarn.server.resourcemanager.TestRMRestart.testRMRestartGetApplicationList(TestRMRestart.java:961)
But was 2 times:
-> at org.apache.hadoop.yarn.server.resourcemanager.RMAppManager.handle(RMAppManager.java:66)


Stack Trace:
org.mockito.exceptions.verification.TooLittleActualInvocations: 
rMAppManager.logApplicationSummary(
    isA(org.apache.hadoop.yarn.api.records.ApplicationId)
);
Wanted 3 times:
-> at org.apache.hadoop.yarn.server.resourcemanager.TestRMRestart.testRMRestartGetApplicationList(TestRMRestart.java:961)
But was 2 times:
-> at org.apache.hadoop.yarn.server.resourcemanager.RMAppManager.handle(RMAppManager.java:66)

	at org.apache.hadoop.yarn.server.resourcemanager.TestRMRestart.testRMRestartGetApplicationList(TestRMRestart.java:961)


REGRESSION:  org.apache.hadoop.yarn.server.resourcemanager.TestWorkPreservingRMRestart.testReleasedContainerNotRecovered[0]

Error Message:
test timed out after 30000 milliseconds

Stack Trace:
java.lang.Exception: test timed out after 30000 milliseconds
	at java.lang.Thread.sleep(Native Method)
	at org.apache.hadoop.test.GenericTestUtils.waitFor(GenericTestUtils.java:120)
	at org.apache.hadoop.yarn.server.resourcemanager.TestWorkPreservingRMRestart.testReleasedContainerNotRecovered(TestWorkPreservingRMRestart.java:889)