You are viewing a plain text version of this content. The canonical link for it is here.
Posted to builds@beam.apache.org by Apache Jenkins Server <je...@builds.apache.org> on 2023/09/06 22:58:18 UTC
Build failed in Jenkins: beam_PostCommit_XVR_Flink #7317
See <https://ci-beam.apache.org/job/beam_PostCommit_XVR_Flink/7317/display/redirect>
Changes:
------------------------------------------
[...truncated 1.33 MB...]
spec: <
urn: "beam:coders:javasdk:0.1"
payload: "\202SNAPPY\000\000\000\000\001\000\000\000\001\000\000\000\312\214\002\360^\254\355\000\005sr\000,org.apache.beam.sdk.coders.SerializableCoder\010\364 \216\305ynl\002\000\001L\000\004typet\000\021Ljava/lang/Class;xr\000&ofV\000\024Custom\005P8j\260\010\235\013;\035\013\002\000\000xr\000 j\213\000\005/\034C\335\325\211\256\274~\370\001/\020pvr\000;N1\000Pio.BoundedReadFromUnb\t\021`Source$Shardd\236\240U\205\000j\363\002\000\000xp"
>
>
>
coders: <
key: "bkRqNZcSLOTimestampedValueCoder"
value: <
spec: <
urn: "beam:coders:javasdk:0.1"
payload: "\202SNAPPY\000\000\000\000\001\000\000\000\001\000\000\001?\315\003\270\254\355\000\005sr\000Aorg.apache.beam.sdk.values.TimestampedV\001\022\000$>\021\000LCoder\364\376\202p\274iX-\002\000\001L\000\nv\001)\005\030\034t\000\"Lorg/\t]\000/\001],/sdk/coders/\005$\020;xr\000*N\202\000\t%(.Structured\005/8s\277\022\016\325\3246\021\002\000\000xr\000 j9\000\005/\034C\335\325\211\256\274~\370\001/\020psr\000,j1\000(Serializabl\t\277\034\010\364 \216\305ynl\005\327\\\004typet\000\021Ljava/lang/Class\001\300\000&jV\000\024Custom\005\215Pj\260\010\235\013;\035\013\002\000\000xq\000~\000\003vr\000;N;\000Pio.BoundedReadFromUnb\t\021`Source$Shardd\236\240U\205\000j\363\002\000\000xp"
>
>
>
coders: <
key: "bkRqNZcSLOValueWithRecordIdCoder"
value: <
spec: <
urn: "beam:coders:javasdk:0.1"
payload: "\202SNAPPY\000\000\000\000\001\000\000\000\001\000\000\001\213\311\005\320\254\355\000\005sr\000Corg.apache.beam.sdk.values.ValueWithRecordId$B\022\000LCoder{\343\376bQ\014\204>\002\000\002L\000\007i\t\025\034t\000+Lorg/\t\\\000/\001\\\024/sdk/c\0012(s/ByteArray\005B\014;L\000\n\005u\005\016\010t\000\"n;\000\005$\020;xr\000*N\274\000\t`(.Structured\005/8s\277\022\016\325\3246\021\002\000\000xr\000 j9\000\005/\034C\335\325\211\256\274~\370\001/\020psr\000)j1\0006\312\000\034\351\277\005|\263\3746\333\001:\010r\000&j8\000\024Atomic\005o\034\307\354\265\314\205tPF\0015 q\000~\000\003sr\000-N;\000$io.kafka.K\001\006\000R%\227\005B<I\320\251Y\032\341{#\002\000\001L\000\007kv\005\025\010t\000$nH\001\000K\t&\000;\025s\000\"Ns\000-P\r- j\000\275\271\035\243\3126\002!\353\010\010ke)\277\001\264\000\0022\303\001\005\022\025Y\000(jY\000\030Nullabl)\372\034E\333\0336>\220\247\007\005\307]\022.O\000\001\014,\006sq\000~\000\016q\000~\000\020"
>
>
>
coders: <
key: "bkRqNZcSLOVarIntCoder"
value: <
spec: <
urn: "beam:coders:javasdk:0.1"
payload: "\202SNAPPY\000\000\000\000\001\000\000\000\001\000\000\000\210\330\001\350\254\355\000\005sr\000&org.apache.beam.sdk.coders.VarIntCoder\300K2\332\251KVh\002\000\000xrr5\000\024Atomic\0055 \307\354\265\314\205tPF\002\0055\000*jj\000$Structured\0059\034s\277\022\016\325\3246\021\t9\000 j9\000\005/0C\335\325\211\256\274~\370\002\000\000xp"
>
>
>
coders: <
key: "c0"
value: <
spec: <
urn: "beam:coder:bytes:v1"
>
>
>
coders: <
key: "c1"
value: <
spec: <
urn: "beam:coder:global_window:v1"
>
>
>
coders: <
key: "c2"
value: <
spec: <
urn: "beam:go:coder:custom:v1"
payload: "Cgd2YXJpbnR6EgIIAhpdCklnaXRodWIuY29tL2FwYWNoZS9iZWFtL3Nka3MvdjIvZ28vcGtnL2JlYW0vY29yZS9ydW50aW1lL2NvZGVyeC5lbmNWYXJJbnRaEhAIFiIECBlADyoGCBQSAggIImkKSWdpdGh1Yi5jb20vYXBhY2hlL2JlYW0vc2Rrcy92Mi9nby9wa2cvYmVhbS9jb3JlL3J1bnRpbWUvY29kZXJ4LmRlY1ZhckludFoSHAgWIgQIGUADIgYIFBICCAgqBAgZQA8qBAgZQAE="
>
>
>
coders: <
key: "c3"
value: <
spec: <
urn: "beam:coder:length_prefix:v1"
>
component_coder_ids: "c2"
>
>
coders: <
key: "c4"
value: <
spec: <
urn: "beam:coder:kv:v1"
>
component_coder_ids: "c0"
component_coder_ids: "c0"
>
>
environments: <
key: "bkRqNZcSLObeam:env:docker:v1"
value: <
urn: "beam:env:docker:v1"
payload: "\n apache/beam_java8_sdk:2.51.0.dev"
capabilities: "beam:coder:bytes:v1"
capabilities: "beam:coder:bool:v1"
capabilities: "beam:coder:varint:v1"
capabilities: "beam:coder:string_utf8:v1"
capabilities: "beam:coder:iterable:v1"
capabilities: "beam:coder:timer:v1"
capabilities: "beam:coder:kv:v1"
capabilities: "beam:coder:length_prefix:v1"
capabilities: "beam:coder:global_window:v1"
capabilities: "beam:coder:interval_window:v1"
capabilities: "beam:coder:custom_window:v1"
capabilities: "beam:coder:windowed_value:v1"
capabilities: "beam:coder:double:v1"
capabilities: "beam:coder:row:v1"
capabilities: "beam:coder:param_windowed_value:v1"
capabilities: "beam:coder:state_backed_iterable:v1"
capabilities: "beam:coder:sharded_key:v1"
capabilities: "beam:coder:nullable:v1"
capabilities: "beam:protocol:multi_core_bundle_processing:v1"
capabilities: "beam:protocol:progress_reporting:v1"
capabilities: "beam:protocol:harness_monitoring_infos:v1"
capabilities: "beam:protocol:control_request_elements_embedding:v1"
capabilities: "beam:protocol:state_caching:v1"
capabilities: "beam:version:sdk_base:apache/beam_java8_sdk:2.51.0.dev"
capabilities: "beam:transform:sdf_truncate_sized_restrictions:v1"
capabilities: "beam:transform:to_string:v1"
capabilities: "beam:protocol:data_sampling:v1"
dependencies: <
type_urn: "beam:artifact:type:file:v1"
type_payload: "\nL/tmp/artifacts/icedtea-sound-uoIQCGhMffp0D_gc1dkBtXBGXr18Bkb5Qx-e-CvP00s.jar\022@ba821008684c7dfa740ff81cd5d901b570465ebd7c0646f9431f9ef82bcfd34b"
role_urn: "beam:artifact:role:staging_to:v1"
role_payload: "\n=icedtea-sound-uoIQCGhMffp0D_gc1dkBtXBGXr18Bkb5Qx-e-CvP00s.jar"
>
dependencies: <
type_urn: "beam:artifact:type:file:v1"
type_payload: "\nF/tmp/artifacts/jaccess-T1qVdaqZDj2uNq1tdHEk1lwFMYQiwMhYa0jqGU9fUMg.jar\022@4f5a9575aa990e3dae36ad6d747124d65c05318422c0c8586b48ea194f5f50c8"
role_urn: "beam:artifact:role:staging_to:v1"
role_payload: "\n7jaccess-T1qVdaqZDj2uNq1tdHEk1lwFMYQiwMhYa0jqGU9fUMg.jar"
>
dependencies: <
type_urn: "beam:artifact:type:file:v1"
type_payload: "\nI/tmp/artifacts/localedata-dQT9YOGvbd1zEqcZsyJ1W4l8jNhxoX3b1nmMhdIbCb8.jar\022@7504fd60e1af6ddd7312a719b322755b897c8cd871a17ddbd6798c85d21b09bf"
role_urn: "beam:artifact:role:staging_to:v1"
role_payload: "\n:localedata-dQT9YOGvbd1zEqcZsyJ1W4l8jNhxoX3b1nmMhdIbCb8.jar"
>
dependencies: <
type_urn: "beam:artifact:type:file:v1"
type_payload: "\nF/tmp/artifacts/nashorn-gZxbPAWCb1KP7OCbxUu1prmT4YMEDX-mGdJFjkB3pfs.jar\022@819c5b3c05826f528fece09bc54bb5a6b993e183040d7fa619d2458e4077a5fb"
role_urn: "beam:artifact:role:staging_to:v1"
role_payload: "\n7nashorn-gZxbPAWCb1KP7OCbxUu1prmT4YMEDX-mGdJFjkB3pfs.jar"
>
dependencies: <
type_urn: "beam:artifact:type:file:v1"
type_payload: "\nG/tmp/artifacts/cldrdata-_GVjPlS0invvNh7wlTfv_CNVOxTj3Y-xvSW1Xw2r_-4.jar\022@fc65633e54b48a7bef361ef09537effc23553b14e3dd8fb1bd25b55f0dabffee"
role_urn: "beam:artifact:role:staging_to:v1"
role_payload: "\n8cldrdata-_GVjPlS0invvNh7wlTfv_CNVOxTj3Y-xvSW1Xw2r_-4.jar"
>
dependencies: <
type_urn: "beam:artifact:type:file:v1"
type_payload: "\nD/tmp/artifacts/dnsns-lI-xDSEZtu3C8A4-qt_7RcyP_ql7OU0LNZreNR5piTU.jar\022@948fb10d2119b6edc2f00e3eaadffb45cc8ffea97b394d0b359ade351e698935"
role_urn: "beam:artifact:role:staging_to:v1"
role_payload: "\n5dnsns-lI-xDSEZtu3C8A4-qt_7RcyP_ql7OU0LNZreNR5piTU.jar"
>
dependencies: <
type_urn: "beam:artifact:type:file:v1"
type_payload: "\n{/tmp/artifacts/beam-sdks-java-io-expansion-service-2.51.0-SNAPSHOT-SNAPSHOT-sdh9-LGyXe7Y5ESN6d3v1sPzLCQDF20pqUAepDIiTig.jar\022@b1d87df8b1b25deed8e4448de9ddefd6c3f32c2403176d29a9401ea432224e28"
role_urn: "beam:artifact:role:staging_to:v1"
role_payload: "\nlbeam-sdks-java-io-expansion-service-2.51.0-SNAPSHOT-SNAPSHOT-sdh9-LGyXe7Y5ESN6d3v1sPzLCQDF20pqUAepDIiTig.jar"
>
>
>
environments: <
key: "go"
value: <
urn: "beam:env:docker:v1"
payload: "\n\026apache/beam_go_sdk:dev"
capabilities: "beam:protocol:progress_reporting:v1"
capabilities: "beam:protocol:multi_core_bundle_processing:v1"
capabilities: "beam:transform:sdf_truncate_sized_restrictions:v1"
capabilities: "beam:protocol:worker_status:v1"
capabilities: "beam:protocol:monitoring_info_short_ids:v1"
capabilities: "beam:version:sdk_base:go:apache/beam_go_sdk:2.51.0.dev"
capabilities: "beam:coder:bytes:v1"
capabilities: "beam:coder:bool:v1"
capabilities: "beam:coder:varint:v1"
capabilities: "beam:coder:double:v1"
capabilities: "beam:coder:string_utf8:v1"
capabilities: "beam:coder:length_prefix:v1"
capabilities: "beam:coder:kv:v1"
capabilities: "beam:coder:iterable:v1"
capabilities: "beam:coder:state_backed_iterable:v1"
capabilities: "beam:coder:windowed_value:v1"
capabilities: "beam:coder:global_window:v1"
capabilities: "beam:coder:interval_window:v1"
capabilities: "beam:coder:row:v1"
capabilities: "beam:coder:nullable:v1"
capabilities: "beam:coder:timer:v1"
dependencies: <
type_urn: "beam:artifact:type:file:v1"
role_urn: "beam:artifact:role:go_worker_binary:v1"
>
>
>
>
root_transform_ids: "s1"
root_transform_ids: "e4"
root_transform_ids: "e5"
root_transform_ids: "s3"
2023/09/06 22:35:59 Cross-compiling <https://ci-beam.apache.org/job/beam_PostCommit_XVR_Flink/ws/src/sdks/go/test/integration/io/xlang/kafka/kafka_test.go> with GOOS=linux GOARCH=amd64 CGO_ENABLED=0 as /tmp/worker-2-1694039759944165326
2023/09/06 22:36:02 Prepared job with id: go-testkafkaio_basicreadwrite-813_e1229b13-9e0e-473d-85be-76290efefd1b and staging token: go-testkafkaio_basicreadwrite-813_e1229b13-9e0e-473d-85be-76290efefd1b
2023/09/06 22:36:03 Staged binary artifact with token:
2023/09/06 22:36:03 Submitted job: go0testkafkaio0basicreadwrite0813-jenkins-0906223603-85ea9922_a8d0abbc-3c6b-495b-98df-99aadac230e8
2023/09/06 22:36:03 Job[go0testkafkaio0basicreadwrite0813-jenkins-0906223603-85ea9922_a8d0abbc-3c6b-495b-98df-99aadac230e8] state: STOPPED
2023/09/06 22:36:03 Job[go0testkafkaio0basicreadwrite0813-jenkins-0906223603-85ea9922_a8d0abbc-3c6b-495b-98df-99aadac230e8] state: STARTING
2023/09/06 22:36:03 Job[go0testkafkaio0basicreadwrite0813-jenkins-0906223603-85ea9922_a8d0abbc-3c6b-495b-98df-99aadac230e8] state: RUNNING
2023/09/06 22:36:24 Job[go0testkafkaio0basicreadwrite0813-jenkins-0906223603-85ea9922_a8d0abbc-3c6b-495b-98df-99aadac230e8] state: DONE
--- PASS: TestKafkaIO_BasicReadWrite (46.86s)
PASS
ok github.com/apache/beam/sdks/v2/go/test/integration/io/xlang/kafka 52.914s
> Task :runners:flink:1.15:job-server:validatesCrossLanguageRunnerJavaUsingPython
INFO:root:No image given, using default Python SDK image
INFO:root:Python SDK container image set to "apache/beam_python3.8_sdk:2.50.0" for Docker environment
INFO:__main__:Listening for expansion requests at 41071
INFO:root:Missing pipeline option (runner). Executing pipeline using the default runner: DirectRunner.
INFO:__main__:Shutting down expansion service.
INFO:apache_beam.runners.portability.stager:Executing command: ['/home/jenkins/.apache_beam/cache/venvs/py-3.8-beam-2.50.0-743bdccef67087512a7a190820e727aab7bdcb14/bin/python', '-m', 'pip', 'download', '--dest', '/tmp/dataflow-requirements-cache', '-r', '/tmp/tmpo5b8yu3b/tmp_requirements.txt', '--exists-action', 'i', '--no-deps', '--implementation', 'cp', '--abi', 'cp38', '--platform', 'manylinux2014_x86_64']
INFO:root:No image given, using default Python SDK image
INFO:root:Python SDK container image set to "apache/beam_python3.8_sdk:2.50.0" for Docker environment
INFO:__main__:Listening for expansion requests at 36685
INFO:root:Missing pipeline option (runner). Executing pipeline using the default runner: DirectRunner.
INFO:__main__:Shutting down expansion service.
> Task :runners:flink:1.15:job-server:validatesCrossLanguageRunnerPythonUsingJava
> Task :runners:flink:1.15:job-server:validatesCrossLanguageRunnerPythonUsingSql FAILED
> Task :runners:flink:1.15:job-server:flinkJobServerCleanup
> Task :runners:flink:1.15:job-server:validatesCrossLanguageRunnerCleanup
FAILURE: Build failed with an exception.
* What went wrong:
Execution failed for task ':runners:flink:1.15:job-server:validatesCrossLanguageRunnerPythonUsingSql'.
> Process 'command 'sh'' finished with non-zero exit value 1
* Try:
> Run with --stacktrace option to get the stack trace.
> Run with --info or --debug option to get more log output.
* Get more help at https://help.gradle.org
Deprecated Gradle features were used in this build, making it incompatible with Gradle 8.0.
You can use '--warning-mode all' to show the individual deprecation warnings and determine if they come from your own scripts or plugins.
See https://docs.gradle.org/7.6.2/userguide/command_line_interface.html#sec:command_line_warnings
Execution optimizations have been disabled for 1 invalid unit(s) of work during this build to ensure correctness.
Please consult deprecation warnings for more details.
BUILD FAILED in 39m 49s
281 actionable tasks: 185 executed, 84 from cache, 12 up-to-date
Publishing build scan...
https://ge.apache.org/s/mpg4f5jt5zd34
Build step 'Invoke Gradle script' changed build result to FAILURE
Build step 'Invoke Gradle script' marked build as failure
---------------------------------------------------------------------
To unsubscribe, e-mail: builds-unsubscribe@beam.apache.org
For additional commands, e-mail: builds-help@beam.apache.org
Jenkins build is back to normal : beam_PostCommit_XVR_Flink #7321
Posted by Apache Jenkins Server <je...@builds.apache.org>.
See <https://ci-beam.apache.org/job/beam_PostCommit_XVR_Flink/7321/display/redirect>
---------------------------------------------------------------------
To unsubscribe, e-mail: builds-unsubscribe@beam.apache.org
For additional commands, e-mail: builds-help@beam.apache.org
Build failed in Jenkins: beam_PostCommit_XVR_Flink #7320
Posted by Apache Jenkins Server <je...@builds.apache.org>.
See <https://ci-beam.apache.org/job/beam_PostCommit_XVR_Flink/7320/display/redirect?page=changes>
Changes:
[noreply] Allow users to pass inference args into vertex ai model handler (#28354)
------------------------------------------
[...truncated 1.42 MB...]
elif '.dev' in version:
# TODO: Attempt to use nightly snapshots?
> raise RuntimeError(
(
'%s not found. '
'Please build the server with \n cd %s; ./gradlew %s') %
(local_path, os.path.abspath(project_root), gradle_target))
E RuntimeError: <https://ci-beam.apache.org/job/beam_PostCommit_XVR_Flink/ws/src/sdks/java/extensions/sql/expansion-service/build/libs/beam-sdks-java-extensions-sql-expansion-service-2.51.0-SNAPSHOT.jar> not found. Please build the server with
E cd <https://ci-beam.apache.org/job/beam_PostCommit_XVR_Flink/ws/src;> ./gradlew :sdks:java:extensions:sql:expansion-service:shadowJar
apache_beam/utils/subprocess_server.py:243: RuntimeError
__________________ SqlTransformTest.test_windowing_before_sql __________________
self = <apache_beam.transforms.sql_test.SqlTransformTest testMethod=test_windowing_before_sql>
def test_windowing_before_sql(self):
with TestPipeline() as p:
out = (
p | beam.Create([
SimpleRow(5, "foo", 1.),
SimpleRow(15, "bar", 2.),
SimpleRow(25, "baz", 3.)
])
| beam.Map(lambda v: beam.window.TimestampedValue(v, v.id)).
with_output_types(SimpleRow)
| beam.WindowInto(
beam.window.FixedWindows(10)).with_output_types(SimpleRow)
> | SqlTransform("SELECT COUNT(*) as `count` FROM PCOLLECTION"))
apache_beam/transforms/sql_test.py:174:
_ _ _ _ _ _ _ _ _ _ _ _ _ _ _ _ _ _ _ _ _ _ _ _ _ _ _ _ _ _ _ _ _ _ _ _ _ _ _ _
apache_beam/transforms/sql.py:86: in __init__
expansion_service = expansion_service or BeamJarExpansionService(
apache_beam/transforms/external.py:983: in __init__
path_to_jar = subprocess_server.JavaJarServer.path_to_beam_jar(
_ _ _ _ _ _ _ _ _ _ _ _ _ _ _ _ _ _ _ _ _ _ _ _ _ _ _ _ _ _ _ _ _ _ _ _ _ _ _ _
cls = <class 'apache_beam.utils.subprocess_server.JavaJarServer'>
gradle_target = ':sdks:java:extensions:sql:expansion-service:shadowJar'
appendix = None, version = '2.51.0.dev'
artifact_id = 'beam-sdks-java-extensions-sql-expansion-service'
@classmethod
def path_to_beam_jar(
cls,
gradle_target,
appendix=None,
version=beam_version,
artifact_id=None):
if gradle_target in cls._BEAM_SERVICES.replacements:
return cls._BEAM_SERVICES.replacements[gradle_target]
gradle_package = gradle_target.strip(':').rsplit(':', 1)[0]
if not artifact_id:
artifact_id = 'beam-' + gradle_package.replace(':', '-')
project_root = os.path.sep.join(
os.path.abspath(__file__).split(os.path.sep)[:-5])
local_path = os.path.join(
project_root,
gradle_package.replace(':', os.path.sep),
'build',
'libs',
cls.jar_name(
artifact_id,
version.replace('.dev', ''),
classifier='SNAPSHOT',
appendix=appendix))
if os.path.exists(local_path):
_LOGGER.info('Using pre-built snapshot at %s', local_path)
return local_path
elif '.dev' in version:
# TODO: Attempt to use nightly snapshots?
> raise RuntimeError(
(
'%s not found. '
'Please build the server with \n cd %s; ./gradlew %s') %
(local_path, os.path.abspath(project_root), gradle_target))
E RuntimeError: <https://ci-beam.apache.org/job/beam_PostCommit_XVR_Flink/ws/src/sdks/java/extensions/sql/expansion-service/build/libs/beam-sdks-java-extensions-sql-expansion-service-2.51.0-SNAPSHOT.jar> not found. Please build the server with
E cd <https://ci-beam.apache.org/job/beam_PostCommit_XVR_Flink/ws/src;> ./gradlew :sdks:java:extensions:sql:expansion-service:shadowJar
apache_beam/utils/subprocess_server.py:243: RuntimeError
_________________ SqlTransformTest.test_zetasql_generate_data __________________
self = <apache_beam.transforms.sql_test.SqlTransformTest testMethod=test_zetasql_generate_data>
def test_zetasql_generate_data(self):
with TestPipeline() as p:
> out = p | SqlTransform(
"""SELECT
CAST(1 AS INT64) AS `int`,
CAST('foo' AS STRING) AS `str`,
CAST(3.14 AS FLOAT64) AS `flt`""",
dialect="zetasql")
apache_beam/transforms/sql_test.py:154:
_ _ _ _ _ _ _ _ _ _ _ _ _ _ _ _ _ _ _ _ _ _ _ _ _ _ _ _ _ _ _ _ _ _ _ _ _ _ _ _
apache_beam/transforms/sql.py:86: in __init__
expansion_service = expansion_service or BeamJarExpansionService(
apache_beam/transforms/external.py:983: in __init__
path_to_jar = subprocess_server.JavaJarServer.path_to_beam_jar(
_ _ _ _ _ _ _ _ _ _ _ _ _ _ _ _ _ _ _ _ _ _ _ _ _ _ _ _ _ _ _ _ _ _ _ _ _ _ _ _
cls = <class 'apache_beam.utils.subprocess_server.JavaJarServer'>
gradle_target = ':sdks:java:extensions:sql:expansion-service:shadowJar'
appendix = None, version = '2.51.0.dev'
artifact_id = 'beam-sdks-java-extensions-sql-expansion-service'
@classmethod
def path_to_beam_jar(
cls,
gradle_target,
appendix=None,
version=beam_version,
artifact_id=None):
if gradle_target in cls._BEAM_SERVICES.replacements:
return cls._BEAM_SERVICES.replacements[gradle_target]
gradle_package = gradle_target.strip(':').rsplit(':', 1)[0]
if not artifact_id:
artifact_id = 'beam-' + gradle_package.replace(':', '-')
project_root = os.path.sep.join(
os.path.abspath(__file__).split(os.path.sep)[:-5])
local_path = os.path.join(
project_root,
gradle_package.replace(':', os.path.sep),
'build',
'libs',
cls.jar_name(
artifact_id,
version.replace('.dev', ''),
classifier='SNAPSHOT',
appendix=appendix))
if os.path.exists(local_path):
_LOGGER.info('Using pre-built snapshot at %s', local_path)
return local_path
elif '.dev' in version:
# TODO: Attempt to use nightly snapshots?
> raise RuntimeError(
(
'%s not found. '
'Please build the server with \n cd %s; ./gradlew %s') %
(local_path, os.path.abspath(project_root), gradle_target))
E RuntimeError: <https://ci-beam.apache.org/job/beam_PostCommit_XVR_Flink/ws/src/sdks/java/extensions/sql/expansion-service/build/libs/beam-sdks-java-extensions-sql-expansion-service-2.51.0-SNAPSHOT.jar> not found. Please build the server with
E cd <https://ci-beam.apache.org/job/beam_PostCommit_XVR_Flink/ws/src;> ./gradlew :sdks:java:extensions:sql:expansion-service:shadowJar
apache_beam/utils/subprocess_server.py:243: RuntimeError
=============================== warnings summary ===============================
../../build/gradleenv/1922375555/lib/python3.8/site-packages/hdfs/config.py:28
<https://ci-beam.apache.org/job/beam_PostCommit_XVR_Flink/ws/src/build/gradleenv/1922375555/lib/python3.8/site-packages/hdfs/config.py>:28: DeprecationWarning: the imp module is deprecated in favour of importlib; see the module's documentation for alternative uses
from imp import load_source
../../build/gradleenv/1922375555/lib/python3.8/site-packages/google/rpc/__init__.py:18
<https://ci-beam.apache.org/job/beam_PostCommit_XVR_Flink/ws/src/build/gradleenv/1922375555/lib/python3.8/site-packages/google/rpc/__init__.py>:18: DeprecationWarning: pkg_resources is deprecated as an API. See https://setuptools.pypa.io/en/latest/pkg_resources.html
import pkg_resources
../../build/gradleenv/1922375555/lib/python3.8/site-packages/pkg_resources/__init__.py:2871: 19 warnings
<https://ci-beam.apache.org/job/beam_PostCommit_XVR_Flink/ws/src/build/gradleenv/1922375555/lib/python3.8/site-packages/pkg_resources/__init__.py>:2871: DeprecationWarning: Deprecated call to `pkg_resources.declare_namespace('google')`.
Implementing implicit namespace packages (as specified in PEP 420) is preferred to `pkg_resources.declare_namespace`. See https://setuptools.pypa.io/en/latest/references/keywords.html#keyword-namespace-packages
declare_namespace(pkg)
../../build/gradleenv/1922375555/lib/python3.8/site-packages/pkg_resources/__init__.py:2871: 16 warnings
<https://ci-beam.apache.org/job/beam_PostCommit_XVR_Flink/ws/src/build/gradleenv/1922375555/lib/python3.8/site-packages/pkg_resources/__init__.py>:2871: DeprecationWarning: Deprecated call to `pkg_resources.declare_namespace('google.cloud')`.
Implementing implicit namespace packages (as specified in PEP 420) is preferred to `pkg_resources.declare_namespace`. See https://setuptools.pypa.io/en/latest/references/keywords.html#keyword-namespace-packages
declare_namespace(pkg)
../../build/gradleenv/1922375555/lib/python3.8/site-packages/pkg_resources/__init__.py:2350
../../build/gradleenv/1922375555/lib/python3.8/site-packages/pkg_resources/__init__.py:2350
../../build/gradleenv/1922375555/lib/python3.8/site-packages/pkg_resources/__init__.py:2350
../../build/gradleenv/1922375555/lib/python3.8/site-packages/pkg_resources/__init__.py:2350
<https://ci-beam.apache.org/job/beam_PostCommit_XVR_Flink/ws/src/build/gradleenv/1922375555/lib/python3.8/site-packages/pkg_resources/__init__.py>:2350: DeprecationWarning: Deprecated call to `pkg_resources.declare_namespace('google')`.
Implementing implicit namespace packages (as specified in PEP 420) is preferred to `pkg_resources.declare_namespace`. See https://setuptools.pypa.io/en/latest/references/keywords.html#keyword-namespace-packages
declare_namespace(parent)
../../build/gradleenv/1922375555/lib/python3.8/site-packages/pkg_resources/__init__.py:2871
<https://ci-beam.apache.org/job/beam_PostCommit_XVR_Flink/ws/src/build/gradleenv/1922375555/lib/python3.8/site-packages/pkg_resources/__init__.py>:2871: DeprecationWarning: Deprecated call to `pkg_resources.declare_namespace('google.logging')`.
Implementing implicit namespace packages (as specified in PEP 420) is preferred to `pkg_resources.declare_namespace`. See https://setuptools.pypa.io/en/latest/references/keywords.html#keyword-namespace-packages
declare_namespace(pkg)
../../build/gradleenv/1922375555/lib/python3.8/site-packages/pkg_resources/__init__.py:2871
<https://ci-beam.apache.org/job/beam_PostCommit_XVR_Flink/ws/src/build/gradleenv/1922375555/lib/python3.8/site-packages/pkg_resources/__init__.py>:2871: DeprecationWarning: Deprecated call to `pkg_resources.declare_namespace('google.iam')`.
Implementing implicit namespace packages (as specified in PEP 420) is preferred to `pkg_resources.declare_namespace`. See https://setuptools.pypa.io/en/latest/references/keywords.html#keyword-namespace-packages
declare_namespace(pkg)
../../build/gradleenv/1922375555/lib/python3.8/site-packages/google/rpc/__init__.py:20
<https://ci-beam.apache.org/job/beam_PostCommit_XVR_Flink/ws/src/build/gradleenv/1922375555/lib/python3.8/site-packages/google/rpc/__init__.py>:20: DeprecationWarning: Deprecated call to `pkg_resources.declare_namespace('google.rpc')`.
Implementing implicit namespace packages (as specified in PEP 420) is preferred to `pkg_resources.declare_namespace`. See https://setuptools.pypa.io/en/latest/references/keywords.html#keyword-namespace-packages
pkg_resources.declare_namespace(__name__)
-- Docs: https://docs.pytest.org/en/stable/how-to/capture-warnings.html
- generated xml file: <https://ci-beam.apache.org/job/beam_PostCommit_XVR_Flink/ws/src/sdks/python/pytest_xlangSqlValidateRunner.xml> -
=========================== short test summary info ============================
FAILED apache_beam/transforms/sql_test.py::SqlTransformTest::test_agg - RuntimeError: <https://ci-beam.apache.org/job/beam_PostCommit_XVR_Flink/ws/src/sdks/java/extensions/sql/expansion-service/build/libs/beam-sdks-java-extensions-sql-expansion-service-2.51.0-SNAPSHOT.jar> not found. Please build the server with
cd <https://ci-beam.apache.org/job/beam_PostCommit_XVR_Flink/ws/src;> ./gradlew :sdks:java:extensions:sql:expansion-service:shadowJar
FAILED apache_beam/transforms/sql_test.py::SqlTransformTest::test_filter - RuntimeError: <https://ci-beam.apache.org/job/beam_PostCommit_XVR_Flink/ws/src/sdks/java/extensions/sql/expansion-service/build/libs/beam-sdks-java-extensions-sql-expansion-service-2.51.0-SNAPSHOT.jar> not found. Please build the server with
cd <https://ci-beam.apache.org/job/beam_PostCommit_XVR_Flink/ws/src;> ./gradlew :sdks:java:extensions:sql:expansion-service:shadowJar
FAILED apache_beam/transforms/sql_test.py::SqlTransformTest::test_generate_data - RuntimeError: <https://ci-beam.apache.org/job/beam_PostCommit_XVR_Flink/ws/src/sdks/java/extensions/sql/expansion-service/build/libs/beam-sdks-java-extensions-sql-expansion-service-2.51.0-SNAPSHOT.jar> not found. Please build the server with
cd <https://ci-beam.apache.org/job/beam_PostCommit_XVR_Flink/ws/src;> ./gradlew :sdks:java:extensions:sql:expansion-service:shadowJar
FAILED apache_beam/transforms/sql_test.py::SqlTransformTest::test_map - RuntimeError: <https://ci-beam.apache.org/job/beam_PostCommit_XVR_Flink/ws/src/sdks/java/extensions/sql/expansion-service/build/libs/beam-sdks-java-extensions-sql-expansion-service-2.51.0-SNAPSHOT.jar> not found. Please build the server with
cd <https://ci-beam.apache.org/job/beam_PostCommit_XVR_Flink/ws/src;> ./gradlew :sdks:java:extensions:sql:expansion-service:shadowJar
FAILED apache_beam/transforms/sql_test.py::SqlTransformTest::test_project - RuntimeError: <https://ci-beam.apache.org/job/beam_PostCommit_XVR_Flink/ws/src/sdks/java/extensions/sql/expansion-service/build/libs/beam-sdks-java-extensions-sql-expansion-service-2.51.0-SNAPSHOT.jar> not found. Please build the server with
cd <https://ci-beam.apache.org/job/beam_PostCommit_XVR_Flink/ws/src;> ./gradlew :sdks:java:extensions:sql:expansion-service:shadowJar
FAILED apache_beam/transforms/sql_test.py::SqlTransformTest::test_row - RuntimeError: <https://ci-beam.apache.org/job/beam_PostCommit_XVR_Flink/ws/src/sdks/java/extensions/sql/expansion-service/build/libs/beam-sdks-java-extensions-sql-expansion-service-2.51.0-SNAPSHOT.jar> not found. Please build the server with
cd <https://ci-beam.apache.org/job/beam_PostCommit_XVR_Flink/ws/src;> ./gradlew :sdks:java:extensions:sql:expansion-service:shadowJar
FAILED apache_beam/transforms/sql_test.py::SqlTransformTest::test_tagged_join - RuntimeError: <https://ci-beam.apache.org/job/beam_PostCommit_XVR_Flink/ws/src/sdks/java/extensions/sql/expansion-service/build/libs/beam-sdks-java-extensions-sql-expansion-service-2.51.0-SNAPSHOT.jar> not found. Please build the server with
cd <https://ci-beam.apache.org/job/beam_PostCommit_XVR_Flink/ws/src;> ./gradlew :sdks:java:extensions:sql:expansion-service:shadowJar
FAILED apache_beam/transforms/sql_test.py::SqlTransformTest::test_windowing_before_sql - RuntimeError: <https://ci-beam.apache.org/job/beam_PostCommit_XVR_Flink/ws/src/sdks/java/extensions/sql/expansion-service/build/libs/beam-sdks-java-extensions-sql-expansion-service-2.51.0-SNAPSHOT.jar> not found. Please build the server with
cd <https://ci-beam.apache.org/job/beam_PostCommit_XVR_Flink/ws/src;> ./gradlew :sdks:java:extensions:sql:expansion-service:shadowJar
FAILED apache_beam/transforms/sql_test.py::SqlTransformTest::test_zetasql_generate_data - RuntimeError: <https://ci-beam.apache.org/job/beam_PostCommit_XVR_Flink/ws/src/sdks/java/extensions/sql/expansion-service/build/libs/beam-sdks-java-extensions-sql-expansion-service-2.51.0-SNAPSHOT.jar> not found. Please build the server with
cd <https://ci-beam.apache.org/job/beam_PostCommit_XVR_Flink/ws/src;> ./gradlew :sdks:java:extensions:sql:expansion-service:shadowJar
========= 9 failed, 17 skipped, 7154 deselected, 44 warnings in 8.19s ==========
> Task :runners:flink:1.15:job-server:validatesCrossLanguageRunnerPythonUsingSql FAILED
> Task :runners:flink:1.15:job-server:flinkJobServerCleanup
Stopping job server pid: 246913.
> Task :runners:flink:1.15:job-server:validatesCrossLanguageRunnerCleanup
Stopping expansion service pid: 248281.
Stopping expansion service pid: 248282.
FAILURE: Build failed with an exception.
* What went wrong:
Execution failed for task ':runners:flink:1.15:job-server:validatesCrossLanguageRunnerPythonUsingSql'.
> Process 'command 'sh'' finished with non-zero exit value 1
* Try:
> Run with --stacktrace option to get the stack trace.
> Run with --info or --debug option to get more log output.
* Get more help at https://help.gradle.org
Deprecated Gradle features were used in this build, making it incompatible with Gradle 8.0.
You can use '--warning-mode all' to show the individual deprecation warnings and determine if they come from your own scripts or plugins.
See https://docs.gradle.org/7.6.2/userguide/command_line_interface.html#sec:command_line_warnings
Execution optimizations have been disabled for 1 invalid unit(s) of work during this build to ensure correctness.
Please consult deprecation warnings for more details.
BUILD FAILED in 39m 4s
281 actionable tasks: 189 executed, 80 from cache, 12 up-to-date
Publishing build scan...
https://ge.apache.org/s/adhnrc44nbxca
Build step 'Invoke Gradle script' changed build result to FAILURE
Build step 'Invoke Gradle script' marked build as failure
---------------------------------------------------------------------
To unsubscribe, e-mail: builds-unsubscribe@beam.apache.org
For additional commands, e-mail: builds-help@beam.apache.org
Build failed in Jenkins: beam_PostCommit_XVR_Flink #7319
Posted by Apache Jenkins Server <je...@builds.apache.org>.
See <https://ci-beam.apache.org/job/beam_PostCommit_XVR_Flink/7319/display/redirect>
Changes:
------------------------------------------
[...truncated 1.37 MB...]
>
coders: <
key: "hXpBWnbCByKvCoder1"
value: <
spec: <
urn: "beam:coder:kv:v1"
>
component_coder_ids: "hXpBWnbCByVarIntCoder"
component_coder_ids: "hXpBWnbCBySerializableCoder"
>
>
coders: <
key: "hXpBWnbCByKvCoder2"
value: <
spec: <
urn: "beam:coder:kv:v1"
>
component_coder_ids: "hXpBWnbCByVarIntCoder"
component_coder_ids: "hXpBWnbCByTimestampedValueCoder"
>
>
coders: <
key: "hXpBWnbCByKvCoder3"
value: <
spec: <
urn: "beam:coder:kv:v1"
>
component_coder_ids: "hXpBWnbCByVarIntCoder"
component_coder_ids: "hXpBWnbCByIterableCoder"
>
>
coders: <
key: "hXpBWnbCByNullableCoder"
value: <
spec: <
urn: "beam:coder:nullable:v1"
>
component_coder_ids: "hXpBWnbCByByteArrayCoder"
>
>
coders: <
key: "hXpBWnbCBySerializableCoder"
value: <
spec: <
urn: "beam:coders:javasdk:0.1"
payload: "\202SNAPPY\000\000\000\000\001\000\000\000\001\000\000\000\312\214\002\360^\254\355\000\005sr\000,org.apache.beam.sdk.coders.SerializableCoder\010\364 \216\305ynl\002\000\001L\000\004typet\000\021Ljava/lang/Class;xr\000&ofV\000\024Custom\005P8j\260\010\235\013;\035\013\002\000\000xr\000 j\213\000\005/\034C\335\325\211\256\274~\370\001/\020pvr\000;N1\000Pio.BoundedReadFromUnb\t\021`Source$Shardd\236\240U\205\000j\363\002\000\000xp"
>
>
>
coders: <
key: "hXpBWnbCByTimestampedValueCoder"
value: <
spec: <
urn: "beam:coders:javasdk:0.1"
payload: "\202SNAPPY\000\000\000\000\001\000\000\000\001\000\000\001?\315\003\270\254\355\000\005sr\000Aorg.apache.beam.sdk.values.TimestampedV\001\022\000$>\021\000LCoder\364\376\202p\274iX-\002\000\001L\000\nv\001)\005\030\034t\000\"Lorg/\t]\000/\001],/sdk/coders/\005$\020;xr\000*N\202\000\t%(.Structured\005/8s\277\022\016\325\3246\021\002\000\000xr\000 j9\000\005/\034C\335\325\211\256\274~\370\001/\020psr\000,j1\000(Serializabl\t\277\034\010\364 \216\305ynl\005\327\\\004typet\000\021Ljava/lang/Class\001\300\000&jV\000\024Custom\005\215Pj\260\010\235\013;\035\013\002\000\000xq\000~\000\003vr\000;N;\000Pio.BoundedReadFromUnb\t\021`Source$Shardd\236\240U\205\000j\363\002\000\000xp"
>
>
>
coders: <
key: "hXpBWnbCByValueWithRecordIdCoder"
value: <
spec: <
urn: "beam:coders:javasdk:0.1"
payload: "\202SNAPPY\000\000\000\000\001\000\000\000\001\000\000\001\213\311\005\320\254\355\000\005sr\000Corg.apache.beam.sdk.values.ValueWithRecordId$B\022\000LCoder{\343\376bQ\014\204>\002\000\002L\000\007i\t\025\034t\000+Lorg/\t\\\000/\001\\\024/sdk/c\0012(s/ByteArray\005B\014;L\000\n\005u\005\016\010t\000\"n;\000\005$\020;xr\000*N\274\000\t`(.Structured\005/8s\277\022\016\325\3246\021\002\000\000xr\000 j9\000\005/\034C\335\325\211\256\274~\370\001/\020psr\000)j1\0006\312\000\034\351\277\005|\263\3746\333\001:\010r\000&j8\000\024Atomic\005o\034\307\354\265\314\205tPF\0015 q\000~\000\003sr\000-N;\000$io.kafka.K\001\006\000R%\227\005B<I\320\251Y\032\341{#\002\000\001L\000\007kv\005\025\010t\000$nH\001\000K\t&\000;\025s\000\"Ns\000-P\r- j\000\275\271\035\243\3126\002!\353\010\010ke)\277\001\264\000\0022\303\001\005\022\025Y\000(jY\000\030Nullabl)\372\034E\333\0336>\220\247\007\005\307]\022.O\000\001\014,\006sq\000~\000\016q\000~\000\020"
>
>
>
coders: <
key: "hXpBWnbCByVarIntCoder"
value: <
spec: <
urn: "beam:coders:javasdk:0.1"
payload: "\202SNAPPY\000\000\000\000\001\000\000\000\001\000\000\000\210\330\001\350\254\355\000\005sr\000&org.apache.beam.sdk.coders.VarIntCoder\300K2\332\251KVh\002\000\000xrr5\000\024Atomic\0055 \307\354\265\314\205tPF\002\0055\000*jj\000$Structured\0059\034s\277\022\016\325\3246\021\t9\000 j9\000\005/0C\335\325\211\256\274~\370\002\000\000xp"
>
>
>
environments: <
key: "go"
value: <
urn: "beam:env:docker:v1"
payload: "\n\026apache/beam_go_sdk:dev"
capabilities: "beam:protocol:progress_reporting:v1"
capabilities: "beam:protocol:multi_core_bundle_processing:v1"
capabilities: "beam:transform:sdf_truncate_sized_restrictions:v1"
capabilities: "beam:protocol:worker_status:v1"
capabilities: "beam:protocol:monitoring_info_short_ids:v1"
capabilities: "beam:version:sdk_base:go:apache/beam_go_sdk:2.51.0.dev"
capabilities: "beam:transform:to_string:v1"
capabilities: "beam:coder:bytes:v1"
capabilities: "beam:coder:bool:v1"
capabilities: "beam:coder:varint:v1"
capabilities: "beam:coder:double:v1"
capabilities: "beam:coder:string_utf8:v1"
capabilities: "beam:coder:length_prefix:v1"
capabilities: "beam:coder:kv:v1"
capabilities: "beam:coder:iterable:v1"
capabilities: "beam:coder:state_backed_iterable:v1"
capabilities: "beam:coder:windowed_value:v1"
capabilities: "beam:coder:global_window:v1"
capabilities: "beam:coder:interval_window:v1"
capabilities: "beam:coder:row:v1"
capabilities: "beam:coder:nullable:v1"
capabilities: "beam:coder:timer:v1"
dependencies: <
type_urn: "beam:artifact:type:file:v1"
role_urn: "beam:artifact:role:go_worker_binary:v1"
>
>
>
environments: <
key: "hXpBWnbCBybeam:env:docker:v1"
value: <
urn: "beam:env:docker:v1"
payload: "\n apache/beam_java8_sdk:2.51.0.dev"
capabilities: "beam:coder:bytes:v1"
capabilities: "beam:coder:bool:v1"
capabilities: "beam:coder:varint:v1"
capabilities: "beam:coder:string_utf8:v1"
capabilities: "beam:coder:iterable:v1"
capabilities: "beam:coder:timer:v1"
capabilities: "beam:coder:kv:v1"
capabilities: "beam:coder:length_prefix:v1"
capabilities: "beam:coder:global_window:v1"
capabilities: "beam:coder:interval_window:v1"
capabilities: "beam:coder:custom_window:v1"
capabilities: "beam:coder:windowed_value:v1"
capabilities: "beam:coder:double:v1"
capabilities: "beam:coder:row:v1"
capabilities: "beam:coder:param_windowed_value:v1"
capabilities: "beam:coder:state_backed_iterable:v1"
capabilities: "beam:coder:sharded_key:v1"
capabilities: "beam:coder:nullable:v1"
capabilities: "beam:protocol:multi_core_bundle_processing:v1"
capabilities: "beam:protocol:progress_reporting:v1"
capabilities: "beam:protocol:harness_monitoring_infos:v1"
capabilities: "beam:protocol:control_request_elements_embedding:v1"
capabilities: "beam:protocol:state_caching:v1"
capabilities: "beam:version:sdk_base:apache/beam_java8_sdk:2.51.0.dev"
capabilities: "beam:transform:sdf_truncate_sized_restrictions:v1"
capabilities: "beam:transform:to_string:v1"
capabilities: "beam:protocol:data_sampling:v1"
dependencies: <
type_urn: "beam:artifact:type:file:v1"
type_payload: "\nL/tmp/artifacts/icedtea-sound-uoIQCGhMffp0D_gc1dkBtXBGXr18Bkb5Qx-e-CvP00s.jar\022@ba821008684c7dfa740ff81cd5d901b570465ebd7c0646f9431f9ef82bcfd34b"
role_urn: "beam:artifact:role:staging_to:v1"
role_payload: "\n=icedtea-sound-uoIQCGhMffp0D_gc1dkBtXBGXr18Bkb5Qx-e-CvP00s.jar"
>
dependencies: <
type_urn: "beam:artifact:type:file:v1"
type_payload: "\nF/tmp/artifacts/jaccess-T1qVdaqZDj2uNq1tdHEk1lwFMYQiwMhYa0jqGU9fUMg.jar\022@4f5a9575aa990e3dae36ad6d747124d65c05318422c0c8586b48ea194f5f50c8"
role_urn: "beam:artifact:role:staging_to:v1"
role_payload: "\n7jaccess-T1qVdaqZDj2uNq1tdHEk1lwFMYQiwMhYa0jqGU9fUMg.jar"
>
dependencies: <
type_urn: "beam:artifact:type:file:v1"
type_payload: "\nI/tmp/artifacts/localedata-dQT9YOGvbd1zEqcZsyJ1W4l8jNhxoX3b1nmMhdIbCb8.jar\022@7504fd60e1af6ddd7312a719b322755b897c8cd871a17ddbd6798c85d21b09bf"
role_urn: "beam:artifact:role:staging_to:v1"
role_payload: "\n:localedata-dQT9YOGvbd1zEqcZsyJ1W4l8jNhxoX3b1nmMhdIbCb8.jar"
>
dependencies: <
type_urn: "beam:artifact:type:file:v1"
type_payload: "\nF/tmp/artifacts/nashorn-gZxbPAWCb1KP7OCbxUu1prmT4YMEDX-mGdJFjkB3pfs.jar\022@819c5b3c05826f528fece09bc54bb5a6b993e183040d7fa619d2458e4077a5fb"
role_urn: "beam:artifact:role:staging_to:v1"
role_payload: "\n7nashorn-gZxbPAWCb1KP7OCbxUu1prmT4YMEDX-mGdJFjkB3pfs.jar"
>
dependencies: <
type_urn: "beam:artifact:type:file:v1"
type_payload: "\nG/tmp/artifacts/cldrdata-_GVjPlS0invvNh7wlTfv_CNVOxTj3Y-xvSW1Xw2r_-4.jar\022@fc65633e54b48a7bef361ef09537effc23553b14e3dd8fb1bd25b55f0dabffee"
role_urn: "beam:artifact:role:staging_to:v1"
role_payload: "\n8cldrdata-_GVjPlS0invvNh7wlTfv_CNVOxTj3Y-xvSW1Xw2r_-4.jar"
>
dependencies: <
type_urn: "beam:artifact:type:file:v1"
type_payload: "\nD/tmp/artifacts/dnsns-lI-xDSEZtu3C8A4-qt_7RcyP_ql7OU0LNZreNR5piTU.jar\022@948fb10d2119b6edc2f00e3eaadffb45cc8ffea97b394d0b359ade351e698935"
role_urn: "beam:artifact:role:staging_to:v1"
role_payload: "\n5dnsns-lI-xDSEZtu3C8A4-qt_7RcyP_ql7OU0LNZreNR5piTU.jar"
>
dependencies: <
type_urn: "beam:artifact:type:file:v1"
type_payload: "\n{/tmp/artifacts/beam-sdks-java-io-expansion-service-2.51.0-SNAPSHOT-SNAPSHOT-sdh9-LGyXe7Y5ESN6d3v1sPzLCQDF20pqUAepDIiTig.jar\022@b1d87df8b1b25deed8e4448de9ddefd6c3f32c2403176d29a9401ea432224e28"
role_urn: "beam:artifact:role:staging_to:v1"
role_payload: "\nlbeam-sdks-java-io-expansion-service-2.51.0-SNAPSHOT-SNAPSHOT-sdh9-LGyXe7Y5ESN6d3v1sPzLCQDF20pqUAepDIiTig.jar"
>
>
>
>
root_transform_ids: "s1"
root_transform_ids: "e4"
root_transform_ids: "e5"
root_transform_ids: "s3"
2023/09/07 10:40:23 Cross-compiling <https://ci-beam.apache.org/job/beam_PostCommit_XVR_Flink/ws/src/sdks/go/test/integration/io/xlang/kafka/kafka_test.go> with GOOS=linux GOARCH=amd64 CGO_ENABLED=0 as /tmp/worker-2-1694083223667852741
2023/09/07 10:40:26 Prepared job with id: go-testkafkaio_basicreadwrite-2_1bfdb645-f16c-49d8-9ed0-5e2101b0c41c and staging token: go-testkafkaio_basicreadwrite-2_1bfdb645-f16c-49d8-9ed0-5e2101b0c41c
2023/09/07 10:40:26 Staged binary artifact with token:
2023/09/07 10:40:26 Submitted job: go0testkafkaio0basicreadwrite02-jenkins-0907104026-8605842b_14482bb9-e8d4-4b09-8d1c-7f0908532ebc
2023/09/07 10:40:26 Job[go0testkafkaio0basicreadwrite02-jenkins-0907104026-8605842b_14482bb9-e8d4-4b09-8d1c-7f0908532ebc] state: STOPPED
2023/09/07 10:40:26 Job[go0testkafkaio0basicreadwrite02-jenkins-0907104026-8605842b_14482bb9-e8d4-4b09-8d1c-7f0908532ebc] state: STARTING
2023/09/07 10:40:26 Job[go0testkafkaio0basicreadwrite02-jenkins-0907104026-8605842b_14482bb9-e8d4-4b09-8d1c-7f0908532ebc] state: RUNNING
2023/09/07 10:40:48 Job[go0testkafkaio0basicreadwrite02-jenkins-0907104026-8605842b_14482bb9-e8d4-4b09-8d1c-7f0908532ebc] state: DONE
--- PASS: TestKafkaIO_BasicReadWrite (48.77s)
PASS
ok github.com/apache/beam/sdks/v2/go/test/integration/io/xlang/kafka 54.803s
> Task :runners:flink:1.15:job-server:validatesCrossLanguageRunnerJavaUsingPython
INFO:root:No image given, using default Python SDK image
INFO:root:Python SDK container image set to "apache/beam_python3.8_sdk:2.50.0" for Docker environment
INFO:__main__:Listening for expansion requests at 44997
INFO:root:Missing pipeline option (runner). Executing pipeline using the default runner: DirectRunner.
INFO:__main__:Shutting down expansion service.
INFO:apache_beam.runners.portability.stager:Executing command: ['/home/jenkins/.apache_beam/cache/venvs/py-3.8-beam-2.50.0-743bdccef67087512a7a190820e727aab7bdcb14/bin/python', '-m', 'pip', 'download', '--dest', '/tmp/dataflow-requirements-cache', '-r', '/tmp/tmpgajxr2st/tmp_requirements.txt', '--exists-action', 'i', '--no-deps', '--implementation', 'cp', '--abi', 'cp38', '--platform', 'manylinux2014_x86_64']
INFO:root:No image given, using default Python SDK image
INFO:root:Python SDK container image set to "apache/beam_python3.8_sdk:2.50.0" for Docker environment
INFO:__main__:Listening for expansion requests at 41739
INFO:root:Missing pipeline option (runner). Executing pipeline using the default runner: DirectRunner.
INFO:__main__:Shutting down expansion service.
> Task :runners:flink:1.15:job-server:validatesCrossLanguageRunnerPythonUsingJava
> Task :runners:flink:1.15:job-server:validatesCrossLanguageRunnerPythonUsingSql FAILED
> Task :runners:flink:1.15:job-server:flinkJobServerCleanup
> Task :runners:flink:1.15:job-server:validatesCrossLanguageRunnerCleanup
FAILURE: Build failed with an exception.
* What went wrong:
Execution failed for task ':runners:flink:1.15:job-server:validatesCrossLanguageRunnerPythonUsingSql'.
> Process 'command 'sh'' finished with non-zero exit value 1
* Try:
> Run with --stacktrace option to get the stack trace.
> Run with --info or --debug option to get more log output.
* Get more help at https://help.gradle.org
Deprecated Gradle features were used in this build, making it incompatible with Gradle 8.0.
You can use '--warning-mode all' to show the individual deprecation warnings and determine if they come from your own scripts or plugins.
See https://docs.gradle.org/7.6.2/userguide/command_line_interface.html#sec:command_line_warnings
Execution optimizations have been disabled for 1 invalid unit(s) of work during this build to ensure correctness.
Please consult deprecation warnings for more details.
BUILD FAILED in 40m 39s
281 actionable tasks: 185 executed, 84 from cache, 12 up-to-date
Publishing build scan...
https://ge.apache.org/s/g22zxn4t7mxyg
Build step 'Invoke Gradle script' changed build result to FAILURE
Build step 'Invoke Gradle script' marked build as failure
---------------------------------------------------------------------
To unsubscribe, e-mail: builds-unsubscribe@beam.apache.org
For additional commands, e-mail: builds-help@beam.apache.org
Build failed in Jenkins: beam_PostCommit_XVR_Flink #7318
Posted by Apache Jenkins Server <je...@builds.apache.org>.
See <https://ci-beam.apache.org/job/beam_PostCommit_XVR_Flink/7318/display/redirect>
Changes:
------------------------------------------
[...truncated 1.39 MB...]
elif '.dev' in version:
# TODO: Attempt to use nightly snapshots?
> raise RuntimeError(
(
'%s not found. '
'Please build the server with \n cd %s; ./gradlew %s') %
(local_path, os.path.abspath(project_root), gradle_target))
E RuntimeError: <https://ci-beam.apache.org/job/beam_PostCommit_XVR_Flink/ws/src/sdks/java/extensions/sql/expansion-service/build/libs/beam-sdks-java-extensions-sql-expansion-service-2.51.0-SNAPSHOT.jar> not found. Please build the server with
E cd <https://ci-beam.apache.org/job/beam_PostCommit_XVR_Flink/ws/src;> ./gradlew :sdks:java:extensions:sql:expansion-service:shadowJar
apache_beam/utils/subprocess_server.py:243: RuntimeError
__________________ SqlTransformTest.test_windowing_before_sql __________________
self = <apache_beam.transforms.sql_test.SqlTransformTest testMethod=test_windowing_before_sql>
def test_windowing_before_sql(self):
with TestPipeline() as p:
out = (
p | beam.Create([
SimpleRow(5, "foo", 1.),
SimpleRow(15, "bar", 2.),
SimpleRow(25, "baz", 3.)
])
| beam.Map(lambda v: beam.window.TimestampedValue(v, v.id)).
with_output_types(SimpleRow)
| beam.WindowInto(
beam.window.FixedWindows(10)).with_output_types(SimpleRow)
> | SqlTransform("SELECT COUNT(*) as `count` FROM PCOLLECTION"))
apache_beam/transforms/sql_test.py:174:
_ _ _ _ _ _ _ _ _ _ _ _ _ _ _ _ _ _ _ _ _ _ _ _ _ _ _ _ _ _ _ _ _ _ _ _ _ _ _ _
apache_beam/transforms/sql.py:86: in __init__
expansion_service = expansion_service or BeamJarExpansionService(
apache_beam/transforms/external.py:983: in __init__
path_to_jar = subprocess_server.JavaJarServer.path_to_beam_jar(
_ _ _ _ _ _ _ _ _ _ _ _ _ _ _ _ _ _ _ _ _ _ _ _ _ _ _ _ _ _ _ _ _ _ _ _ _ _ _ _
cls = <class 'apache_beam.utils.subprocess_server.JavaJarServer'>
gradle_target = ':sdks:java:extensions:sql:expansion-service:shadowJar'
appendix = None, version = '2.51.0.dev'
artifact_id = 'beam-sdks-java-extensions-sql-expansion-service'
@classmethod
def path_to_beam_jar(
cls,
gradle_target,
appendix=None,
version=beam_version,
artifact_id=None):
if gradle_target in cls._BEAM_SERVICES.replacements:
return cls._BEAM_SERVICES.replacements[gradle_target]
gradle_package = gradle_target.strip(':').rsplit(':', 1)[0]
if not artifact_id:
artifact_id = 'beam-' + gradle_package.replace(':', '-')
project_root = os.path.sep.join(
os.path.abspath(__file__).split(os.path.sep)[:-5])
local_path = os.path.join(
project_root,
gradle_package.replace(':', os.path.sep),
'build',
'libs',
cls.jar_name(
artifact_id,
version.replace('.dev', ''),
classifier='SNAPSHOT',
appendix=appendix))
if os.path.exists(local_path):
_LOGGER.info('Using pre-built snapshot at %s', local_path)
return local_path
elif '.dev' in version:
# TODO: Attempt to use nightly snapshots?
> raise RuntimeError(
(
'%s not found. '
'Please build the server with \n cd %s; ./gradlew %s') %
(local_path, os.path.abspath(project_root), gradle_target))
E RuntimeError: <https://ci-beam.apache.org/job/beam_PostCommit_XVR_Flink/ws/src/sdks/java/extensions/sql/expansion-service/build/libs/beam-sdks-java-extensions-sql-expansion-service-2.51.0-SNAPSHOT.jar> not found. Please build the server with
E cd <https://ci-beam.apache.org/job/beam_PostCommit_XVR_Flink/ws/src;> ./gradlew :sdks:java:extensions:sql:expansion-service:shadowJar
apache_beam/utils/subprocess_server.py:243: RuntimeError
_________________ SqlTransformTest.test_zetasql_generate_data __________________
self = <apache_beam.transforms.sql_test.SqlTransformTest testMethod=test_zetasql_generate_data>
def test_zetasql_generate_data(self):
with TestPipeline() as p:
> out = p | SqlTransform(
"""SELECT
CAST(1 AS INT64) AS `int`,
CAST('foo' AS STRING) AS `str`,
CAST(3.14 AS FLOAT64) AS `flt`""",
dialect="zetasql")
apache_beam/transforms/sql_test.py:154:
_ _ _ _ _ _ _ _ _ _ _ _ _ _ _ _ _ _ _ _ _ _ _ _ _ _ _ _ _ _ _ _ _ _ _ _ _ _ _ _
apache_beam/transforms/sql.py:86: in __init__
expansion_service = expansion_service or BeamJarExpansionService(
apache_beam/transforms/external.py:983: in __init__
path_to_jar = subprocess_server.JavaJarServer.path_to_beam_jar(
_ _ _ _ _ _ _ _ _ _ _ _ _ _ _ _ _ _ _ _ _ _ _ _ _ _ _ _ _ _ _ _ _ _ _ _ _ _ _ _
cls = <class 'apache_beam.utils.subprocess_server.JavaJarServer'>
gradle_target = ':sdks:java:extensions:sql:expansion-service:shadowJar'
appendix = None, version = '2.51.0.dev'
artifact_id = 'beam-sdks-java-extensions-sql-expansion-service'
@classmethod
def path_to_beam_jar(
cls,
gradle_target,
appendix=None,
version=beam_version,
artifact_id=None):
if gradle_target in cls._BEAM_SERVICES.replacements:
return cls._BEAM_SERVICES.replacements[gradle_target]
gradle_package = gradle_target.strip(':').rsplit(':', 1)[0]
if not artifact_id:
artifact_id = 'beam-' + gradle_package.replace(':', '-')
project_root = os.path.sep.join(
os.path.abspath(__file__).split(os.path.sep)[:-5])
local_path = os.path.join(
project_root,
gradle_package.replace(':', os.path.sep),
'build',
'libs',
cls.jar_name(
artifact_id,
version.replace('.dev', ''),
classifier='SNAPSHOT',
appendix=appendix))
if os.path.exists(local_path):
_LOGGER.info('Using pre-built snapshot at %s', local_path)
return local_path
elif '.dev' in version:
# TODO: Attempt to use nightly snapshots?
> raise RuntimeError(
(
'%s not found. '
'Please build the server with \n cd %s; ./gradlew %s') %
(local_path, os.path.abspath(project_root), gradle_target))
E RuntimeError: <https://ci-beam.apache.org/job/beam_PostCommit_XVR_Flink/ws/src/sdks/java/extensions/sql/expansion-service/build/libs/beam-sdks-java-extensions-sql-expansion-service-2.51.0-SNAPSHOT.jar> not found. Please build the server with
E cd <https://ci-beam.apache.org/job/beam_PostCommit_XVR_Flink/ws/src;> ./gradlew :sdks:java:extensions:sql:expansion-service:shadowJar
apache_beam/utils/subprocess_server.py:243: RuntimeError
=============================== warnings summary ===============================
../../build/gradleenv/1922375555/lib/python3.8/site-packages/hdfs/config.py:28
<https://ci-beam.apache.org/job/beam_PostCommit_XVR_Flink/ws/src/build/gradleenv/1922375555/lib/python3.8/site-packages/hdfs/config.py>:28: DeprecationWarning: the imp module is deprecated in favour of importlib; see the module's documentation for alternative uses
from imp import load_source
../../build/gradleenv/1922375555/lib/python3.8/site-packages/google/rpc/__init__.py:18
<https://ci-beam.apache.org/job/beam_PostCommit_XVR_Flink/ws/src/build/gradleenv/1922375555/lib/python3.8/site-packages/google/rpc/__init__.py>:18: DeprecationWarning: pkg_resources is deprecated as an API. See https://setuptools.pypa.io/en/latest/pkg_resources.html
import pkg_resources
../../build/gradleenv/1922375555/lib/python3.8/site-packages/pkg_resources/__init__.py:2871: 19 warnings
<https://ci-beam.apache.org/job/beam_PostCommit_XVR_Flink/ws/src/build/gradleenv/1922375555/lib/python3.8/site-packages/pkg_resources/__init__.py>:2871: DeprecationWarning: Deprecated call to `pkg_resources.declare_namespace('google')`.
Implementing implicit namespace packages (as specified in PEP 420) is preferred to `pkg_resources.declare_namespace`. See https://setuptools.pypa.io/en/latest/references/keywords.html#keyword-namespace-packages
declare_namespace(pkg)
../../build/gradleenv/1922375555/lib/python3.8/site-packages/pkg_resources/__init__.py:2871: 16 warnings
<https://ci-beam.apache.org/job/beam_PostCommit_XVR_Flink/ws/src/build/gradleenv/1922375555/lib/python3.8/site-packages/pkg_resources/__init__.py>:2871: DeprecationWarning: Deprecated call to `pkg_resources.declare_namespace('google.cloud')`.
Implementing implicit namespace packages (as specified in PEP 420) is preferred to `pkg_resources.declare_namespace`. See https://setuptools.pypa.io/en/latest/references/keywords.html#keyword-namespace-packages
declare_namespace(pkg)
../../build/gradleenv/1922375555/lib/python3.8/site-packages/pkg_resources/__init__.py:2350
../../build/gradleenv/1922375555/lib/python3.8/site-packages/pkg_resources/__init__.py:2350
../../build/gradleenv/1922375555/lib/python3.8/site-packages/pkg_resources/__init__.py:2350
../../build/gradleenv/1922375555/lib/python3.8/site-packages/pkg_resources/__init__.py:2350
<https://ci-beam.apache.org/job/beam_PostCommit_XVR_Flink/ws/src/build/gradleenv/1922375555/lib/python3.8/site-packages/pkg_resources/__init__.py>:2350: DeprecationWarning: Deprecated call to `pkg_resources.declare_namespace('google')`.
Implementing implicit namespace packages (as specified in PEP 420) is preferred to `pkg_resources.declare_namespace`. See https://setuptools.pypa.io/en/latest/references/keywords.html#keyword-namespace-packages
declare_namespace(parent)
../../build/gradleenv/1922375555/lib/python3.8/site-packages/pkg_resources/__init__.py:2871
<https://ci-beam.apache.org/job/beam_PostCommit_XVR_Flink/ws/src/build/gradleenv/1922375555/lib/python3.8/site-packages/pkg_resources/__init__.py>:2871: DeprecationWarning: Deprecated call to `pkg_resources.declare_namespace('google.logging')`.
Implementing implicit namespace packages (as specified in PEP 420) is preferred to `pkg_resources.declare_namespace`. See https://setuptools.pypa.io/en/latest/references/keywords.html#keyword-namespace-packages
declare_namespace(pkg)
../../build/gradleenv/1922375555/lib/python3.8/site-packages/pkg_resources/__init__.py:2871
<https://ci-beam.apache.org/job/beam_PostCommit_XVR_Flink/ws/src/build/gradleenv/1922375555/lib/python3.8/site-packages/pkg_resources/__init__.py>:2871: DeprecationWarning: Deprecated call to `pkg_resources.declare_namespace('google.iam')`.
Implementing implicit namespace packages (as specified in PEP 420) is preferred to `pkg_resources.declare_namespace`. See https://setuptools.pypa.io/en/latest/references/keywords.html#keyword-namespace-packages
declare_namespace(pkg)
../../build/gradleenv/1922375555/lib/python3.8/site-packages/google/rpc/__init__.py:20
<https://ci-beam.apache.org/job/beam_PostCommit_XVR_Flink/ws/src/build/gradleenv/1922375555/lib/python3.8/site-packages/google/rpc/__init__.py>:20: DeprecationWarning: Deprecated call to `pkg_resources.declare_namespace('google.rpc')`.
Implementing implicit namespace packages (as specified in PEP 420) is preferred to `pkg_resources.declare_namespace`. See https://setuptools.pypa.io/en/latest/references/keywords.html#keyword-namespace-packages
pkg_resources.declare_namespace(__name__)
-- Docs: https://docs.pytest.org/en/stable/how-to/capture-warnings.html
- generated xml file: <https://ci-beam.apache.org/job/beam_PostCommit_XVR_Flink/ws/src/sdks/python/pytest_xlangSqlValidateRunner.xml> -
=========================== short test summary info ============================
FAILED apache_beam/transforms/sql_test.py::SqlTransformTest::test_agg - RuntimeError: <https://ci-beam.apache.org/job/beam_PostCommit_XVR_Flink/ws/src/sdks/java/extensions/sql/expansion-service/build/libs/beam-sdks-java-extensions-sql-expansion-service-2.51.0-SNAPSHOT.jar> not found. Please build the server with
cd <https://ci-beam.apache.org/job/beam_PostCommit_XVR_Flink/ws/src;> ./gradlew :sdks:java:extensions:sql:expansion-service:shadowJar
FAILED apache_beam/transforms/sql_test.py::SqlTransformTest::test_filter - RuntimeError: <https://ci-beam.apache.org/job/beam_PostCommit_XVR_Flink/ws/src/sdks/java/extensions/sql/expansion-service/build/libs/beam-sdks-java-extensions-sql-expansion-service-2.51.0-SNAPSHOT.jar> not found. Please build the server with
cd <https://ci-beam.apache.org/job/beam_PostCommit_XVR_Flink/ws/src;> ./gradlew :sdks:java:extensions:sql:expansion-service:shadowJar
FAILED apache_beam/transforms/sql_test.py::SqlTransformTest::test_generate_data - RuntimeError: <https://ci-beam.apache.org/job/beam_PostCommit_XVR_Flink/ws/src/sdks/java/extensions/sql/expansion-service/build/libs/beam-sdks-java-extensions-sql-expansion-service-2.51.0-SNAPSHOT.jar> not found. Please build the server with
cd <https://ci-beam.apache.org/job/beam_PostCommit_XVR_Flink/ws/src;> ./gradlew :sdks:java:extensions:sql:expansion-service:shadowJar
FAILED apache_beam/transforms/sql_test.py::SqlTransformTest::test_map - RuntimeError: <https://ci-beam.apache.org/job/beam_PostCommit_XVR_Flink/ws/src/sdks/java/extensions/sql/expansion-service/build/libs/beam-sdks-java-extensions-sql-expansion-service-2.51.0-SNAPSHOT.jar> not found. Please build the server with
cd <https://ci-beam.apache.org/job/beam_PostCommit_XVR_Flink/ws/src;> ./gradlew :sdks:java:extensions:sql:expansion-service:shadowJar
FAILED apache_beam/transforms/sql_test.py::SqlTransformTest::test_project - RuntimeError: <https://ci-beam.apache.org/job/beam_PostCommit_XVR_Flink/ws/src/sdks/java/extensions/sql/expansion-service/build/libs/beam-sdks-java-extensions-sql-expansion-service-2.51.0-SNAPSHOT.jar> not found. Please build the server with
cd <https://ci-beam.apache.org/job/beam_PostCommit_XVR_Flink/ws/src;> ./gradlew :sdks:java:extensions:sql:expansion-service:shadowJar
FAILED apache_beam/transforms/sql_test.py::SqlTransformTest::test_row - RuntimeError: <https://ci-beam.apache.org/job/beam_PostCommit_XVR_Flink/ws/src/sdks/java/extensions/sql/expansion-service/build/libs/beam-sdks-java-extensions-sql-expansion-service-2.51.0-SNAPSHOT.jar> not found. Please build the server with
cd <https://ci-beam.apache.org/job/beam_PostCommit_XVR_Flink/ws/src;> ./gradlew :sdks:java:extensions:sql:expansion-service:shadowJar
FAILED apache_beam/transforms/sql_test.py::SqlTransformTest::test_tagged_join - RuntimeError: <https://ci-beam.apache.org/job/beam_PostCommit_XVR_Flink/ws/src/sdks/java/extensions/sql/expansion-service/build/libs/beam-sdks-java-extensions-sql-expansion-service-2.51.0-SNAPSHOT.jar> not found. Please build the server with
cd <https://ci-beam.apache.org/job/beam_PostCommit_XVR_Flink/ws/src;> ./gradlew :sdks:java:extensions:sql:expansion-service:shadowJar
FAILED apache_beam/transforms/sql_test.py::SqlTransformTest::test_windowing_before_sql - RuntimeError: <https://ci-beam.apache.org/job/beam_PostCommit_XVR_Flink/ws/src/sdks/java/extensions/sql/expansion-service/build/libs/beam-sdks-java-extensions-sql-expansion-service-2.51.0-SNAPSHOT.jar> not found. Please build the server with
cd <https://ci-beam.apache.org/job/beam_PostCommit_XVR_Flink/ws/src;> ./gradlew :sdks:java:extensions:sql:expansion-service:shadowJar
FAILED apache_beam/transforms/sql_test.py::SqlTransformTest::test_zetasql_generate_data - RuntimeError: <https://ci-beam.apache.org/job/beam_PostCommit_XVR_Flink/ws/src/sdks/java/extensions/sql/expansion-service/build/libs/beam-sdks-java-extensions-sql-expansion-service-2.51.0-SNAPSHOT.jar> not found. Please build the server with
cd <https://ci-beam.apache.org/job/beam_PostCommit_XVR_Flink/ws/src;> ./gradlew :sdks:java:extensions:sql:expansion-service:shadowJar
========= 9 failed, 17 skipped, 7154 deselected, 44 warnings in 10.16s =========
> Task :runners:flink:1.15:job-server:validatesCrossLanguageRunnerPythonUsingSql FAILED
> Task :runners:flink:1.15:job-server:flinkJobServerCleanup
Stopping job server pid: 3654079.
> Task :runners:flink:1.15:job-server:validatesCrossLanguageRunnerCleanup
Stopping expansion service pid: 3665532.
Stopping expansion service pid: 3665533.
FAILURE: Build failed with an exception.
* What went wrong:
Execution failed for task ':runners:flink:1.15:job-server:validatesCrossLanguageRunnerPythonUsingSql'.
> Process 'command 'sh'' finished with non-zero exit value 1
* Try:
> Run with --stacktrace option to get the stack trace.
> Run with --info or --debug option to get more log output.
* Get more help at https://help.gradle.org
Deprecated Gradle features were used in this build, making it incompatible with Gradle 8.0.
You can use '--warning-mode all' to show the individual deprecation warnings and determine if they come from your own scripts or plugins.
See https://docs.gradle.org/7.6.2/userguide/command_line_interface.html#sec:command_line_warnings
Execution optimizations have been disabled for 1 invalid unit(s) of work during this build to ensure correctness.
Please consult deprecation warnings for more details.
BUILD FAILED in 41m 21s
281 actionable tasks: 184 executed, 85 from cache, 12 up-to-date
Publishing build scan...
https://ge.apache.org/s/4mevsenyvszv6
Build step 'Invoke Gradle script' changed build result to FAILURE
Build step 'Invoke Gradle script' marked build as failure
---------------------------------------------------------------------
To unsubscribe, e-mail: builds-unsubscribe@beam.apache.org
For additional commands, e-mail: builds-help@beam.apache.org