You are viewing a plain text version of this content. The canonical link for it is here.
Posted to yarn-dev@hadoop.apache.org by Apache Jenkins Server <je...@builds.apache.org> on 2013/06/17 09:01:53 UTC

Failed: YARN-727 PreCommit Build #1288

Jira: https://issues.apache.org/jira/browse/YARN-727
Build: https://builds.apache.org/job/PreCommit-YARN-Build/1288/

###################################################################################
########################## LAST 60 LINES OF THE CONSOLE ###########################
[...truncated 118 lines...]
no change for http://svn.apache.org/repos/asf/hadoop/nightly since the previous build
No emails were triggered.
[PreCommit-YARN-Build] $ /bin/bash /tmp/hudson1337663544784890712.sh
32768
Running in Jenkins mode


======================================================================
======================================================================
    Testing patch for YARN-727.
======================================================================
======================================================================


At revision 1493658.
YARN-727 patch is being downloaded at Mon Jun 17 07:01:47 UTC 2013 from
http://issues.apache.org/jira/secure/attachment/12588098/YARN-727.8.patch
cp: cannot stat `/home/jenkins/buildSupport/lib/*': No such file or directory
The patch does not appear to apply with p0 to p2
PATCH APPLICATION FAILED




{color:red}-1 overall{color}.  Here are the results of testing the latest attachment 
  http://issues.apache.org/jira/secure/attachment/12588098/YARN-727.8.patch
  against trunk revision .

    {color:red}-1 patch{color}.  The patch command could not apply the patch.

Console output: https://builds.apache.org/job/PreCommit-YARN-Build/1288//console

This message is automatically generated.


======================================================================
======================================================================
    Adding comment to Jira.
======================================================================
======================================================================


Comment added.
cd626994a81f1fd311aa45940b122670bafd1a72 logged out


======================================================================
======================================================================
    Finished build.
======================================================================
======================================================================


Build step 'Execute shell' marked build as failure
Archiving artifacts
[description-setter] Could not determine description.
Recording test results
Email was triggered for: Failure
Sending email for trigger: Failure



###################################################################################
############################## FAILED TESTS (if any) ##############################
No tests ran.

Success: YARN-839 PreCommit Build #1289

Posted by Apache Jenkins Server <je...@builds.apache.org>.
Jira: https://issues.apache.org/jira/browse/YARN-839
Build: https://builds.apache.org/job/PreCommit-YARN-Build/1289/

###################################################################################
########################## LAST 60 LINES OF THE CONSOLE ###########################
[...truncated 2774 lines...]

/bin/kill -9 4262 
kill: No such process
NOP




{color:green}+1 overall{color}.  Here are the results of testing the latest attachment 
  http://issues.apache.org/jira/secure/attachment/12588101/YARN-839.patch
  against trunk revision .

    {color:green}+1 @author{color}.  The patch does not contain any @author tags.

    {color:green}+1 tests included{color}.  The patch appears to include 1 new or modified test files.

    {color:green}+1 javac{color}.  The applied patch does not increase the total number of javac compiler warnings.

    {color:green}+1 javadoc{color}.  The javadoc tool did not generate any warning messages.

    {color:green}+1 eclipse:eclipse{color}.  The patch built with eclipse:eclipse.

    {color:green}+1 findbugs{color}.  The patch does not introduce any new Findbugs (version 1.3.9) warnings.

    {color:green}+1 release audit{color}.  The applied patch does not increase the total number of release audit warnings.

    {color:green}+1 core tests{color}.  The patch passed unit tests in hadoop-yarn-project/hadoop-yarn/hadoop-yarn-server/hadoop-yarn-server-nodemanager.

    {color:green}+1 contrib tests{color}.  The patch passed contrib unit tests.

Test results: https://builds.apache.org/job/PreCommit-YARN-Build/1289//testReport/
Console output: https://builds.apache.org/job/PreCommit-YARN-Build/1289//console

This message is automatically generated.


======================================================================
======================================================================
    Adding comment to Jira.
======================================================================
======================================================================


Comment added.
eba2d783bed20da932fd512c29a3feed30865adf logged out


======================================================================
======================================================================
    Finished build.
======================================================================
======================================================================


Archiving artifacts
Description set: YARN-839
Recording test results
Email was triggered for: Success
Sending email for trigger: Success



###################################################################################
############################## FAILED TESTS (if any) ##############################
All tests passed