You are viewing a plain text version of this content. The canonical link for it is here.
Posted to yarn-dev@hadoop.apache.org by Apache Jenkins Server <je...@builds.apache.org> on 2015/09/18 18:11:02 UTC
Hadoop-Yarn-trunk-Java8 - Build # 415 - Failure
See https://builds.apache.org/job/Hadoop-Yarn-trunk-Java8/415/
###################################################################################
########################## LAST 60 LINES OF THE CONSOLE ###########################
[...truncated 5741 lines...]
Tests run: 2, Failures: 0, Errors: 0, Skipped: 0, Time elapsed: 1.637 sec - in org.apache.hadoop.yarn.applications.distributedshell.TestDSAppMaster
Results :
Tests in error:
TestDistributedShell.tearDown:133 » Runtime java.util.zip.ZipException: invali...
TestDistributedShell.setup:71->setupInternal:79 » Runtime java.util.zip.ZipExc...
TestDistributedShell.tearDown:133 » Runtime java.util.zip.ZipException: invali...
Tests run: 15, Failures: 0, Errors: 3, Skipped: 0
[INFO] ------------------------------------------------------------------------
[INFO] Reactor Summary:
[INFO]
[INFO] Apache Hadoop YARN ................................ SUCCESS [ 3.180 s]
[INFO] Apache Hadoop YARN API ............................ SUCCESS [01:25 min]
[INFO] Apache Hadoop YARN Common ......................... SUCCESS [02:20 min]
[INFO] Apache Hadoop YARN Server ......................... SUCCESS [ 0.054 s]
[INFO] Apache Hadoop YARN Server Common .................. SUCCESS [ 37.025 s]
[INFO] Apache Hadoop YARN NodeManager .................... SUCCESS [07:50 min]
[INFO] Apache Hadoop YARN Web Proxy ...................... SUCCESS [ 16.630 s]
[INFO] Apache Hadoop YARN ApplicationHistoryService ...... SUCCESS [03:54 min]
[INFO] Apache Hadoop YARN ResourceManager ................ SUCCESS [59:35 min]
[INFO] Apache Hadoop YARN Server Tests ................... SUCCESS [02:20 min]
[INFO] Apache Hadoop YARN Client ......................... SUCCESS [07:04 min]
[INFO] Apache Hadoop YARN SharedCacheManager ............. SUCCESS [ 17.524 s]
[INFO] Apache Hadoop YARN Applications ................... SUCCESS [ 0.076 s]
[INFO] Apache Hadoop YARN DistributedShell ............... FAILURE [06:11 min]
[INFO] Apache Hadoop YARN Unmanaged Am Launcher .......... SKIPPED
[INFO] Apache Hadoop YARN Site ........................... SKIPPED
[INFO] Apache Hadoop YARN Registry ....................... SKIPPED
[INFO] Apache Hadoop YARN Project ........................ SKIPPED
[INFO] ------------------------------------------------------------------------
[INFO] BUILD FAILURE
[INFO] ------------------------------------------------------------------------
[INFO] Total time: 01:31 h
[INFO] Finished at: 2015-09-18T16:11:08+00:00
[INFO] Final Memory: 92M/1086M
[INFO] ------------------------------------------------------------------------
[ERROR] Failed to execute goal org.apache.maven.plugins:maven-surefire-plugin:2.17:test (default-test) on project hadoop-yarn-applications-distributedshell: There are test failures.
[ERROR]
[ERROR] Please refer to /home/jenkins/jenkins-slave/workspace/Hadoop-Yarn-trunk-Java8/hadoop-yarn-project/hadoop-yarn/hadoop-yarn-applications/hadoop-yarn-applications-distributedshell/target/surefire-reports for the individual test results.
[ERROR] -> [Help 1]
[ERROR]
[ERROR] To see the full stack trace of the errors, re-run Maven with the -e switch.
[ERROR] Re-run Maven using the -X switch to enable full debug logging.
[ERROR]
[ERROR] For more information about the errors and possible solutions, please read the following articles:
[ERROR] [Help 1] http://cwiki.apache.org/confluence/display/MAVEN/MojoFailureException
[ERROR]
[ERROR] After correcting the problems, you can resume the build with the command
[ERROR] mvn <goals> -rf :hadoop-yarn-applications-distributedshell
Build step 'Execute shell' marked build as failure
Archiving artifacts
Recording test results
Updating HDFS-5802
Sending e-mails to: yarn-dev@hadoop.apache.org
Email was triggered for: Failure
Sending email for trigger: Failure
###################################################################################
############################## FAILED TESTS (if any) ##############################
3 tests failed.
REGRESSION: org.apache.hadoop.yarn.applications.distributedshell.TestDistributedShell.testDSShellWithCustomLogPropertyFile
Error Message:
java.util.zip.ZipException: invalid stored block lengths
Stack Trace:
java.lang.RuntimeException: java.util.zip.ZipException: invalid stored block lengths
at java.util.zip.InflaterInputStream.read(InflaterInputStream.java:164)
at java.util.zip.InflaterInputStream.read(InflaterInputStream.java:122)
at java.io.FilterInputStream.read(FilterInputStream.java:83)
at com.sun.org.apache.xerces.internal.impl.XMLEntityManager$RewindableInputStream.read(XMLEntityManager.java:2876)
at com.sun.org.apache.xerces.internal.impl.XMLEntityManager.setupCurrentEntity(XMLEntityManager.java:667)
at com.sun.org.apache.xerces.internal.impl.XMLVersionDetector.determineDocVersion(XMLVersionDetector.java:189)
at com.sun.org.apache.xerces.internal.parsers.XML11Configuration.parse(XML11Configuration.java:812)
at com.sun.org.apache.xerces.internal.parsers.XML11Configuration.parse(XML11Configuration.java:777)
at com.sun.org.apache.xerces.internal.parsers.XMLParser.parse(XMLParser.java:141)
at com.sun.org.apache.xerces.internal.parsers.DOMParser.parse(DOMParser.java:243)
at com.sun.org.apache.xerces.internal.jaxp.DocumentBuilderImpl.parse(DocumentBuilderImpl.java:348)
at javax.xml.parsers.DocumentBuilder.parse(DocumentBuilder.java:150)
at org.apache.hadoop.conf.Configuration.parse(Configuration.java:2546)
at org.apache.hadoop.conf.Configuration.parse(Configuration.java:2534)
at org.apache.hadoop.conf.Configuration.loadResource(Configuration.java:2605)
at org.apache.hadoop.conf.Configuration.loadResources(Configuration.java:2558)
at org.apache.hadoop.conf.Configuration.getProps(Configuration.java:2469)
at org.apache.hadoop.conf.Configuration.get(Configuration.java:1043)
at org.apache.hadoop.conf.Configuration.getTrimmed(Configuration.java:1093)
at org.apache.hadoop.conf.Configuration.getClass(Configuration.java:2253)
at org.apache.hadoop.fs.AbstractFileSystem.createFileSystem(AbstractFileSystem.java:159)
at org.apache.hadoop.fs.AbstractFileSystem.get(AbstractFileSystem.java:250)
at org.apache.hadoop.fs.FileContext$2.run(FileContext.java:329)
at org.apache.hadoop.fs.FileContext$2.run(FileContext.java:326)
at java.security.AccessController.doPrivileged(Native Method)
at javax.security.auth.Subject.doAs(Subject.java:422)
at org.apache.hadoop.security.UserGroupInformation.doAs(UserGroupInformation.java:1667)
at org.apache.hadoop.fs.FileContext.getAbstractFileSystem(FileContext.java:326)
at org.apache.hadoop.fs.FileContext.getFileContext(FileContext.java:443)
at org.apache.hadoop.fs.FileContext.getFileContext(FileContext.java:420)
at org.apache.hadoop.fs.FileContext.getLocalFSFileContext(FileContext.java:406)
at org.apache.hadoop.yarn.applications.distributedshell.TestDistributedShell.tearDown(TestDistributedShell.java:133)
REGRESSION: org.apache.hadoop.yarn.applications.distributedshell.TestDistributedShell.testContainerLaunchFailureHandling
Error Message:
java.util.zip.ZipException: invalid stored block lengths
Stack Trace:
java.lang.RuntimeException: java.util.zip.ZipException: invalid stored block lengths
at java.util.zip.InflaterInputStream.read(InflaterInputStream.java:164)
at java.util.zip.InflaterInputStream.read(InflaterInputStream.java:122)
at java.io.FilterInputStream.read(FilterInputStream.java:83)
at com.sun.org.apache.xerces.internal.impl.XMLEntityManager$RewindableInputStream.read(XMLEntityManager.java:2876)
at com.sun.org.apache.xerces.internal.impl.XMLEntityManager.setupCurrentEntity(XMLEntityManager.java:667)
at com.sun.org.apache.xerces.internal.impl.XMLVersionDetector.determineDocVersion(XMLVersionDetector.java:189)
at com.sun.org.apache.xerces.internal.parsers.XML11Configuration.parse(XML11Configuration.java:812)
at com.sun.org.apache.xerces.internal.parsers.XML11Configuration.parse(XML11Configuration.java:777)
at com.sun.org.apache.xerces.internal.parsers.XMLParser.parse(XMLParser.java:141)
at com.sun.org.apache.xerces.internal.parsers.DOMParser.parse(DOMParser.java:243)
at com.sun.org.apache.xerces.internal.jaxp.DocumentBuilderImpl.parse(DocumentBuilderImpl.java:348)
at javax.xml.parsers.DocumentBuilder.parse(DocumentBuilder.java:150)
at org.apache.hadoop.conf.Configuration.parse(Configuration.java:2546)
at org.apache.hadoop.conf.Configuration.parse(Configuration.java:2534)
at org.apache.hadoop.conf.Configuration.loadResource(Configuration.java:2605)
at org.apache.hadoop.conf.Configuration.loadResources(Configuration.java:2558)
at org.apache.hadoop.conf.Configuration.getProps(Configuration.java:2469)
at org.apache.hadoop.conf.Configuration.set(Configuration.java:1205)
at org.apache.hadoop.conf.Configuration.set(Configuration.java:1177)
at org.apache.hadoop.conf.Configuration.setInt(Configuration.java:1349)
at org.apache.hadoop.yarn.applications.distributedshell.TestDistributedShell.setupInternal(TestDistributedShell.java:79)
at org.apache.hadoop.yarn.applications.distributedshell.TestDistributedShell.setup(TestDistributedShell.java:71)
REGRESSION: org.apache.hadoop.yarn.applications.distributedshell.TestDistributedShell.testContainerLaunchFailureHandling
Error Message:
java.util.zip.ZipException: invalid stored block lengths
Stack Trace:
java.lang.RuntimeException: java.util.zip.ZipException: invalid stored block lengths
at java.util.zip.InflaterInputStream.read(InflaterInputStream.java:164)
at java.util.zip.InflaterInputStream.read(InflaterInputStream.java:122)
at java.io.FilterInputStream.read(FilterInputStream.java:83)
at com.sun.org.apache.xerces.internal.impl.XMLEntityManager$RewindableInputStream.read(XMLEntityManager.java:2876)
at com.sun.org.apache.xerces.internal.impl.XMLEntityManager.setupCurrentEntity(XMLEntityManager.java:667)
at com.sun.org.apache.xerces.internal.impl.XMLVersionDetector.determineDocVersion(XMLVersionDetector.java:189)
at com.sun.org.apache.xerces.internal.parsers.XML11Configuration.parse(XML11Configuration.java:812)
at com.sun.org.apache.xerces.internal.parsers.XML11Configuration.parse(XML11Configuration.java:777)
at com.sun.org.apache.xerces.internal.parsers.XMLParser.parse(XMLParser.java:141)
at com.sun.org.apache.xerces.internal.parsers.DOMParser.parse(DOMParser.java:243)
at com.sun.org.apache.xerces.internal.jaxp.DocumentBuilderImpl.parse(DocumentBuilderImpl.java:348)
at javax.xml.parsers.DocumentBuilder.parse(DocumentBuilder.java:150)
at org.apache.hadoop.conf.Configuration.parse(Configuration.java:2546)
at org.apache.hadoop.conf.Configuration.parse(Configuration.java:2534)
at org.apache.hadoop.conf.Configuration.loadResource(Configuration.java:2605)
at org.apache.hadoop.conf.Configuration.loadResources(Configuration.java:2558)
at org.apache.hadoop.conf.Configuration.getProps(Configuration.java:2469)
at org.apache.hadoop.conf.Configuration.get(Configuration.java:1043)
at org.apache.hadoop.conf.Configuration.getTrimmed(Configuration.java:1093)
at org.apache.hadoop.conf.Configuration.getClass(Configuration.java:2253)
at org.apache.hadoop.fs.AbstractFileSystem.createFileSystem(AbstractFileSystem.java:159)
at org.apache.hadoop.fs.AbstractFileSystem.get(AbstractFileSystem.java:250)
at org.apache.hadoop.fs.FileContext$2.run(FileContext.java:329)
at org.apache.hadoop.fs.FileContext$2.run(FileContext.java:326)
at java.security.AccessController.doPrivileged(Native Method)
at javax.security.auth.Subject.doAs(Subject.java:422)
at org.apache.hadoop.security.UserGroupInformation.doAs(UserGroupInformation.java:1667)
at org.apache.hadoop.fs.FileContext.getAbstractFileSystem(FileContext.java:326)
at org.apache.hadoop.fs.FileContext.getFileContext(FileContext.java:443)
at org.apache.hadoop.fs.FileContext.getFileContext(FileContext.java:420)
at org.apache.hadoop.fs.FileContext.getLocalFSFileContext(FileContext.java:406)
at org.apache.hadoop.yarn.applications.distributedshell.TestDistributedShell.tearDown(TestDistributedShell.java:133)