You are viewing a plain text version of this content. The canonical link for it is here.
Posted to yarn-dev@hadoop.apache.org by Apache Jenkins Server <je...@builds.apache.org> on 2013/07/31 02:11:43 UTC

Failed: YARN-956 PreCommit Build #1618

Jira: https://issues.apache.org/jira/browse/YARN-956
Build: https://builds.apache.org/job/PreCommit-YARN-Build/1618/

###################################################################################
########################## LAST 60 LINES OF THE CONSOLE ###########################
[...truncated 13 lines...]
no change for http://svn.apache.org/repos/asf/hadoop/nightly since the previous build
No emails were triggered.
[PreCommit-YARN-Build] $ /bin/bash /tmp/hudson6242506889123165133.sh
32768
Running in Jenkins mode


======================================================================
======================================================================
    Testing patch for YARN-956.
======================================================================
======================================================================


At revision 1508690.
YARN-956 patch is being downloaded at Wed Jul 31 00:11:37 UTC 2013 from
http://issues.apache.org/jira/secure/attachment/12595082/YARN-956-2.patch
cp: cannot stat `/home/jenkins/buildSupport/lib/*': No such file or directory
The patch does not appear to apply with p0 to p2
PATCH APPLICATION FAILED




{color:red}-1 overall{color}.  Here are the results of testing the latest attachment 
  http://issues.apache.org/jira/secure/attachment/12595082/YARN-956-2.patch
  against trunk revision .

    {color:red}-1 patch{color}.  The patch command could not apply the patch.

Console output: https://builds.apache.org/job/PreCommit-YARN-Build/1618//console

This message is automatically generated.


======================================================================
======================================================================
    Adding comment to Jira.
======================================================================
======================================================================


Comment added.
05e1e7668327f0006b21742e25a65d1201b42649 logged out


======================================================================
======================================================================
    Finished build.
======================================================================
======================================================================


Build step 'Execute shell' marked build as failure
Archiving artifacts
[description-setter] Could not determine description.
Recording test results
Email was triggered for: Failure
Sending email for trigger: Failure



###################################################################################
############################## FAILED TESTS (if any) ##############################
No tests ran.

Success: YARN-906 PreCommit Build #1624

Posted by Apache Jenkins Server <je...@builds.apache.org>.
Jira: https://issues.apache.org/jira/browse/YARN-906
Build: https://builds.apache.org/job/PreCommit-YARN-Build/1624/

###################################################################################
########################## LAST 60 LINES OF THE CONSOLE ###########################
[...truncated 2934 lines...]

/bin/kill -9 24440 
kill: No such process
NOP




{color:green}+1 overall{color}.  Here are the results of testing the latest attachment 
  http://issues.apache.org/jira/secure/attachment/12595131/YARN-906.4.patch
  against trunk revision .

    {color:green}+1 @author{color}.  The patch does not contain any @author tags.

    {color:green}+1 tests included{color}.  The patch appears to include 2 new or modified test files.

    {color:green}+1 javac{color}.  The applied patch does not increase the total number of javac compiler warnings.

    {color:green}+1 javadoc{color}.  The javadoc tool did not generate any warning messages.

    {color:green}+1 eclipse:eclipse{color}.  The patch built with eclipse:eclipse.

    {color:green}+1 findbugs{color}.  The patch does not introduce any new Findbugs (version 1.3.9) warnings.

    {color:green}+1 release audit{color}.  The applied patch does not increase the total number of release audit warnings.

    {color:green}+1 core tests{color}.  The patch passed unit tests in hadoop-yarn-project/hadoop-yarn/hadoop-yarn-client hadoop-yarn-project/hadoop-yarn/hadoop-yarn-server/hadoop-yarn-server-nodemanager.

    {color:green}+1 contrib tests{color}.  The patch passed contrib unit tests.

Test results: https://builds.apache.org/job/PreCommit-YARN-Build/1624//testReport/
Console output: https://builds.apache.org/job/PreCommit-YARN-Build/1624//console

This message is automatically generated.


======================================================================
======================================================================
    Adding comment to Jira.
======================================================================
======================================================================


Comment added.
e6a7f0b832abd7609c413f05d2608cab1ec53654 logged out


======================================================================
======================================================================
    Finished build.
======================================================================
======================================================================


Archiving artifacts
Description set: YARN-906
Recording test results
Email was triggered for: Success
Sending email for trigger: Success



###################################################################################
############################## FAILED TESTS (if any) ##############################
All tests passed

Failed: YARN-906 PreCommit Build #1623

Posted by Apache Jenkins Server <je...@builds.apache.org>.
Jira: https://issues.apache.org/jira/browse/YARN-906
Build: https://builds.apache.org/job/PreCommit-YARN-Build/1623/

###################################################################################
########################## LAST 60 LINES OF THE CONSOLE ###########################
[...truncated 2979 lines...]
NOP




{color:red}-1 overall{color}.  Here are the results of testing the latest attachment 
  http://issues.apache.org/jira/secure/attachment/12595125/YARN-906.3.patch
  against trunk revision .

    {color:green}+1 @author{color}.  The patch does not contain any @author tags.

    {color:green}+1 tests included{color}.  The patch appears to include 1 new or modified test files.

    {color:green}+1 javac{color}.  The applied patch does not increase the total number of javac compiler warnings.

    {color:green}+1 javadoc{color}.  The javadoc tool did not generate any warning messages.

    {color:green}+1 eclipse:eclipse{color}.  The patch built with eclipse:eclipse.

    {color:green}+1 findbugs{color}.  The patch does not introduce any new Findbugs (version 1.3.9) warnings.

    {color:green}+1 release audit{color}.  The applied patch does not increase the total number of release audit warnings.

    {color:red}-1 core tests{color}.  The patch failed these unit tests in hadoop-yarn-project/hadoop-yarn/hadoop-yarn-client hadoop-yarn-project/hadoop-yarn/hadoop-yarn-server/hadoop-yarn-server-nodemanager:

                  org.apache.hadoop.yarn.server.nodemanager.containermanager.launcher.TestContainerLaunch

    {color:green}+1 contrib tests{color}.  The patch passed contrib unit tests.

Test results: https://builds.apache.org/job/PreCommit-YARN-Build/1623//testReport/
Console output: https://builds.apache.org/job/PreCommit-YARN-Build/1623//console

This message is automatically generated.


======================================================================
======================================================================
    Adding comment to Jira.
======================================================================
======================================================================


Comment added.
6b48d1207bc4413f98a13398dc1786109a09f80d logged out


======================================================================
======================================================================
    Finished build.
======================================================================
======================================================================


Build step 'Execute shell' marked build as failure
Archiving artifacts
[description-setter] Could not determine description.
Recording test results
Email was triggered for: Failure
Sending email for trigger: Failure



###################################################################################
############################## FAILED TESTS (if any) ##############################
1 tests failed.
FAILED:  org.apache.hadoop.yarn.server.nodemanager.containermanager.launcher.TestContainerLaunch.testDelayedKill

Error Message:
expected:<137> but was:<143>

Stack Trace:
junit.framework.AssertionFailedError: expected:<137> but was:<143>
	at junit.framework.Assert.fail(Assert.java:50)
	at junit.framework.Assert.failNotEquals(Assert.java:287)
	at junit.framework.Assert.assertEquals(Assert.java:67)
	at junit.framework.Assert.assertEquals(Assert.java:199)
	at junit.framework.Assert.assertEquals(Assert.java:205)
	at org.apache.hadoop.yarn.server.nodemanager.containermanager.launcher.TestContainerLaunch.testDelayedKill(TestContainerLaunch.java:599)
	at sun.reflect.NativeMethodAccessorImpl.invoke0(Native Method)
	at sun.reflect.NativeMethodAccessorImpl.invoke(NativeMethodAccessorImpl.java:39)
	at sun.reflect.DelegatingMethodAccessorImpl.invoke(DelegatingMethodAccessorImpl.java:25)
	at java.lang.reflect.Method.invoke(Method.java:597)
	at org.junit.runners.model.FrameworkMethod$1.runReflectiveCall(FrameworkMethod.java:45)
	at org.junit.internal.runners.model.ReflectiveCallable.run(ReflectiveCallable.java:15)
	at org.junit.runners.model.FrameworkMethod.invokeExplosively(FrameworkMethod.java:42)
	at org.junit.internal.runners.statements.InvokeMethod.evaluate(InvokeMethod.java:20)
	at org.junit.internal.runners.statements.RunBefores.evaluate(RunBefores.java:28)
	at org.junit.internal.runners.statements.RunAfters.evaluate(RunAfters.java:30)
	at org.junit.runners.ParentRunner.runLeaf(ParentRunner.java:263)
	at org.junit.runners.BlockJUnit4ClassRunner.runChild(BlockJUnit4ClassRunner.java:68)
	at org.junit.runners.BlockJUnit4ClassRunner.runChild(BlockJUnit4ClassRunner.java:47)
	at org.junit.runners.ParentRunner$3.run(ParentRunner.java:231)
	at org.junit.runners.ParentRunner$1.schedule(ParentRunner.java:60)
	at org.junit.runners.ParentRunner.runChildren(ParentRunner.java:229)
	at org.junit.runners.ParentRunner.access$000(ParentRunner.java:50)
	at org.junit.runners.ParentRunner$2.evaluate(ParentRunner.java:222)
	at org.junit.runners.ParentRunner.run(ParentRunner.java:300)
	at org.apache.maven.surefire.junit4.JUnit4Provider.execute(JUnit4Provider.java:252)
	at org.apache.maven.surefire.junit4.JUnit4Provider.executeTestSet(JUnit4Provider.java:141)
	at org.apache.maven.surefire.junit4.JUnit4Provider.invoke(JUnit4Provider.java:112)
	at sun.reflect.NativeMethodAccessorImpl.invoke0(Native Method)
	at sun.reflect.NativeMethodAccessorImpl.invoke(NativeMethodAccessorImpl.java:39)
	at sun.reflect.DelegatingMethodAccessorImpl.invoke(DelegatingMethodAccessorImpl.java:25)
	at java.lang.reflect.Method.invoke(Method.java:597)
	at org.apache.maven.surefire.util.ReflectionUtils.invokeMethodWithArray(ReflectionUtils.java:189)
	at org.apache.maven.surefire.booter.ProviderFactory$ProviderProxy.invoke(ProviderFactory.java:165)
	at org.apache.maven.surefire.booter.ProviderFactory.invokeProvider(ProviderFactory.java:85)
	at org.apache.maven.surefire.booter.ForkedBooter.runSuitesInProcess(ForkedBooter.java:115)
	at org.apache.maven.surefire.booter.ForkedBooter.main(ForkedBooter.java:75)



Failed: YARN-107 PreCommit Build #1622

Posted by Apache Jenkins Server <je...@builds.apache.org>.
Jira: https://issues.apache.org/jira/browse/YARN-107
Build: https://builds.apache.org/job/PreCommit-YARN-Build/1622/

###################################################################################
########################## LAST 60 LINES OF THE CONSOLE ###########################
[...truncated 2922 lines...]
kill: No such process
NOP




{color:red}-1 overall{color}.  Here are the results of testing the latest attachment 
  http://issues.apache.org/jira/secure/attachment/12595123/YARN-107.2.patch
  against trunk revision .

    {color:green}+1 @author{color}.  The patch does not contain any @author tags.

    {color:green}+1 tests included{color}.  The patch appears to include 2 new or modified test files.

    {color:green}+1 javac{color}.  The applied patch does not increase the total number of javac compiler warnings.

    {color:green}+1 javadoc{color}.  The javadoc tool did not generate any warning messages.

    {color:green}+1 eclipse:eclipse{color}.  The patch built with eclipse:eclipse.

    {color:green}+1 findbugs{color}.  The patch does not introduce any new Findbugs (version 1.3.9) warnings.

        {color:red}-1 release audit{color}.  The applied patch generated 1 release audit warnings.

    {color:green}+1 core tests{color}.  The patch passed unit tests in hadoop-yarn-project/hadoop-yarn/hadoop-yarn-api hadoop-yarn-project/hadoop-yarn/hadoop-yarn-client hadoop-yarn-project/hadoop-yarn/hadoop-yarn-server/hadoop-yarn-server-resourcemanager.

    {color:green}+1 contrib tests{color}.  The patch passed contrib unit tests.

Test results: https://builds.apache.org/job/PreCommit-YARN-Build/1622//testReport/
Release audit warnings: https://builds.apache.org/job/PreCommit-YARN-Build/1622//artifact/trunk/patchprocess/patchReleaseAuditProblems.txt
Console output: https://builds.apache.org/job/PreCommit-YARN-Build/1622//console

This message is automatically generated.


======================================================================
======================================================================
    Adding comment to Jira.
======================================================================
======================================================================


Comment added.
cc5b7ea545a3937f1ff46cdf579f3cf8e18e56af logged out


======================================================================
======================================================================
    Finished build.
======================================================================
======================================================================


Build step 'Execute shell' marked build as failure
Archiving artifacts
[description-setter] Could not determine description.
Recording test results
Email was triggered for: Failure
Sending email for trigger: Failure



###################################################################################
############################## FAILED TESTS (if any) ##############################
All tests passed

Failed: YARN-573 PreCommit Build #1621

Posted by Apache Jenkins Server <je...@builds.apache.org>.
Jira: https://issues.apache.org/jira/browse/YARN-573
Build: https://builds.apache.org/job/PreCommit-YARN-Build/1621/

###################################################################################
########################## LAST 60 LINES OF THE CONSOLE ###########################
[...truncated 2851 lines...]
NOP




{color:red}-1 overall{color}.  Here are the results of testing the latest attachment 
  http://issues.apache.org/jira/secure/attachment/12595114/YARN-573-20130730.1.patch
  against trunk revision .

    {color:green}+1 @author{color}.  The patch does not contain any @author tags.

    {color:red}-1 tests included{color}.  The patch doesn't appear to include any new or modified tests.
                        Please justify why no new tests are needed for this patch.
                        Also please list what manual steps were performed to verify this patch.

    {color:green}+1 javac{color}.  The applied patch does not increase the total number of javac compiler warnings.

    {color:green}+1 javadoc{color}.  The javadoc tool did not generate any warning messages.

    {color:green}+1 eclipse:eclipse{color}.  The patch built with eclipse:eclipse.

    {color:green}+1 findbugs{color}.  The patch does not introduce any new Findbugs (version 1.3.9) warnings.

    {color:green}+1 release audit{color}.  The applied patch does not increase the total number of release audit warnings.

    {color:green}+1 core tests{color}.  The patch passed unit tests in hadoop-yarn-project/hadoop-yarn/hadoop-yarn-server/hadoop-yarn-server-nodemanager.

    {color:green}+1 contrib tests{color}.  The patch passed contrib unit tests.

Test results: https://builds.apache.org/job/PreCommit-YARN-Build/1621//testReport/
Console output: https://builds.apache.org/job/PreCommit-YARN-Build/1621//console

This message is automatically generated.


======================================================================
======================================================================
    Adding comment to Jira.
======================================================================
======================================================================


Comment added.
ae140acfa979715459a5dc8a339085ce68af7f05 logged out


======================================================================
======================================================================
    Finished build.
======================================================================
======================================================================


Build step 'Execute shell' marked build as failure
Archiving artifacts
[description-setter] Could not determine description.
Recording test results
Email was triggered for: Failure
Sending email for trigger: Failure



###################################################################################
############################## FAILED TESTS (if any) ##############################
All tests passed

Failed: YARN-903 PreCommit Build #1620

Posted by Apache Jenkins Server <je...@builds.apache.org>.
Jira: https://issues.apache.org/jira/browse/YARN-903
Build: https://builds.apache.org/job/PreCommit-YARN-Build/1620/

###################################################################################
########################## LAST 60 LINES OF THE CONSOLE ###########################
[...truncated 9 lines...]
no change for http://svn.apache.org/repos/asf/hadoop/nightly since the previous build
No emails were triggered.
[PreCommit-YARN-Build] $ /bin/bash /tmp/hudson4909909286592272780.sh
32768
Running in Jenkins mode


======================================================================
======================================================================
    Testing patch for YARN-903.
======================================================================
======================================================================


At revision 1508714.
YARN-903 patch is being downloaded at Wed Jul 31 02:41:32 UTC 2013 from
http://issues.apache.org/jira/secure/attachment/12595109/YARN-903-20130730.1.patch
cp: cannot stat `/home/jenkins/buildSupport/lib/*': No such file or directory
The patch does not appear to apply with p0 to p2
PATCH APPLICATION FAILED




{color:red}-1 overall{color}.  Here are the results of testing the latest attachment 
  http://issues.apache.org/jira/secure/attachment/12595109/YARN-903-20130730.1.patch
  against trunk revision .

    {color:red}-1 patch{color}.  The patch command could not apply the patch.

Console output: https://builds.apache.org/job/PreCommit-YARN-Build/1620//console

This message is automatically generated.


======================================================================
======================================================================
    Adding comment to Jira.
======================================================================
======================================================================


Comment added.
152f767a27515bd8954d06886c2e1a3c1ab4abd5 logged out


======================================================================
======================================================================
    Finished build.
======================================================================
======================================================================


Build step 'Execute shell' marked build as failure
Archiving artifacts
[description-setter] Could not determine description.
Recording test results
Email was triggered for: Failure
Sending email for trigger: Failure



###################################################################################
############################## FAILED TESTS (if any) ##############################
No tests ran.

Failed: YARN-957 PreCommit Build #1619

Posted by Apache Jenkins Server <je...@builds.apache.org>.
Jira: https://issues.apache.org/jira/browse/YARN-957
Build: https://builds.apache.org/job/PreCommit-YARN-Build/1619/

###################################################################################
########################## LAST 60 LINES OF THE CONSOLE ###########################
[...truncated 3453 lines...]



{color:red}-1 overall{color}.  Here are the results of testing the latest attachment 
  http://issues.apache.org/jira/secure/attachment/12595105/YARN-957-20130730.3.patch
  against trunk revision .

    {color:green}+1 @author{color}.  The patch does not contain any @author tags.

    {color:green}+1 tests included{color}.  The patch appears to include 3 new or modified test files.

    {color:green}+1 javac{color}.  The applied patch does not increase the total number of javac compiler warnings.

    {color:green}+1 javadoc{color}.  The javadoc tool did not generate any warning messages.

    {color:green}+1 eclipse:eclipse{color}.  The patch built with eclipse:eclipse.

    {color:green}+1 findbugs{color}.  The patch does not introduce any new Findbugs (version 1.3.9) warnings.

        {color:red}-1 release audit{color}.  The applied patch generated 1 release audit warnings.

    {color:red}-1 core tests{color}.  The patch failed these unit tests in hadoop-yarn-project/hadoop-yarn/hadoop-yarn-server/hadoop-yarn-server-resourcemanager:

                  org.apache.hadoop.yarn.server.resourcemanager.scheduler.capacity.TestApplicationLimits
                  org.apache.hadoop.yarn.server.resourcemanager.scheduler.capacity.TestLeafQueue

    {color:green}+1 contrib tests{color}.  The patch passed contrib unit tests.

Test results: https://builds.apache.org/job/PreCommit-YARN-Build/1619//testReport/
Release audit warnings: https://builds.apache.org/job/PreCommit-YARN-Build/1619//artifact/trunk/patchprocess/patchReleaseAuditProblems.txt
Console output: https://builds.apache.org/job/PreCommit-YARN-Build/1619//console

This message is automatically generated.


======================================================================
======================================================================
    Adding comment to Jira.
======================================================================
======================================================================


Comment added.
fa5a6a9819fc3451be5ef0879c9161d0f3b35fa7 logged out


======================================================================
======================================================================
    Finished build.
======================================================================
======================================================================


Build step 'Execute shell' marked build as failure
Archiving artifacts
[description-setter] Could not determine description.
Recording test results
Email was triggered for: Failure
Sending email for trigger: Failure



###################################################################################
############################## FAILED TESTS (if any) ##############################
17 tests failed.
REGRESSION:  org.apache.hadoop.yarn.server.resourcemanager.scheduler.capacity.TestApplicationLimits.testHeadroom

Error Message:
org.apache.hadoop.yarn.api.records.ApplicationAttemptId$$EnhancerByMockitoWithCGLIB$$2ae7942c cannot be cast to org.apache.hadoop.yarn.api.records.impl.pb.ApplicationAttemptIdPBImpl

Stack Trace:
java.lang.ClassCastException: org.apache.hadoop.yarn.api.records.ApplicationAttemptId$$EnhancerByMockitoWithCGLIB$$2ae7942c cannot be cast to org.apache.hadoop.yarn.api.records.impl.pb.ApplicationAttemptIdPBImpl
	at org.apache.hadoop.yarn.api.records.impl.pb.ContainerIdPBImpl.convertToProtoFormat(ContainerIdPBImpl.java:84)
	at org.apache.hadoop.yarn.api.records.impl.pb.ContainerIdPBImpl.setApplicationAttemptId(ContainerIdPBImpl.java:72)
	at org.apache.hadoop.yarn.api.records.ContainerId.newInstance(ContainerId.java:43)
	at org.apache.hadoop.yarn.server.resourcemanager.scheduler.AppSchedulingInfo.<init>(AppSchedulingInfo.java:82)
	at org.apache.hadoop.yarn.server.resourcemanager.scheduler.common.fica.FiCaSchedulerApp.<init>(FiCaSchedulerApp.java:124)
	at org.apache.hadoop.yarn.server.resourcemanager.scheduler.capacity.TestApplicationLimits.testHeadroom(TestApplicationLimits.java:507)
	at sun.reflect.NativeMethodAccessorImpl.invoke0(Native Method)
	at sun.reflect.NativeMethodAccessorImpl.invoke(NativeMethodAccessorImpl.java:39)
	at sun.reflect.DelegatingMethodAccessorImpl.invoke(DelegatingMethodAccessorImpl.java:25)
	at java.lang.reflect.Method.invoke(Method.java:597)
	at org.junit.runners.model.FrameworkMethod$1.runReflectiveCall(FrameworkMethod.java:45)
	at org.junit.internal.runners.model.ReflectiveCallable.run(ReflectiveCallable.java:15)
	at org.junit.runners.model.FrameworkMethod.invokeExplosively(FrameworkMethod.java:42)
	at org.junit.internal.runners.statements.InvokeMethod.evaluate(InvokeMethod.java:20)
	at org.junit.internal.runners.statements.RunBefores.evaluate(RunBefores.java:28)
	at org.junit.internal.runners.statements.RunAfters.evaluate(RunAfters.java:30)
	at org.junit.runners.ParentRunner.runLeaf(ParentRunner.java:263)
	at org.junit.runners.BlockJUnit4ClassRunner.runChild(BlockJUnit4ClassRunner.java:68)
	at org.junit.runners.BlockJUnit4ClassRunner.runChild(BlockJUnit4ClassRunner.java:47)
	at org.junit.runners.ParentRunner$3.run(ParentRunner.java:231)
	at org.junit.runners.ParentRunner$1.schedule(ParentRunner.java:60)
	at org.junit.runners.ParentRunner.runChildren(ParentRunner.java:229)
	at org.junit.runners.ParentRunner.access$000(ParentRunner.java:50)
	at org.junit.runners.ParentRunner$2.evaluate(ParentRunner.java:222)
	at org.junit.runners.ParentRunner.run(ParentRunner.java:300)
	at org.apache.maven.surefire.junit4.JUnit4Provider.execute(JUnit4Provider.java:252)
	at org.apache.maven.surefire.junit4.JUnit4Provider.executeTestSet(JUnit4Provider.java:141)
	at org.apache.maven.surefire.junit4.JUnit4Provider.invoke(JUnit4Provider.java:112)
	at sun.reflect.NativeMethodAccessorImpl.invoke0(Native Method)
	at sun.reflect.NativeMethodAccessorImpl.invoke(NativeMethodAccessorImpl.java:39)
	at sun.reflect.DelegatingMethodAccessorImpl.invoke(DelegatingMethodAccessorImpl.java:25)
	at java.lang.reflect.Method.invoke(Method.java:597)
	at org.apache.maven.surefire.util.ReflectionUtils.invokeMethodWithArray(ReflectionUtils.java:189)
	at org.apache.maven.surefire.booter.ProviderFactory$ProviderProxy.invoke(ProviderFactory.java:165)
	at org.apache.maven.surefire.booter.ProviderFactory.invokeProvider(ProviderFactory.java:85)
	at org.apache.maven.surefire.booter.ForkedBooter.runSuitesInProcess(ForkedBooter.java:115)
	at org.apache.maven.surefire.booter.ForkedBooter.main(ForkedBooter.java:75)


REGRESSION:  org.apache.hadoop.yarn.server.resourcemanager.scheduler.capacity.TestLeafQueue.testSingleQueueOneUserMetrics

Error Message:
org.apache.hadoop.yarn.api.records.ApplicationAttemptId$$EnhancerByMockitoWithCGLIB$$b7bc3b94 cannot be cast to org.apache.hadoop.yarn.api.records.impl.pb.ApplicationAttemptIdPBImpl

Stack Trace:
java.lang.ClassCastException: org.apache.hadoop.yarn.api.records.ApplicationAttemptId$$EnhancerByMockitoWithCGLIB$$b7bc3b94 cannot be cast to org.apache.hadoop.yarn.api.records.impl.pb.ApplicationAttemptIdPBImpl
	at org.apache.hadoop.yarn.api.records.impl.pb.ContainerIdPBImpl.convertToProtoFormat(ContainerIdPBImpl.java:84)
	at org.apache.hadoop.yarn.api.records.impl.pb.ContainerIdPBImpl.setApplicationAttemptId(ContainerIdPBImpl.java:72)
	at org.apache.hadoop.yarn.api.records.ContainerId.newInstance(ContainerId.java:43)
	at org.apache.hadoop.yarn.server.resourcemanager.scheduler.AppSchedulingInfo.<init>(AppSchedulingInfo.java:82)
	at org.apache.hadoop.yarn.server.resourcemanager.scheduler.common.fica.FiCaSchedulerApp.<init>(FiCaSchedulerApp.java:124)
	at org.apache.hadoop.yarn.server.resourcemanager.scheduler.capacity.TestLeafQueue.testSingleQueueOneUserMetrics(TestLeafQueue.java:270)
	at sun.reflect.NativeMethodAccessorImpl.invoke0(Native Method)
	at sun.reflect.NativeMethodAccessorImpl.invoke(NativeMethodAccessorImpl.java:39)
	at sun.reflect.DelegatingMethodAccessorImpl.invoke(DelegatingMethodAccessorImpl.java:25)
	at java.lang.reflect.Method.invoke(Method.java:597)
	at org.junit.runners.model.FrameworkMethod$1.runReflectiveCall(FrameworkMethod.java:45)
	at org.junit.internal.runners.model.ReflectiveCallable.run(ReflectiveCallable.java:15)
	at org.junit.runners.model.FrameworkMethod.invokeExplosively(FrameworkMethod.java:42)
	at org.junit.internal.runners.statements.InvokeMethod.evaluate(InvokeMethod.java:20)
	at org.junit.internal.runners.statements.RunBefores.evaluate(RunBefores.java:28)
	at org.junit.internal.runners.statements.RunAfters.evaluate(RunAfters.java:30)
	at org.junit.runners.ParentRunner.runLeaf(ParentRunner.java:263)
	at org.junit.runners.BlockJUnit4ClassRunner.runChild(BlockJUnit4ClassRunner.java:68)
	at org.junit.runners.BlockJUnit4ClassRunner.runChild(BlockJUnit4ClassRunner.java:47)
	at org.junit.runners.ParentRunner$3.run(ParentRunner.java:231)
	at org.junit.runners.ParentRunner$1.schedule(ParentRunner.java:60)
	at org.junit.runners.ParentRunner.runChildren(ParentRunner.java:229)
	at org.junit.runners.ParentRunner.access$000(ParentRunner.java:50)
	at org.junit.runners.ParentRunner$2.evaluate(ParentRunner.java:222)
	at org.junit.runners.ParentRunner.run(ParentRunner.java:300)
	at org.apache.maven.surefire.junit4.JUnit4Provider.execute(JUnit4Provider.java:252)
	at org.apache.maven.surefire.junit4.JUnit4Provider.executeTestSet(JUnit4Provider.java:141)
	at org.apache.maven.surefire.junit4.JUnit4Provider.invoke(JUnit4Provider.java:112)
	at sun.reflect.NativeMethodAccessorImpl.invoke0(Native Method)
	at sun.reflect.NativeMethodAccessorImpl.invoke(NativeMethodAccessorImpl.java:39)
	at sun.reflect.DelegatingMethodAccessorImpl.invoke(DelegatingMethodAccessorImpl.java:25)
	at java.lang.reflect.Method.invoke(Method.java:597)
	at org.apache.maven.surefire.util.ReflectionUtils.invokeMethodWithArray(ReflectionUtils.java:189)
	at org.apache.maven.surefire.booter.ProviderFactory$ProviderProxy.invoke(ProviderFactory.java:165)
	at org.apache.maven.surefire.booter.ProviderFactory.invokeProvider(ProviderFactory.java:85)
	at org.apache.maven.surefire.booter.ForkedBooter.runSuitesInProcess(ForkedBooter.java:115)
	at org.apache.maven.surefire.booter.ForkedBooter.main(ForkedBooter.java:75)


REGRESSION:  org.apache.hadoop.yarn.server.resourcemanager.scheduler.capacity.TestLeafQueue.testUserQueueAcl

Error Message:
org.apache.hadoop.yarn.api.records.ApplicationAttemptId$$EnhancerByMockitoWithCGLIB$$b7bc3b94 cannot be cast to org.apache.hadoop.yarn.api.records.impl.pb.ApplicationAttemptIdPBImpl

Stack Trace:
java.lang.ClassCastException: org.apache.hadoop.yarn.api.records.ApplicationAttemptId$$EnhancerByMockitoWithCGLIB$$b7bc3b94 cannot be cast to org.apache.hadoop.yarn.api.records.impl.pb.ApplicationAttemptIdPBImpl
	at org.apache.hadoop.yarn.api.records.impl.pb.ContainerIdPBImpl.convertToProtoFormat(ContainerIdPBImpl.java:84)
	at org.apache.hadoop.yarn.api.records.impl.pb.ContainerIdPBImpl.setApplicationAttemptId(ContainerIdPBImpl.java:72)
	at org.apache.hadoop.yarn.api.records.ContainerId.newInstance(ContainerId.java:43)
	at org.apache.hadoop.yarn.server.resourcemanager.scheduler.AppSchedulingInfo.<init>(AppSchedulingInfo.java:82)
	at org.apache.hadoop.yarn.server.resourcemanager.scheduler.common.fica.FiCaSchedulerApp.<init>(FiCaSchedulerApp.java:124)
	at org.apache.hadoop.yarn.server.resourcemanager.scheduler.capacity.TestLeafQueue.testUserQueueAcl(TestLeafQueue.java:317)
	at sun.reflect.NativeMethodAccessorImpl.invoke0(Native Method)
	at sun.reflect.NativeMethodAccessorImpl.invoke(NativeMethodAccessorImpl.java:39)
	at sun.reflect.DelegatingMethodAccessorImpl.invoke(DelegatingMethodAccessorImpl.java:25)
	at java.lang.reflect.Method.invoke(Method.java:597)
	at org.junit.runners.model.FrameworkMethod$1.runReflectiveCall(FrameworkMethod.java:45)
	at org.junit.internal.runners.model.ReflectiveCallable.run(ReflectiveCallable.java:15)
	at org.junit.runners.model.FrameworkMethod.invokeExplosively(FrameworkMethod.java:42)
	at org.junit.internal.runners.statements.InvokeMethod.evaluate(InvokeMethod.java:20)
	at org.junit.internal.runners.statements.RunBefores.evaluate(RunBefores.java:28)
	at org.junit.internal.runners.statements.RunAfters.evaluate(RunAfters.java:30)
	at org.junit.runners.ParentRunner.runLeaf(ParentRunner.java:263)
	at org.junit.runners.BlockJUnit4ClassRunner.runChild(BlockJUnit4ClassRunner.java:68)
	at org.junit.runners.BlockJUnit4ClassRunner.runChild(BlockJUnit4ClassRunner.java:47)
	at org.junit.runners.ParentRunner$3.run(ParentRunner.java:231)
	at org.junit.runners.ParentRunner$1.schedule(ParentRunner.java:60)
	at org.junit.runners.ParentRunner.runChildren(ParentRunner.java:229)
	at org.junit.runners.ParentRunner.access$000(ParentRunner.java:50)
	at org.junit.runners.ParentRunner$2.evaluate(ParentRunner.java:222)
	at org.junit.runners.ParentRunner.run(ParentRunner.java:300)
	at org.apache.maven.surefire.junit4.JUnit4Provider.execute(JUnit4Provider.java:252)
	at org.apache.maven.surefire.junit4.JUnit4Provider.executeTestSet(JUnit4Provider.java:141)
	at org.apache.maven.surefire.junit4.JUnit4Provider.invoke(JUnit4Provider.java:112)
	at sun.reflect.NativeMethodAccessorImpl.invoke0(Native Method)
	at sun.reflect.NativeMethodAccessorImpl.invoke(NativeMethodAccessorImpl.java:39)
	at sun.reflect.DelegatingMethodAccessorImpl.invoke(DelegatingMethodAccessorImpl.java:25)
	at java.lang.reflect.Method.invoke(Method.java:597)
	at org.apache.maven.surefire.util.ReflectionUtils.invokeMethodWithArray(ReflectionUtils.java:189)
	at org.apache.maven.surefire.booter.ProviderFactory$ProviderProxy.invoke(ProviderFactory.java:165)
	at org.apache.maven.surefire.booter.ProviderFactory.invokeProvider(ProviderFactory.java:85)
	at org.apache.maven.surefire.booter.ForkedBooter.runSuitesInProcess(ForkedBooter.java:115)
	at org.apache.maven.surefire.booter.ForkedBooter.main(ForkedBooter.java:75)


REGRESSION:  org.apache.hadoop.yarn.server.resourcemanager.scheduler.capacity.TestLeafQueue.testAppAttemptMetrics

Error Message:
org.apache.hadoop.yarn.api.records.ApplicationAttemptId$$EnhancerByMockitoWithCGLIB$$b7bc3b94 cannot be cast to org.apache.hadoop.yarn.api.records.impl.pb.ApplicationAttemptIdPBImpl

Stack Trace:
java.lang.ClassCastException: org.apache.hadoop.yarn.api.records.ApplicationAttemptId$$EnhancerByMockitoWithCGLIB$$b7bc3b94 cannot be cast to org.apache.hadoop.yarn.api.records.impl.pb.ApplicationAttemptIdPBImpl
	at org.apache.hadoop.yarn.api.records.impl.pb.ContainerIdPBImpl.convertToProtoFormat(ContainerIdPBImpl.java:84)
	at org.apache.hadoop.yarn.api.records.impl.pb.ContainerIdPBImpl.setApplicationAttemptId(ContainerIdPBImpl.java:72)
	at org.apache.hadoop.yarn.api.records.ContainerId.newInstance(ContainerId.java:43)
	at org.apache.hadoop.yarn.server.resourcemanager.scheduler.AppSchedulingInfo.<init>(AppSchedulingInfo.java:82)
	at org.apache.hadoop.yarn.server.resourcemanager.scheduler.common.fica.FiCaSchedulerApp.<init>(FiCaSchedulerApp.java:124)
	at org.apache.hadoop.yarn.server.resourcemanager.scheduler.capacity.TestLeafQueue.testAppAttemptMetrics(TestLeafQueue.java:342)
	at sun.reflect.NativeMethodAccessorImpl.invoke0(Native Method)
	at sun.reflect.NativeMethodAccessorImpl.invoke(NativeMethodAccessorImpl.java:39)
	at sun.reflect.DelegatingMethodAccessorImpl.invoke(DelegatingMethodAccessorImpl.java:25)
	at java.lang.reflect.Method.invoke(Method.java:597)
	at org.junit.runners.model.FrameworkMethod$1.runReflectiveCall(FrameworkMethod.java:45)
	at org.junit.internal.runners.model.ReflectiveCallable.run(ReflectiveCallable.java:15)
	at org.junit.runners.model.FrameworkMethod.invokeExplosively(FrameworkMethod.java:42)
	at org.junit.internal.runners.statements.InvokeMethod.evaluate(InvokeMethod.java:20)
	at org.junit.internal.runners.statements.RunBefores.evaluate(RunBefores.java:28)
	at org.junit.internal.runners.statements.RunAfters.evaluate(RunAfters.java:30)
	at org.junit.runners.ParentRunner.runLeaf(ParentRunner.java:263)
	at org.junit.runners.BlockJUnit4ClassRunner.runChild(BlockJUnit4ClassRunner.java:68)
	at org.junit.runners.BlockJUnit4ClassRunner.runChild(BlockJUnit4ClassRunner.java:47)
	at org.junit.runners.ParentRunner$3.run(ParentRunner.java:231)
	at org.junit.runners.ParentRunner$1.schedule(ParentRunner.java:60)
	at org.junit.runners.ParentRunner.runChildren(ParentRunner.java:229)
	at org.junit.runners.ParentRunner.access$000(ParentRunner.java:50)
	at org.junit.runners.ParentRunner$2.evaluate(ParentRunner.java:222)
	at org.junit.runners.ParentRunner.run(ParentRunner.java:300)
	at org.apache.maven.surefire.junit4.JUnit4Provider.execute(JUnit4Provider.java:252)
	at org.apache.maven.surefire.junit4.JUnit4Provider.executeTestSet(JUnit4Provider.java:141)
	at org.apache.maven.surefire.junit4.JUnit4Provider.invoke(JUnit4Provider.java:112)
	at sun.reflect.NativeMethodAccessorImpl.invoke0(Native Method)
	at sun.reflect.NativeMethodAccessorImpl.invoke(NativeMethodAccessorImpl.java:39)
	at sun.reflect.DelegatingMethodAccessorImpl.invoke(DelegatingMethodAccessorImpl.java:25)
	at java.lang.reflect.Method.invoke(Method.java:597)
	at org.apache.maven.surefire.util.ReflectionUtils.invokeMethodWithArray(ReflectionUtils.java:189)
	at org.apache.maven.surefire.booter.ProviderFactory$ProviderProxy.invoke(ProviderFactory.java:165)
	at org.apache.maven.surefire.booter.ProviderFactory.invokeProvider(ProviderFactory.java:85)
	at org.apache.maven.surefire.booter.ForkedBooter.runSuitesInProcess(ForkedBooter.java:115)
	at org.apache.maven.surefire.booter.ForkedBooter.main(ForkedBooter.java:75)


REGRESSION:  org.apache.hadoop.yarn.server.resourcemanager.scheduler.capacity.TestLeafQueue.testSingleQueueWithOneUser

Error Message:
org.apache.hadoop.yarn.api.records.ApplicationAttemptId$$EnhancerByMockitoWithCGLIB$$b7bc3b94 cannot be cast to org.apache.hadoop.yarn.api.records.impl.pb.ApplicationAttemptIdPBImpl

Stack Trace:
java.lang.ClassCastException: org.apache.hadoop.yarn.api.records.ApplicationAttemptId$$EnhancerByMockitoWithCGLIB$$b7bc3b94 cannot be cast to org.apache.hadoop.yarn.api.records.impl.pb.ApplicationAttemptIdPBImpl
	at org.apache.hadoop.yarn.api.records.impl.pb.ContainerIdPBImpl.convertToProtoFormat(ContainerIdPBImpl.java:84)
	at org.apache.hadoop.yarn.api.records.impl.pb.ContainerIdPBImpl.setApplicationAttemptId(ContainerIdPBImpl.java:72)
	at org.apache.hadoop.yarn.api.records.ContainerId.newInstance(ContainerId.java:43)
	at org.apache.hadoop.yarn.server.resourcemanager.scheduler.AppSchedulingInfo.<init>(AppSchedulingInfo.java:82)
	at org.apache.hadoop.yarn.server.resourcemanager.scheduler.common.fica.FiCaSchedulerApp.<init>(FiCaSchedulerApp.java:124)
	at org.apache.hadoop.yarn.server.resourcemanager.scheduler.capacity.TestLeafQueue.testSingleQueueWithOneUser(TestLeafQueue.java:392)
	at sun.reflect.NativeMethodAccessorImpl.invoke0(Native Method)
	at sun.reflect.NativeMethodAccessorImpl.invoke(NativeMethodAccessorImpl.java:39)
	at sun.reflect.DelegatingMethodAccessorImpl.invoke(DelegatingMethodAccessorImpl.java:25)
	at java.lang.reflect.Method.invoke(Method.java:597)
	at org.junit.runners.model.FrameworkMethod$1.runReflectiveCall(FrameworkMethod.java:45)
	at org.junit.internal.runners.model.ReflectiveCallable.run(ReflectiveCallable.java:15)
	at org.junit.runners.model.FrameworkMethod.invokeExplosively(FrameworkMethod.java:42)
	at org.junit.internal.runners.statements.InvokeMethod.evaluate(InvokeMethod.java:20)
	at org.junit.internal.runners.statements.RunBefores.evaluate(RunBefores.java:28)
	at org.junit.internal.runners.statements.RunAfters.evaluate(RunAfters.java:30)
	at org.junit.runners.ParentRunner.runLeaf(ParentRunner.java:263)
	at org.junit.runners.BlockJUnit4ClassRunner.runChild(BlockJUnit4ClassRunner.java:68)
	at org.junit.runners.BlockJUnit4ClassRunner.runChild(BlockJUnit4ClassRunner.java:47)
	at org.junit.runners.ParentRunner$3.run(ParentRunner.java:231)
	at org.junit.runners.ParentRunner$1.schedule(ParentRunner.java:60)
	at org.junit.runners.ParentRunner.runChildren(ParentRunner.java:229)
	at org.junit.runners.ParentRunner.access$000(ParentRunner.java:50)
	at org.junit.runners.ParentRunner$2.evaluate(ParentRunner.java:222)
	at org.junit.runners.ParentRunner.run(ParentRunner.java:300)
	at org.apache.maven.surefire.junit4.JUnit4Provider.execute(JUnit4Provider.java:252)
	at org.apache.maven.surefire.junit4.JUnit4Provider.executeTestSet(JUnit4Provider.java:141)
	at org.apache.maven.surefire.junit4.JUnit4Provider.invoke(JUnit4Provider.java:112)
	at sun.reflect.NativeMethodAccessorImpl.invoke0(Native Method)
	at sun.reflect.NativeMethodAccessorImpl.invoke(NativeMethodAccessorImpl.java:39)
	at sun.reflect.DelegatingMethodAccessorImpl.invoke(DelegatingMethodAccessorImpl.java:25)
	at java.lang.reflect.Method.invoke(Method.java:597)
	at org.apache.maven.surefire.util.ReflectionUtils.invokeMethodWithArray(ReflectionUtils.java:189)
	at org.apache.maven.surefire.booter.ProviderFactory$ProviderProxy.invoke(ProviderFactory.java:165)
	at org.apache.maven.surefire.booter.ProviderFactory.invokeProvider(ProviderFactory.java:85)
	at org.apache.maven.surefire.booter.ForkedBooter.runSuitesInProcess(ForkedBooter.java:115)
	at org.apache.maven.surefire.booter.ForkedBooter.main(ForkedBooter.java:75)


REGRESSION:  org.apache.hadoop.yarn.server.resourcemanager.scheduler.capacity.TestLeafQueue.testUserLimits

Error Message:
org.apache.hadoop.yarn.api.records.ApplicationAttemptId$$EnhancerByMockitoWithCGLIB$$b7bc3b94 cannot be cast to org.apache.hadoop.yarn.api.records.impl.pb.ApplicationAttemptIdPBImpl

Stack Trace:
java.lang.ClassCastException: org.apache.hadoop.yarn.api.records.ApplicationAttemptId$$EnhancerByMockitoWithCGLIB$$b7bc3b94 cannot be cast to org.apache.hadoop.yarn.api.records.impl.pb.ApplicationAttemptIdPBImpl
	at org.apache.hadoop.yarn.api.records.impl.pb.ContainerIdPBImpl.convertToProtoFormat(ContainerIdPBImpl.java:84)
	at org.apache.hadoop.yarn.api.records.impl.pb.ContainerIdPBImpl.setApplicationAttemptId(ContainerIdPBImpl.java:72)
	at org.apache.hadoop.yarn.api.records.ContainerId.newInstance(ContainerId.java:43)
	at org.apache.hadoop.yarn.server.resourcemanager.scheduler.AppSchedulingInfo.<init>(AppSchedulingInfo.java:82)
	at org.apache.hadoop.yarn.server.resourcemanager.scheduler.common.fica.FiCaSchedulerApp.<init>(FiCaSchedulerApp.java:124)
	at org.apache.hadoop.yarn.server.resourcemanager.scheduler.capacity.TestLeafQueue.testUserLimits(TestLeafQueue.java:517)
	at sun.reflect.NativeMethodAccessorImpl.invoke0(Native Method)
	at sun.reflect.NativeMethodAccessorImpl.invoke(NativeMethodAccessorImpl.java:39)
	at sun.reflect.DelegatingMethodAccessorImpl.invoke(DelegatingMethodAccessorImpl.java:25)
	at java.lang.reflect.Method.invoke(Method.java:597)
	at org.junit.runners.model.FrameworkMethod$1.runReflectiveCall(FrameworkMethod.java:45)
	at org.junit.internal.runners.model.ReflectiveCallable.run(ReflectiveCallable.java:15)
	at org.junit.runners.model.FrameworkMethod.invokeExplosively(FrameworkMethod.java:42)
	at org.junit.internal.runners.statements.InvokeMethod.evaluate(InvokeMethod.java:20)
	at org.junit.internal.runners.statements.RunBefores.evaluate(RunBefores.java:28)
	at org.junit.internal.runners.statements.RunAfters.evaluate(RunAfters.java:30)
	at org.junit.runners.ParentRunner.runLeaf(ParentRunner.java:263)
	at org.junit.runners.BlockJUnit4ClassRunner.runChild(BlockJUnit4ClassRunner.java:68)
	at org.junit.runners.BlockJUnit4ClassRunner.runChild(BlockJUnit4ClassRunner.java:47)
	at org.junit.runners.ParentRunner$3.run(ParentRunner.java:231)
	at org.junit.runners.ParentRunner$1.schedule(ParentRunner.java:60)
	at org.junit.runners.ParentRunner.runChildren(ParentRunner.java:229)
	at org.junit.runners.ParentRunner.access$000(ParentRunner.java:50)
	at org.junit.runners.ParentRunner$2.evaluate(ParentRunner.java:222)
	at org.junit.runners.ParentRunner.run(ParentRunner.java:300)
	at org.apache.maven.surefire.junit4.JUnit4Provider.execute(JUnit4Provider.java:252)
	at org.apache.maven.surefire.junit4.JUnit4Provider.executeTestSet(JUnit4Provider.java:141)
	at org.apache.maven.surefire.junit4.JUnit4Provider.invoke(JUnit4Provider.java:112)
	at sun.reflect.NativeMethodAccessorImpl.invoke0(Native Method)
	at sun.reflect.NativeMethodAccessorImpl.invoke(NativeMethodAccessorImpl.java:39)
	at sun.reflect.DelegatingMethodAccessorImpl.invoke(DelegatingMethodAccessorImpl.java:25)
	at java.lang.reflect.Method.invoke(Method.java:597)
	at org.apache.maven.surefire.util.ReflectionUtils.invokeMethodWithArray(ReflectionUtils.java:189)
	at org.apache.maven.surefire.booter.ProviderFactory$ProviderProxy.invoke(ProviderFactory.java:165)
	at org.apache.maven.surefire.booter.ProviderFactory.invokeProvider(ProviderFactory.java:85)
	at org.apache.maven.surefire.booter.ForkedBooter.runSuitesInProcess(ForkedBooter.java:115)
	at org.apache.maven.surefire.booter.ForkedBooter.main(ForkedBooter.java:75)


REGRESSION:  org.apache.hadoop.yarn.server.resourcemanager.scheduler.capacity.TestLeafQueue.testHeadroomWithMaxCap

Error Message:
org.apache.hadoop.yarn.api.records.ApplicationAttemptId$$EnhancerByMockitoWithCGLIB$$b7bc3b94 cannot be cast to org.apache.hadoop.yarn.api.records.impl.pb.ApplicationAttemptIdPBImpl

Stack Trace:
java.lang.ClassCastException: org.apache.hadoop.yarn.api.records.ApplicationAttemptId$$EnhancerByMockitoWithCGLIB$$b7bc3b94 cannot be cast to org.apache.hadoop.yarn.api.records.impl.pb.ApplicationAttemptIdPBImpl
	at org.apache.hadoop.yarn.api.records.impl.pb.ContainerIdPBImpl.convertToProtoFormat(ContainerIdPBImpl.java:84)
	at org.apache.hadoop.yarn.api.records.impl.pb.ContainerIdPBImpl.setApplicationAttemptId(ContainerIdPBImpl.java:72)
	at org.apache.hadoop.yarn.api.records.ContainerId.newInstance(ContainerId.java:43)
	at org.apache.hadoop.yarn.server.resourcemanager.scheduler.AppSchedulingInfo.<init>(AppSchedulingInfo.java:82)
	at org.apache.hadoop.yarn.server.resourcemanager.scheduler.common.fica.FiCaSchedulerApp.<init>(FiCaSchedulerApp.java:124)
	at org.apache.hadoop.yarn.server.resourcemanager.scheduler.capacity.TestLeafQueue.testHeadroomWithMaxCap(TestLeafQueue.java:611)
	at sun.reflect.NativeMethodAccessorImpl.invoke0(Native Method)
	at sun.reflect.NativeMethodAccessorImpl.invoke(NativeMethodAccessorImpl.java:39)
	at sun.reflect.DelegatingMethodAccessorImpl.invoke(DelegatingMethodAccessorImpl.java:25)
	at java.lang.reflect.Method.invoke(Method.java:597)
	at org.junit.runners.model.FrameworkMethod$1.runReflectiveCall(FrameworkMethod.java:45)
	at org.junit.internal.runners.model.ReflectiveCallable.run(ReflectiveCallable.java:15)
	at org.junit.runners.model.FrameworkMethod.invokeExplosively(FrameworkMethod.java:42)
	at org.junit.internal.runners.statements.InvokeMethod.evaluate(InvokeMethod.java:20)
	at org.junit.internal.runners.statements.RunBefores.evaluate(RunBefores.java:28)
	at org.junit.internal.runners.statements.RunAfters.evaluate(RunAfters.java:30)
	at org.junit.runners.ParentRunner.runLeaf(ParentRunner.java:263)
	at org.junit.runners.BlockJUnit4ClassRunner.runChild(BlockJUnit4ClassRunner.java:68)
	at org.junit.runners.BlockJUnit4ClassRunner.runChild(BlockJUnit4ClassRunner.java:47)
	at org.junit.runners.ParentRunner$3.run(ParentRunner.java:231)
	at org.junit.runners.ParentRunner$1.schedule(ParentRunner.java:60)
	at org.junit.runners.ParentRunner.runChildren(ParentRunner.java:229)
	at org.junit.runners.ParentRunner.access$000(ParentRunner.java:50)
	at org.junit.runners.ParentRunner$2.evaluate(ParentRunner.java:222)
	at org.junit.runners.ParentRunner.run(ParentRunner.java:300)
	at org.apache.maven.surefire.junit4.JUnit4Provider.execute(JUnit4Provider.java:252)
	at org.apache.maven.surefire.junit4.JUnit4Provider.executeTestSet(JUnit4Provider.java:141)
	at org.apache.maven.surefire.junit4.JUnit4Provider.invoke(JUnit4Provider.java:112)
	at sun.reflect.NativeMethodAccessorImpl.invoke0(Native Method)
	at sun.reflect.NativeMethodAccessorImpl.invoke(NativeMethodAccessorImpl.java:39)
	at sun.reflect.DelegatingMethodAccessorImpl.invoke(DelegatingMethodAccessorImpl.java:25)
	at java.lang.reflect.Method.invoke(Method.java:597)
	at org.apache.maven.surefire.util.ReflectionUtils.invokeMethodWithArray(ReflectionUtils.java:189)
	at org.apache.maven.surefire.booter.ProviderFactory$ProviderProxy.invoke(ProviderFactory.java:165)
	at org.apache.maven.surefire.booter.ProviderFactory.invokeProvider(ProviderFactory.java:85)
	at org.apache.maven.surefire.booter.ForkedBooter.runSuitesInProcess(ForkedBooter.java:115)
	at org.apache.maven.surefire.booter.ForkedBooter.main(ForkedBooter.java:75)


REGRESSION:  org.apache.hadoop.yarn.server.resourcemanager.scheduler.capacity.TestLeafQueue.testSingleQueueWithMultipleUsers

Error Message:
org.apache.hadoop.yarn.api.records.ApplicationAttemptId$$EnhancerByMockitoWithCGLIB$$b7bc3b94 cannot be cast to org.apache.hadoop.yarn.api.records.impl.pb.ApplicationAttemptIdPBImpl

Stack Trace:
java.lang.ClassCastException: org.apache.hadoop.yarn.api.records.ApplicationAttemptId$$EnhancerByMockitoWithCGLIB$$b7bc3b94 cannot be cast to org.apache.hadoop.yarn.api.records.impl.pb.ApplicationAttemptIdPBImpl
	at org.apache.hadoop.yarn.api.records.impl.pb.ContainerIdPBImpl.convertToProtoFormat(ContainerIdPBImpl.java:84)
	at org.apache.hadoop.yarn.api.records.impl.pb.ContainerIdPBImpl.setApplicationAttemptId(ContainerIdPBImpl.java:72)
	at org.apache.hadoop.yarn.api.records.ContainerId.newInstance(ContainerId.java:43)
	at org.apache.hadoop.yarn.server.resourcemanager.scheduler.AppSchedulingInfo.<init>(AppSchedulingInfo.java:82)
	at org.apache.hadoop.yarn.server.resourcemanager.scheduler.common.fica.FiCaSchedulerApp.<init>(FiCaSchedulerApp.java:124)
	at org.apache.hadoop.yarn.server.resourcemanager.scheduler.capacity.TestLeafQueue.testSingleQueueWithMultipleUsers(TestLeafQueue.java:722)
	at sun.reflect.NativeMethodAccessorImpl.invoke0(Native Method)
	at sun.reflect.NativeMethodAccessorImpl.invoke(NativeMethodAccessorImpl.java:39)
	at sun.reflect.DelegatingMethodAccessorImpl.invoke(DelegatingMethodAccessorImpl.java:25)
	at java.lang.reflect.Method.invoke(Method.java:597)
	at org.junit.runners.model.FrameworkMethod$1.runReflectiveCall(FrameworkMethod.java:45)
	at org.junit.internal.runners.model.ReflectiveCallable.run(ReflectiveCallable.java:15)
	at org.junit.runners.model.FrameworkMethod.invokeExplosively(FrameworkMethod.java:42)
	at org.junit.internal.runners.statements.InvokeMethod.evaluate(InvokeMethod.java:20)
	at org.junit.internal.runners.statements.RunBefores.evaluate(RunBefores.java:28)
	at org.junit.internal.runners.statements.RunAfters.evaluate(RunAfters.java:30)
	at org.junit.runners.ParentRunner.runLeaf(ParentRunner.java:263)
	at org.junit.runners.BlockJUnit4ClassRunner.runChild(BlockJUnit4ClassRunner.java:68)
	at org.junit.runners.BlockJUnit4ClassRunner.runChild(BlockJUnit4ClassRunner.java:47)
	at org.junit.runners.ParentRunner$3.run(ParentRunner.java:231)
	at org.junit.runners.ParentRunner$1.schedule(ParentRunner.java:60)
	at org.junit.runners.ParentRunner.runChildren(ParentRunner.java:229)
	at org.junit.runners.ParentRunner.access$000(ParentRunner.java:50)
	at org.junit.runners.ParentRunner$2.evaluate(ParentRunner.java:222)
	at org.junit.runners.ParentRunner.run(ParentRunner.java:300)
	at org.apache.maven.surefire.junit4.JUnit4Provider.execute(JUnit4Provider.java:252)
	at org.apache.maven.surefire.junit4.JUnit4Provider.executeTestSet(JUnit4Provider.java:141)
	at org.apache.maven.surefire.junit4.JUnit4Provider.invoke(JUnit4Provider.java:112)
	at sun.reflect.NativeMethodAccessorImpl.invoke0(Native Method)
	at sun.reflect.NativeMethodAccessorImpl.invoke(NativeMethodAccessorImpl.java:39)
	at sun.reflect.DelegatingMethodAccessorImpl.invoke(DelegatingMethodAccessorImpl.java:25)
	at java.lang.reflect.Method.invoke(Method.java:597)
	at org.apache.maven.surefire.util.ReflectionUtils.invokeMethodWithArray(ReflectionUtils.java:189)
	at org.apache.maven.surefire.booter.ProviderFactory$ProviderProxy.invoke(ProviderFactory.java:165)
	at org.apache.maven.surefire.booter.ProviderFactory.invokeProvider(ProviderFactory.java:85)
	at org.apache.maven.surefire.booter.ForkedBooter.runSuitesInProcess(ForkedBooter.java:115)
	at org.apache.maven.surefire.booter.ForkedBooter.main(ForkedBooter.java:75)


REGRESSION:  org.apache.hadoop.yarn.server.resourcemanager.scheduler.capacity.TestLeafQueue.testReservation

Error Message:
org.apache.hadoop.yarn.api.records.ApplicationAttemptId$$EnhancerByMockitoWithCGLIB$$b7bc3b94 cannot be cast to org.apache.hadoop.yarn.api.records.impl.pb.ApplicationAttemptIdPBImpl

Stack Trace:
java.lang.ClassCastException: org.apache.hadoop.yarn.api.records.ApplicationAttemptId$$EnhancerByMockitoWithCGLIB$$b7bc3b94 cannot be cast to org.apache.hadoop.yarn.api.records.impl.pb.ApplicationAttemptIdPBImpl
	at org.apache.hadoop.yarn.api.records.impl.pb.ContainerIdPBImpl.convertToProtoFormat(ContainerIdPBImpl.java:84)
	at org.apache.hadoop.yarn.api.records.impl.pb.ContainerIdPBImpl.setApplicationAttemptId(ContainerIdPBImpl.java:72)
	at org.apache.hadoop.yarn.api.records.ContainerId.newInstance(ContainerId.java:43)
	at org.apache.hadoop.yarn.server.resourcemanager.scheduler.AppSchedulingInfo.<init>(AppSchedulingInfo.java:82)
	at org.apache.hadoop.yarn.server.resourcemanager.scheduler.common.fica.FiCaSchedulerApp.<init>(FiCaSchedulerApp.java:124)
	at org.apache.hadoop.yarn.server.resourcemanager.scheduler.capacity.TestLeafQueue.testReservation(TestLeafQueue.java:898)
	at sun.reflect.NativeMethodAccessorImpl.invoke0(Native Method)
	at sun.reflect.NativeMethodAccessorImpl.invoke(NativeMethodAccessorImpl.java:39)
	at sun.reflect.DelegatingMethodAccessorImpl.invoke(DelegatingMethodAccessorImpl.java:25)
	at java.lang.reflect.Method.invoke(Method.java:597)
	at org.junit.runners.model.FrameworkMethod$1.runReflectiveCall(FrameworkMethod.java:45)
	at org.junit.internal.runners.model.ReflectiveCallable.run(ReflectiveCallable.java:15)
	at org.junit.runners.model.FrameworkMethod.invokeExplosively(FrameworkMethod.java:42)
	at org.junit.internal.runners.statements.InvokeMethod.evaluate(InvokeMethod.java:20)
	at org.junit.internal.runners.statements.RunBefores.evaluate(RunBefores.java:28)
	at org.junit.internal.runners.statements.RunAfters.evaluate(RunAfters.java:30)
	at org.junit.runners.ParentRunner.runLeaf(ParentRunner.java:263)
	at org.junit.runners.BlockJUnit4ClassRunner.runChild(BlockJUnit4ClassRunner.java:68)
	at org.junit.runners.BlockJUnit4ClassRunner.runChild(BlockJUnit4ClassRunner.java:47)
	at org.junit.runners.ParentRunner$3.run(ParentRunner.java:231)
	at org.junit.runners.ParentRunner$1.schedule(ParentRunner.java:60)
	at org.junit.runners.ParentRunner.runChildren(ParentRunner.java:229)
	at org.junit.runners.ParentRunner.access$000(ParentRunner.java:50)
	at org.junit.runners.ParentRunner$2.evaluate(ParentRunner.java:222)
	at org.junit.runners.ParentRunner.run(ParentRunner.java:300)
	at org.apache.maven.surefire.junit4.JUnit4Provider.execute(JUnit4Provider.java:252)
	at org.apache.maven.surefire.junit4.JUnit4Provider.executeTestSet(JUnit4Provider.java:141)
	at org.apache.maven.surefire.junit4.JUnit4Provider.invoke(JUnit4Provider.java:112)
	at sun.reflect.NativeMethodAccessorImpl.invoke0(Native Method)
	at sun.reflect.NativeMethodAccessorImpl.invoke(NativeMethodAccessorImpl.java:39)
	at sun.reflect.DelegatingMethodAccessorImpl.invoke(DelegatingMethodAccessorImpl.java:25)
	at java.lang.reflect.Method.invoke(Method.java:597)
	at org.apache.maven.surefire.util.ReflectionUtils.invokeMethodWithArray(ReflectionUtils.java:189)
	at org.apache.maven.surefire.booter.ProviderFactory$ProviderProxy.invoke(ProviderFactory.java:165)
	at org.apache.maven.surefire.booter.ProviderFactory.invokeProvider(ProviderFactory.java:85)
	at org.apache.maven.surefire.booter.ForkedBooter.runSuitesInProcess(ForkedBooter.java:115)
	at org.apache.maven.surefire.booter.ForkedBooter.main(ForkedBooter.java:75)


REGRESSION:  org.apache.hadoop.yarn.server.resourcemanager.scheduler.capacity.TestLeafQueue.testStolenReservedContainer

Error Message:
org.apache.hadoop.yarn.api.records.ApplicationAttemptId$$EnhancerByMockitoWithCGLIB$$b7bc3b94 cannot be cast to org.apache.hadoop.yarn.api.records.impl.pb.ApplicationAttemptIdPBImpl

Stack Trace:
java.lang.ClassCastException: org.apache.hadoop.yarn.api.records.ApplicationAttemptId$$EnhancerByMockitoWithCGLIB$$b7bc3b94 cannot be cast to org.apache.hadoop.yarn.api.records.impl.pb.ApplicationAttemptIdPBImpl
	at org.apache.hadoop.yarn.api.records.impl.pb.ContainerIdPBImpl.convertToProtoFormat(ContainerIdPBImpl.java:84)
	at org.apache.hadoop.yarn.api.records.impl.pb.ContainerIdPBImpl.setApplicationAttemptId(ContainerIdPBImpl.java:72)
	at org.apache.hadoop.yarn.api.records.ContainerId.newInstance(ContainerId.java:43)
	at org.apache.hadoop.yarn.server.resourcemanager.scheduler.AppSchedulingInfo.<init>(AppSchedulingInfo.java:82)
	at org.apache.hadoop.yarn.server.resourcemanager.scheduler.common.fica.FiCaSchedulerApp.<init>(FiCaSchedulerApp.java:124)
	at org.apache.hadoop.yarn.server.resourcemanager.scheduler.capacity.TestLeafQueue.testStolenReservedContainer(TestLeafQueue.java:1000)
	at sun.reflect.NativeMethodAccessorImpl.invoke0(Native Method)
	at sun.reflect.NativeMethodAccessorImpl.invoke(NativeMethodAccessorImpl.java:39)
	at sun.reflect.DelegatingMethodAccessorImpl.invoke(DelegatingMethodAccessorImpl.java:25)
	at java.lang.reflect.Method.invoke(Method.java:597)
	at org.junit.runners.model.FrameworkMethod$1.runReflectiveCall(FrameworkMethod.java:45)
	at org.junit.internal.runners.model.ReflectiveCallable.run(ReflectiveCallable.java:15)
	at org.junit.runners.model.FrameworkMethod.invokeExplosively(FrameworkMethod.java:42)
	at org.junit.internal.runners.statements.InvokeMethod.evaluate(InvokeMethod.java:20)
	at org.junit.internal.runners.statements.RunBefores.evaluate(RunBefores.java:28)
	at org.junit.internal.runners.statements.RunAfters.evaluate(RunAfters.java:30)
	at org.junit.runners.ParentRunner.runLeaf(ParentRunner.java:263)
	at org.junit.runners.BlockJUnit4ClassRunner.runChild(BlockJUnit4ClassRunner.java:68)
	at org.junit.runners.BlockJUnit4ClassRunner.runChild(BlockJUnit4ClassRunner.java:47)
	at org.junit.runners.ParentRunner$3.run(ParentRunner.java:231)
	at org.junit.runners.ParentRunner$1.schedule(ParentRunner.java:60)
	at org.junit.runners.ParentRunner.runChildren(ParentRunner.java:229)
	at org.junit.runners.ParentRunner.access$000(ParentRunner.java:50)
	at org.junit.runners.ParentRunner$2.evaluate(ParentRunner.java:222)
	at org.junit.runners.ParentRunner.run(ParentRunner.java:300)
	at org.apache.maven.surefire.junit4.JUnit4Provider.execute(JUnit4Provider.java:252)
	at org.apache.maven.surefire.junit4.JUnit4Provider.executeTestSet(JUnit4Provider.java:141)
	at org.apache.maven.surefire.junit4.JUnit4Provider.invoke(JUnit4Provider.java:112)
	at sun.reflect.NativeMethodAccessorImpl.invoke0(Native Method)
	at sun.reflect.NativeMethodAccessorImpl.invoke(NativeMethodAccessorImpl.java:39)
	at sun.reflect.DelegatingMethodAccessorImpl.invoke(DelegatingMethodAccessorImpl.java:25)
	at java.lang.reflect.Method.invoke(Method.java:597)
	at org.apache.maven.surefire.util.ReflectionUtils.invokeMethodWithArray(ReflectionUtils.java:189)
	at org.apache.maven.surefire.booter.ProviderFactory$ProviderProxy.invoke(ProviderFactory.java:165)
	at org.apache.maven.surefire.booter.ProviderFactory.invokeProvider(ProviderFactory.java:85)
	at org.apache.maven.surefire.booter.ForkedBooter.runSuitesInProcess(ForkedBooter.java:115)
	at org.apache.maven.surefire.booter.ForkedBooter.main(ForkedBooter.java:75)


REGRESSION:  org.apache.hadoop.yarn.server.resourcemanager.scheduler.capacity.TestLeafQueue.testReservationExchange

Error Message:
org.apache.hadoop.yarn.api.records.ApplicationAttemptId$$EnhancerByMockitoWithCGLIB$$b7bc3b94 cannot be cast to org.apache.hadoop.yarn.api.records.impl.pb.ApplicationAttemptIdPBImpl

Stack Trace:
java.lang.ClassCastException: org.apache.hadoop.yarn.api.records.ApplicationAttemptId$$EnhancerByMockitoWithCGLIB$$b7bc3b94 cannot be cast to org.apache.hadoop.yarn.api.records.impl.pb.ApplicationAttemptIdPBImpl
	at org.apache.hadoop.yarn.api.records.impl.pb.ContainerIdPBImpl.convertToProtoFormat(ContainerIdPBImpl.java:84)
	at org.apache.hadoop.yarn.api.records.impl.pb.ContainerIdPBImpl.setApplicationAttemptId(ContainerIdPBImpl.java:72)
	at org.apache.hadoop.yarn.api.records.ContainerId.newInstance(ContainerId.java:43)
	at org.apache.hadoop.yarn.server.resourcemanager.scheduler.AppSchedulingInfo.<init>(AppSchedulingInfo.java:82)
	at org.apache.hadoop.yarn.server.resourcemanager.scheduler.common.fica.FiCaSchedulerApp.<init>(FiCaSchedulerApp.java:124)
	at org.apache.hadoop.yarn.server.resourcemanager.scheduler.capacity.TestLeafQueue.testReservationExchange(TestLeafQueue.java:1101)
	at sun.reflect.NativeMethodAccessorImpl.invoke0(Native Method)
	at sun.reflect.NativeMethodAccessorImpl.invoke(NativeMethodAccessorImpl.java:39)
	at sun.reflect.DelegatingMethodAccessorImpl.invoke(DelegatingMethodAccessorImpl.java:25)
	at java.lang.reflect.Method.invoke(Method.java:597)
	at org.junit.runners.model.FrameworkMethod$1.runReflectiveCall(FrameworkMethod.java:45)
	at org.junit.internal.runners.model.ReflectiveCallable.run(ReflectiveCallable.java:15)
	at org.junit.runners.model.FrameworkMethod.invokeExplosively(FrameworkMethod.java:42)
	at org.junit.internal.runners.statements.InvokeMethod.evaluate(InvokeMethod.java:20)
	at org.junit.internal.runners.statements.RunBefores.evaluate(RunBefores.java:28)
	at org.junit.internal.runners.statements.RunAfters.evaluate(RunAfters.java:30)
	at org.junit.runners.ParentRunner.runLeaf(ParentRunner.java:263)
	at org.junit.runners.BlockJUnit4ClassRunner.runChild(BlockJUnit4ClassRunner.java:68)
	at org.junit.runners.BlockJUnit4ClassRunner.runChild(BlockJUnit4ClassRunner.java:47)
	at org.junit.runners.ParentRunner$3.run(ParentRunner.java:231)
	at org.junit.runners.ParentRunner$1.schedule(ParentRunner.java:60)
	at org.junit.runners.ParentRunner.runChildren(ParentRunner.java:229)
	at org.junit.runners.ParentRunner.access$000(ParentRunner.java:50)
	at org.junit.runners.ParentRunner$2.evaluate(ParentRunner.java:222)
	at org.junit.runners.ParentRunner.run(ParentRunner.java:300)
	at org.apache.maven.surefire.junit4.JUnit4Provider.execute(JUnit4Provider.java:252)
	at org.apache.maven.surefire.junit4.JUnit4Provider.executeTestSet(JUnit4Provider.java:141)
	at org.apache.maven.surefire.junit4.JUnit4Provider.invoke(JUnit4Provider.java:112)
	at sun.reflect.NativeMethodAccessorImpl.invoke0(Native Method)
	at sun.reflect.NativeMethodAccessorImpl.invoke(NativeMethodAccessorImpl.java:39)
	at sun.reflect.DelegatingMethodAccessorImpl.invoke(DelegatingMethodAccessorImpl.java:25)
	at java.lang.reflect.Method.invoke(Method.java:597)
	at org.apache.maven.surefire.util.ReflectionUtils.invokeMethodWithArray(ReflectionUtils.java:189)
	at org.apache.maven.surefire.booter.ProviderFactory$ProviderProxy.invoke(ProviderFactory.java:165)
	at org.apache.maven.surefire.booter.ProviderFactory.invokeProvider(ProviderFactory.java:85)
	at org.apache.maven.surefire.booter.ForkedBooter.runSuitesInProcess(ForkedBooter.java:115)
	at org.apache.maven.surefire.booter.ForkedBooter.main(ForkedBooter.java:75)


REGRESSION:  org.apache.hadoop.yarn.server.resourcemanager.scheduler.capacity.TestLeafQueue.testLocalityScheduling

Error Message:
org.apache.hadoop.yarn.api.records.ApplicationAttemptId$$EnhancerByMockitoWithCGLIB$$b7bc3b94 cannot be cast to org.apache.hadoop.yarn.api.records.impl.pb.ApplicationAttemptIdPBImpl

Stack Trace:
java.lang.ClassCastException: org.apache.hadoop.yarn.api.records.ApplicationAttemptId$$EnhancerByMockitoWithCGLIB$$b7bc3b94 cannot be cast to org.apache.hadoop.yarn.api.records.impl.pb.ApplicationAttemptIdPBImpl
	at org.apache.hadoop.yarn.api.records.impl.pb.ContainerIdPBImpl.convertToProtoFormat(ContainerIdPBImpl.java:84)
	at org.apache.hadoop.yarn.api.records.impl.pb.ContainerIdPBImpl.setApplicationAttemptId(ContainerIdPBImpl.java:72)
	at org.apache.hadoop.yarn.api.records.ContainerId.newInstance(ContainerId.java:43)
	at org.apache.hadoop.yarn.server.resourcemanager.scheduler.AppSchedulingInfo.<init>(AppSchedulingInfo.java:82)
	at org.apache.hadoop.yarn.server.resourcemanager.scheduler.common.fica.FiCaSchedulerApp.<init>(FiCaSchedulerApp.java:124)
	at org.apache.hadoop.yarn.server.resourcemanager.scheduler.capacity.TestLeafQueue.testLocalityScheduling(TestLeafQueue.java:1222)
	at sun.reflect.NativeMethodAccessorImpl.invoke0(Native Method)
	at sun.reflect.NativeMethodAccessorImpl.invoke(NativeMethodAccessorImpl.java:39)
	at sun.reflect.DelegatingMethodAccessorImpl.invoke(DelegatingMethodAccessorImpl.java:25)
	at java.lang.reflect.Method.invoke(Method.java:597)
	at org.junit.runners.model.FrameworkMethod$1.runReflectiveCall(FrameworkMethod.java:45)
	at org.junit.internal.runners.model.ReflectiveCallable.run(ReflectiveCallable.java:15)
	at org.junit.runners.model.FrameworkMethod.invokeExplosively(FrameworkMethod.java:42)
	at org.junit.internal.runners.statements.InvokeMethod.evaluate(InvokeMethod.java:20)
	at org.junit.internal.runners.statements.RunBefores.evaluate(RunBefores.java:28)
	at org.junit.internal.runners.statements.RunAfters.evaluate(RunAfters.java:30)
	at org.junit.runners.ParentRunner.runLeaf(ParentRunner.java:263)
	at org.junit.runners.BlockJUnit4ClassRunner.runChild(BlockJUnit4ClassRunner.java:68)
	at org.junit.runners.BlockJUnit4ClassRunner.runChild(BlockJUnit4ClassRunner.java:47)
	at org.junit.runners.ParentRunner$3.run(ParentRunner.java:231)
	at org.junit.runners.ParentRunner$1.schedule(ParentRunner.java:60)
	at org.junit.runners.ParentRunner.runChildren(ParentRunner.java:229)
	at org.junit.runners.ParentRunner.access$000(ParentRunner.java:50)
	at org.junit.runners.ParentRunner$2.evaluate(ParentRunner.java:222)
	at org.junit.runners.ParentRunner.run(ParentRunner.java:300)
	at org.apache.maven.surefire.junit4.JUnit4Provider.execute(JUnit4Provider.java:252)
	at org.apache.maven.surefire.junit4.JUnit4Provider.executeTestSet(JUnit4Provider.java:141)
	at org.apache.maven.surefire.junit4.JUnit4Provider.invoke(JUnit4Provider.java:112)
	at sun.reflect.NativeMethodAccessorImpl.invoke0(Native Method)
	at sun.reflect.NativeMethodAccessorImpl.invoke(NativeMethodAccessorImpl.java:39)
	at sun.reflect.DelegatingMethodAccessorImpl.invoke(DelegatingMethodAccessorImpl.java:25)
	at java.lang.reflect.Method.invoke(Method.java:597)
	at org.apache.maven.surefire.util.ReflectionUtils.invokeMethodWithArray(ReflectionUtils.java:189)
	at org.apache.maven.surefire.booter.ProviderFactory$ProviderProxy.invoke(ProviderFactory.java:165)
	at org.apache.maven.surefire.booter.ProviderFactory.invokeProvider(ProviderFactory.java:85)
	at org.apache.maven.surefire.booter.ForkedBooter.runSuitesInProcess(ForkedBooter.java:115)
	at org.apache.maven.surefire.booter.ForkedBooter.main(ForkedBooter.java:75)


REGRESSION:  org.apache.hadoop.yarn.server.resourcemanager.scheduler.capacity.TestLeafQueue.testApplicationPriorityScheduling

Error Message:
org.apache.hadoop.yarn.api.records.ApplicationAttemptId$$EnhancerByMockitoWithCGLIB$$b7bc3b94 cannot be cast to org.apache.hadoop.yarn.api.records.impl.pb.ApplicationAttemptIdPBImpl

Stack Trace:
java.lang.ClassCastException: org.apache.hadoop.yarn.api.records.ApplicationAttemptId$$EnhancerByMockitoWithCGLIB$$b7bc3b94 cannot be cast to org.apache.hadoop.yarn.api.records.impl.pb.ApplicationAttemptIdPBImpl
	at org.apache.hadoop.yarn.api.records.impl.pb.ContainerIdPBImpl.convertToProtoFormat(ContainerIdPBImpl.java:84)
	at org.apache.hadoop.yarn.api.records.impl.pb.ContainerIdPBImpl.setApplicationAttemptId(ContainerIdPBImpl.java:72)
	at org.apache.hadoop.yarn.api.records.ContainerId.newInstance(ContainerId.java:43)
	at org.apache.hadoop.yarn.server.resourcemanager.scheduler.AppSchedulingInfo.<init>(AppSchedulingInfo.java:82)
	at org.apache.hadoop.yarn.server.resourcemanager.scheduler.common.fica.FiCaSchedulerApp.<init>(FiCaSchedulerApp.java:124)
	at org.apache.hadoop.yarn.server.resourcemanager.scheduler.capacity.TestLeafQueue.testApplicationPriorityScheduling(TestLeafQueue.java:1363)
	at sun.reflect.NativeMethodAccessorImpl.invoke0(Native Method)
	at sun.reflect.NativeMethodAccessorImpl.invoke(NativeMethodAccessorImpl.java:39)
	at sun.reflect.DelegatingMethodAccessorImpl.invoke(DelegatingMethodAccessorImpl.java:25)
	at java.lang.reflect.Method.invoke(Method.java:597)
	at org.junit.runners.model.FrameworkMethod$1.runReflectiveCall(FrameworkMethod.java:45)
	at org.junit.internal.runners.model.ReflectiveCallable.run(ReflectiveCallable.java:15)
	at org.junit.runners.model.FrameworkMethod.invokeExplosively(FrameworkMethod.java:42)
	at org.junit.internal.runners.statements.InvokeMethod.evaluate(InvokeMethod.java:20)
	at org.junit.internal.runners.statements.RunBefores.evaluate(RunBefores.java:28)
	at org.junit.internal.runners.statements.RunAfters.evaluate(RunAfters.java:30)
	at org.junit.runners.ParentRunner.runLeaf(ParentRunner.java:263)
	at org.junit.runners.BlockJUnit4ClassRunner.runChild(BlockJUnit4ClassRunner.java:68)
	at org.junit.runners.BlockJUnit4ClassRunner.runChild(BlockJUnit4ClassRunner.java:47)
	at org.junit.runners.ParentRunner$3.run(ParentRunner.java:231)
	at org.junit.runners.ParentRunner$1.schedule(ParentRunner.java:60)
	at org.junit.runners.ParentRunner.runChildren(ParentRunner.java:229)
	at org.junit.runners.ParentRunner.access$000(ParentRunner.java:50)
	at org.junit.runners.ParentRunner$2.evaluate(ParentRunner.java:222)
	at org.junit.runners.ParentRunner.run(ParentRunner.java:300)
	at org.apache.maven.surefire.junit4.JUnit4Provider.execute(JUnit4Provider.java:252)
	at org.apache.maven.surefire.junit4.JUnit4Provider.executeTestSet(JUnit4Provider.java:141)
	at org.apache.maven.surefire.junit4.JUnit4Provider.invoke(JUnit4Provider.java:112)
	at sun.reflect.NativeMethodAccessorImpl.invoke0(Native Method)
	at sun.reflect.NativeMethodAccessorImpl.invoke(NativeMethodAccessorImpl.java:39)
	at sun.reflect.DelegatingMethodAccessorImpl.invoke(DelegatingMethodAccessorImpl.java:25)
	at java.lang.reflect.Method.invoke(Method.java:597)
	at org.apache.maven.surefire.util.ReflectionUtils.invokeMethodWithArray(ReflectionUtils.java:189)
	at org.apache.maven.surefire.booter.ProviderFactory$ProviderProxy.invoke(ProviderFactory.java:165)
	at org.apache.maven.surefire.booter.ProviderFactory.invokeProvider(ProviderFactory.java:85)
	at org.apache.maven.surefire.booter.ForkedBooter.runSuitesInProcess(ForkedBooter.java:115)
	at org.apache.maven.surefire.booter.ForkedBooter.main(ForkedBooter.java:75)


REGRESSION:  org.apache.hadoop.yarn.server.resourcemanager.scheduler.capacity.TestLeafQueue.testSchedulingConstraints

Error Message:
org.apache.hadoop.yarn.api.records.ApplicationAttemptId$$EnhancerByMockitoWithCGLIB$$b7bc3b94 cannot be cast to org.apache.hadoop.yarn.api.records.impl.pb.ApplicationAttemptIdPBImpl

Stack Trace:
java.lang.ClassCastException: org.apache.hadoop.yarn.api.records.ApplicationAttemptId$$EnhancerByMockitoWithCGLIB$$b7bc3b94 cannot be cast to org.apache.hadoop.yarn.api.records.impl.pb.ApplicationAttemptIdPBImpl
	at org.apache.hadoop.yarn.api.records.impl.pb.ContainerIdPBImpl.convertToProtoFormat(ContainerIdPBImpl.java:84)
	at org.apache.hadoop.yarn.api.records.impl.pb.ContainerIdPBImpl.setApplicationAttemptId(ContainerIdPBImpl.java:72)
	at org.apache.hadoop.yarn.api.records.ContainerId.newInstance(ContainerId.java:43)
	at org.apache.hadoop.yarn.server.resourcemanager.scheduler.AppSchedulingInfo.<init>(AppSchedulingInfo.java:82)
	at org.apache.hadoop.yarn.server.resourcemanager.scheduler.common.fica.FiCaSchedulerApp.<init>(FiCaSchedulerApp.java:124)
	at org.apache.hadoop.yarn.server.resourcemanager.scheduler.capacity.TestLeafQueue.testSchedulingConstraints(TestLeafQueue.java:1494)
	at sun.reflect.NativeMethodAccessorImpl.invoke0(Native Method)
	at sun.reflect.NativeMethodAccessorImpl.invoke(NativeMethodAccessorImpl.java:39)
	at sun.reflect.DelegatingMethodAccessorImpl.invoke(DelegatingMethodAccessorImpl.java:25)
	at java.lang.reflect.Method.invoke(Method.java:597)
	at org.junit.runners.model.FrameworkMethod$1.runReflectiveCall(FrameworkMethod.java:45)
	at org.junit.internal.runners.model.ReflectiveCallable.run(ReflectiveCallable.java:15)
	at org.junit.runners.model.FrameworkMethod.invokeExplosively(FrameworkMethod.java:42)
	at org.junit.internal.runners.statements.InvokeMethod.evaluate(InvokeMethod.java:20)
	at org.junit.internal.runners.statements.RunBefores.evaluate(RunBefores.java:28)
	at org.junit.internal.runners.statements.RunAfters.evaluate(RunAfters.java:30)
	at org.junit.runners.ParentRunner.runLeaf(ParentRunner.java:263)
	at org.junit.runners.BlockJUnit4ClassRunner.runChild(BlockJUnit4ClassRunner.java:68)
	at org.junit.runners.BlockJUnit4ClassRunner.runChild(BlockJUnit4ClassRunner.java:47)
	at org.junit.runners.ParentRunner$3.run(ParentRunner.java:231)
	at org.junit.runners.ParentRunner$1.schedule(ParentRunner.java:60)
	at org.junit.runners.ParentRunner.runChildren(ParentRunner.java:229)
	at org.junit.runners.ParentRunner.access$000(ParentRunner.java:50)
	at org.junit.runners.ParentRunner$2.evaluate(ParentRunner.java:222)
	at org.junit.runners.ParentRunner.run(ParentRunner.java:300)
	at org.apache.maven.surefire.junit4.JUnit4Provider.execute(JUnit4Provider.java:252)
	at org.apache.maven.surefire.junit4.JUnit4Provider.executeTestSet(JUnit4Provider.java:141)
	at org.apache.maven.surefire.junit4.JUnit4Provider.invoke(JUnit4Provider.java:112)
	at sun.reflect.NativeMethodAccessorImpl.invoke0(Native Method)
	at sun.reflect.NativeMethodAccessorImpl.invoke(NativeMethodAccessorImpl.java:39)
	at sun.reflect.DelegatingMethodAccessorImpl.invoke(DelegatingMethodAccessorImpl.java:25)
	at java.lang.reflect.Method.invoke(Method.java:597)
	at org.apache.maven.surefire.util.ReflectionUtils.invokeMethodWithArray(ReflectionUtils.java:189)
	at org.apache.maven.surefire.booter.ProviderFactory$ProviderProxy.invoke(ProviderFactory.java:165)
	at org.apache.maven.surefire.booter.ProviderFactory.invokeProvider(ProviderFactory.java:85)
	at org.apache.maven.surefire.booter.ForkedBooter.runSuitesInProcess(ForkedBooter.java:115)
	at org.apache.maven.surefire.booter.ForkedBooter.main(ForkedBooter.java:75)


REGRESSION:  org.apache.hadoop.yarn.server.resourcemanager.scheduler.capacity.TestLeafQueue.testActivateApplicationAfterQueueRefresh

Error Message:
org.apache.hadoop.yarn.api.records.ApplicationAttemptId$$EnhancerByMockitoWithCGLIB$$b7bc3b94 cannot be cast to org.apache.hadoop.yarn.api.records.impl.pb.ApplicationAttemptIdPBImpl

Stack Trace:
java.lang.ClassCastException: org.apache.hadoop.yarn.api.records.ApplicationAttemptId$$EnhancerByMockitoWithCGLIB$$b7bc3b94 cannot be cast to org.apache.hadoop.yarn.api.records.impl.pb.ApplicationAttemptIdPBImpl
	at org.apache.hadoop.yarn.api.records.impl.pb.ContainerIdPBImpl.convertToProtoFormat(ContainerIdPBImpl.java:84)
	at org.apache.hadoop.yarn.api.records.impl.pb.ContainerIdPBImpl.setApplicationAttemptId(ContainerIdPBImpl.java:72)
	at org.apache.hadoop.yarn.api.records.ContainerId.newInstance(ContainerId.java:43)
	at org.apache.hadoop.yarn.server.resourcemanager.scheduler.AppSchedulingInfo.<init>(AppSchedulingInfo.java:82)
	at org.apache.hadoop.yarn.server.resourcemanager.scheduler.common.fica.FiCaSchedulerApp.<init>(FiCaSchedulerApp.java:124)
	at org.apache.hadoop.yarn.server.resourcemanager.scheduler.capacity.TestLeafQueue.testActivateApplicationAfterQueueRefresh(TestLeafQueue.java:1597)
	at sun.reflect.NativeMethodAccessorImpl.invoke0(Native Method)
	at sun.reflect.NativeMethodAccessorImpl.invoke(NativeMethodAccessorImpl.java:39)
	at sun.reflect.DelegatingMethodAccessorImpl.invoke(DelegatingMethodAccessorImpl.java:25)
	at java.lang.reflect.Method.invoke(Method.java:597)
	at org.junit.runners.model.FrameworkMethod$1.runReflectiveCall(FrameworkMethod.java:45)
	at org.junit.internal.runners.model.ReflectiveCallable.run(ReflectiveCallable.java:15)
	at org.junit.runners.model.FrameworkMethod.invokeExplosively(FrameworkMethod.java:42)
	at org.junit.internal.runners.statements.InvokeMethod.evaluate(InvokeMethod.java:20)
	at org.junit.internal.runners.statements.FailOnTimeout$StatementThread.run(FailOnTimeout.java:62)


REGRESSION:  org.apache.hadoop.yarn.server.resourcemanager.scheduler.capacity.TestLeafQueue.testActivateApplicationByUpdatingClusterResource

Error Message:
org.apache.hadoop.yarn.api.records.ApplicationAttemptId$$EnhancerByMockitoWithCGLIB$$b7bc3b94 cannot be cast to org.apache.hadoop.yarn.api.records.impl.pb.ApplicationAttemptIdPBImpl

Stack Trace:
java.lang.ClassCastException: org.apache.hadoop.yarn.api.records.ApplicationAttemptId$$EnhancerByMockitoWithCGLIB$$b7bc3b94 cannot be cast to org.apache.hadoop.yarn.api.records.impl.pb.ApplicationAttemptIdPBImpl
	at org.apache.hadoop.yarn.api.records.impl.pb.ContainerIdPBImpl.convertToProtoFormat(ContainerIdPBImpl.java:84)
	at org.apache.hadoop.yarn.api.records.impl.pb.ContainerIdPBImpl.setApplicationAttemptId(ContainerIdPBImpl.java:72)
	at org.apache.hadoop.yarn.api.records.ContainerId.newInstance(ContainerId.java:43)
	at org.apache.hadoop.yarn.server.resourcemanager.scheduler.AppSchedulingInfo.<init>(AppSchedulingInfo.java:82)
	at org.apache.hadoop.yarn.server.resourcemanager.scheduler.common.fica.FiCaSchedulerApp.<init>(FiCaSchedulerApp.java:124)
	at org.apache.hadoop.yarn.server.resourcemanager.scheduler.capacity.TestLeafQueue.testActivateApplicationByUpdatingClusterResource(TestLeafQueue.java:1675)
	at sun.reflect.NativeMethodAccessorImpl.invoke0(Native Method)
	at sun.reflect.NativeMethodAccessorImpl.invoke(NativeMethodAccessorImpl.java:39)
	at sun.reflect.DelegatingMethodAccessorImpl.invoke(DelegatingMethodAccessorImpl.java:25)
	at java.lang.reflect.Method.invoke(Method.java:597)
	at org.junit.runners.model.FrameworkMethod$1.runReflectiveCall(FrameworkMethod.java:45)
	at org.junit.internal.runners.model.ReflectiveCallable.run(ReflectiveCallable.java:15)
	at org.junit.runners.model.FrameworkMethod.invokeExplosively(FrameworkMethod.java:42)
	at org.junit.internal.runners.statements.InvokeMethod.evaluate(InvokeMethod.java:20)
	at org.junit.internal.runners.statements.FailOnTimeout$StatementThread.run(FailOnTimeout.java:62)


REGRESSION:  org.apache.hadoop.yarn.server.resourcemanager.scheduler.capacity.TestLeafQueue.testLocalityConstraints

Error Message:
org.apache.hadoop.yarn.api.records.ApplicationAttemptId$$EnhancerByMockitoWithCGLIB$$b7bc3b94 cannot be cast to org.apache.hadoop.yarn.api.records.impl.pb.ApplicationAttemptIdPBImpl

Stack Trace:
java.lang.ClassCastException: org.apache.hadoop.yarn.api.records.ApplicationAttemptId$$EnhancerByMockitoWithCGLIB$$b7bc3b94 cannot be cast to org.apache.hadoop.yarn.api.records.impl.pb.ApplicationAttemptIdPBImpl
	at org.apache.hadoop.yarn.api.records.impl.pb.ContainerIdPBImpl.convertToProtoFormat(ContainerIdPBImpl.java:84)
	at org.apache.hadoop.yarn.api.records.impl.pb.ContainerIdPBImpl.setApplicationAttemptId(ContainerIdPBImpl.java:72)
	at org.apache.hadoop.yarn.api.records.ContainerId.newInstance(ContainerId.java:43)
	at org.apache.hadoop.yarn.server.resourcemanager.scheduler.AppSchedulingInfo.<init>(AppSchedulingInfo.java:82)
	at org.apache.hadoop.yarn.server.resourcemanager.scheduler.common.fica.FiCaSchedulerApp.<init>(FiCaSchedulerApp.java:124)
	at org.apache.hadoop.yarn.server.resourcemanager.scheduler.capacity.TestLeafQueue.testLocalityConstraints(TestLeafQueue.java:1752)
	at sun.reflect.NativeMethodAccessorImpl.invoke0(Native Method)
	at sun.reflect.NativeMethodAccessorImpl.invoke(NativeMethodAccessorImpl.java:39)
	at sun.reflect.DelegatingMethodAccessorImpl.invoke(DelegatingMethodAccessorImpl.java:25)
	at java.lang.reflect.Method.invoke(Method.java:597)
	at org.junit.runners.model.FrameworkMethod$1.runReflectiveCall(FrameworkMethod.java:45)
	at org.junit.internal.runners.model.ReflectiveCallable.run(ReflectiveCallable.java:15)
	at org.junit.runners.model.FrameworkMethod.invokeExplosively(FrameworkMethod.java:42)
	at org.junit.internal.runners.statements.InvokeMethod.evaluate(InvokeMethod.java:20)
	at org.junit.internal.runners.statements.RunBefores.evaluate(RunBefores.java:28)
	at org.junit.internal.runners.statements.RunAfters.evaluate(RunAfters.java:30)
	at org.junit.runners.ParentRunner.runLeaf(ParentRunner.java:263)
	at org.junit.runners.BlockJUnit4ClassRunner.runChild(BlockJUnit4ClassRunner.java:68)
	at org.junit.runners.BlockJUnit4ClassRunner.runChild(BlockJUnit4ClassRunner.java:47)
	at org.junit.runners.ParentRunner$3.run(ParentRunner.java:231)
	at org.junit.runners.ParentRunner$1.schedule(ParentRunner.java:60)
	at org.junit.runners.ParentRunner.runChildren(ParentRunner.java:229)
	at org.junit.runners.ParentRunner.access$000(ParentRunner.java:50)
	at org.junit.runners.ParentRunner$2.evaluate(ParentRunner.java:222)
	at org.junit.runners.ParentRunner.run(ParentRunner.java:300)
	at org.apache.maven.surefire.junit4.JUnit4Provider.execute(JUnit4Provider.java:252)
	at org.apache.maven.surefire.junit4.JUnit4Provider.executeTestSet(JUnit4Provider.java:141)
	at org.apache.maven.surefire.junit4.JUnit4Provider.invoke(JUnit4Provider.java:112)
	at sun.reflect.NativeMethodAccessorImpl.invoke0(Native Method)
	at sun.reflect.NativeMethodAccessorImpl.invoke(NativeMethodAccessorImpl.java:39)
	at sun.reflect.DelegatingMethodAccessorImpl.invoke(DelegatingMethodAccessorImpl.java:25)
	at java.lang.reflect.Method.invoke(Method.java:597)
	at org.apache.maven.surefire.util.ReflectionUtils.invokeMethodWithArray(ReflectionUtils.java:189)
	at org.apache.maven.surefire.booter.ProviderFactory$ProviderProxy.invoke(ProviderFactory.java:165)
	at org.apache.maven.surefire.booter.ProviderFactory.invokeProvider(ProviderFactory.java:85)
	at org.apache.maven.surefire.booter.ForkedBooter.runSuitesInProcess(ForkedBooter.java:115)
	at org.apache.maven.surefire.booter.ForkedBooter.main(ForkedBooter.java:75)