You are viewing a plain text version of this content. The canonical link for it is here.
Posted to builds@lucene.apache.org by Apache Jenkins Server <je...@builds.apache.org> on 2019/11/06 23:19:10 UTC
[JENKINS] Lucene-Solr-NightlyTests-8.3 - Build # 45 - Failure
Build: https://builds.apache.org/job/Lucene-Solr-NightlyTests-8.3/45/
2 tests failed.
FAILED: org.apache.lucene.document.TestXYPolygonShapeQueries.testRandomBig
Error Message:
Java heap space
Stack Trace:
java.lang.OutOfMemoryError: Java heap space
at __randomizedtesting.SeedInfo.seed([F177589AE826ED9F:76202515797F911F]:0)
at org.apache.lucene.store.RAMFile.newBuffer(RAMFile.java:84)
at org.apache.lucene.store.RAMFile.addBuffer(RAMFile.java:57)
at org.apache.lucene.store.RAMOutputStream.switchCurrentBuffer(RAMOutputStream.java:168)
at org.apache.lucene.store.RAMOutputStream.writeBytes(RAMOutputStream.java:154)
at org.apache.lucene.store.MockIndexOutputWrapper.writeBytes(MockIndexOutputWrapper.java:141)
at org.apache.lucene.util.bkd.OfflinePointWriter.append(OfflinePointWriter.java:67)
at org.apache.lucene.util.bkd.BKDRadixSelector.offlinePartition(BKDRadixSelector.java:285)
at org.apache.lucene.util.bkd.BKDRadixSelector.buildHistogramAndPartition(BKDRadixSelector.java:258)
at org.apache.lucene.util.bkd.BKDRadixSelector.select(BKDRadixSelector.java:126)
at org.apache.lucene.util.bkd.BKDWriter.build(BKDWriter.java:1594)
at org.apache.lucene.util.bkd.BKDWriter.build(BKDWriter.java:1611)
at org.apache.lucene.util.bkd.BKDWriter.finish(BKDWriter.java:785)
at org.apache.lucene.index.RandomCodec$1$1.writeField(RandomCodec.java:140)
at org.apache.lucene.codecs.PointsWriter.mergeOneField(PointsWriter.java:62)
at org.apache.lucene.codecs.PointsWriter.merge(PointsWriter.java:191)
at org.apache.lucene.codecs.lucene60.Lucene60PointsWriter.merge(Lucene60PointsWriter.java:143)
at org.apache.lucene.codecs.asserting.AssertingPointsFormat$AssertingPointsWriter.merge(AssertingPointsFormat.java:149)
at org.apache.lucene.index.SegmentMerger.mergePoints(SegmentMerger.java:202)
at org.apache.lucene.index.SegmentMerger.merge(SegmentMerger.java:162)
at org.apache.lucene.index.IndexWriter.mergeMiddle(IndexWriter.java:4463)
at org.apache.lucene.index.IndexWriter.merge(IndexWriter.java:4057)
at org.apache.lucene.index.SerialMergeScheduler.merge(SerialMergeScheduler.java:40)
at org.apache.lucene.index.IndexWriter.maybeMerge(IndexWriter.java:2158)
at org.apache.lucene.index.IndexWriter.forceMerge(IndexWriter.java:1991)
at org.apache.lucene.index.IndexWriter.forceMerge(IndexWriter.java:1940)
at org.apache.lucene.document.BaseShapeTestCase.indexRandomShapes(BaseShapeTestCase.java:242)
at org.apache.lucene.document.BaseShapeTestCase.verify(BaseShapeTestCase.java:211)
at org.apache.lucene.document.BaseShapeTestCase.doTestRandom(BaseShapeTestCase.java:137)
at org.apache.lucene.document.TestXYPolygonShapeQueries.testRandomBig(TestXYPolygonShapeQueries.java:123)
at sun.reflect.NativeMethodAccessorImpl.invoke0(Native Method)
at sun.reflect.NativeMethodAccessorImpl.invoke(NativeMethodAccessorImpl.java:62)
at sun.reflect.DelegatingMethodAccessorImpl.invoke(DelegatingMethodAccessorImpl.java:43)
FAILED: org.apache.solr.cloud.MoveReplicaHDFSTest.test
Error Message:
Error from server at https://127.0.0.1:44277/solr: org.apache.solr.common.SolrException at org.apache.solr.client.solrj.SolrResponse.getException(SolrResponse.java:53) at org.apache.solr.handler.admin.CollectionsHandler.invokeAction(CollectionsHandler.java:281) at org.apache.solr.handler.admin.CollectionsHandler.handleRequestBody(CollectionsHandler.java:253) at org.apache.solr.handler.RequestHandlerBase.handleRequest(RequestHandlerBase.java:198) at org.apache.solr.servlet.HttpSolrCall.handleAdmin(HttpSolrCall.java:843) at org.apache.solr.servlet.HttpSolrCall.handleAdminRequest(HttpSolrCall.java:809) at org.apache.solr.servlet.HttpSolrCall.call(HttpSolrCall.java:562) at org.apache.solr.servlet.SolrDispatchFilter.doFilter(SolrDispatchFilter.java:424) at org.apache.solr.servlet.SolrDispatchFilter.doFilter(SolrDispatchFilter.java:351) at org.eclipse.jetty.servlet.ServletHandler$CachedChain.doFilter(ServletHandler.java:1610) at org.apache.solr.client.solrj.embedded.JettySolrRunner$DebugFilter.doFilter(JettySolrRunner.java:167) at org.eclipse.jetty.servlet.ServletHandler$CachedChain.doFilter(ServletHandler.java:1610) at org.eclipse.jetty.servlet.ServletHandler.doHandle(ServletHandler.java:540) at org.eclipse.jetty.server.handler.ScopedHandler.nextHandle(ScopedHandler.java:255) at org.eclipse.jetty.server.session.SessionHandler.doHandle(SessionHandler.java:1711) at org.eclipse.jetty.server.handler.ScopedHandler.nextHandle(ScopedHandler.java:255) at org.eclipse.jetty.server.handler.ContextHandler.doHandle(ContextHandler.java:1347) at org.eclipse.jetty.server.handler.ScopedHandler.nextScope(ScopedHandler.java:203) at org.eclipse.jetty.servlet.ServletHandler.doScope(ServletHandler.java:480) at org.eclipse.jetty.server.session.SessionHandler.doScope(SessionHandler.java:1678) at org.eclipse.jetty.server.handler.ScopedHandler.nextScope(ScopedHandler.java:201) at org.eclipse.jetty.server.handler.ContextHandler.doScope(ContextHandler.java:1249) at org.eclipse.jetty.server.handler.ScopedHandler.handle(ScopedHandler.java:144) at org.eclipse.jetty.server.handler.HandlerWrapper.handle(HandlerWrapper.java:132) at org.eclipse.jetty.rewrite.handler.RewriteHandler.handle(RewriteHandler.java:335) at org.eclipse.jetty.server.handler.gzip.GzipHandler.handle(GzipHandler.java:753) at org.eclipse.jetty.server.handler.HandlerWrapper.handle(HandlerWrapper.java:132) at org.eclipse.jetty.server.Server.handle(Server.java:505) at org.eclipse.jetty.server.HttpChannel.handle(HttpChannel.java:370) at org.eclipse.jetty.server.HttpConnection.onFillable(HttpConnection.java:267) at org.eclipse.jetty.io.AbstractConnection$ReadCallback.succeeded(AbstractConnection.java:305) at org.eclipse.jetty.io.FillInterest.fillable(FillInterest.java:103) at org.eclipse.jetty.io.ssl.SslConnection$DecryptedEndPoint.onFillable(SslConnection.java:427) at org.eclipse.jetty.io.ssl.SslConnection.onFillable(SslConnection.java:321) at org.eclipse.jetty.io.ssl.SslConnection$2.succeeded(SslConnection.java:159) at org.eclipse.jetty.io.FillInterest.fillable(FillInterest.java:103) at org.eclipse.jetty.io.ChannelEndPoint$2.run(ChannelEndPoint.java:117) at org.eclipse.jetty.util.thread.QueuedThreadPool.runJob(QueuedThreadPool.java:781) at org.eclipse.jetty.util.thread.QueuedThreadPool$Runner.run(QueuedThreadPool.java:917) at java.lang.Thread.run(Thread.java:748)
Stack Trace:
org.apache.solr.client.solrj.impl.HttpSolrClient$RemoteSolrException: Error from server at https://127.0.0.1:44277/solr: org.apache.solr.common.SolrException
at org.apache.solr.client.solrj.SolrResponse.getException(SolrResponse.java:53)
at org.apache.solr.handler.admin.CollectionsHandler.invokeAction(CollectionsHandler.java:281)
at org.apache.solr.handler.admin.CollectionsHandler.handleRequestBody(CollectionsHandler.java:253)
at org.apache.solr.handler.RequestHandlerBase.handleRequest(RequestHandlerBase.java:198)
at org.apache.solr.servlet.HttpSolrCall.handleAdmin(HttpSolrCall.java:843)
at org.apache.solr.servlet.HttpSolrCall.handleAdminRequest(HttpSolrCall.java:809)
at org.apache.solr.servlet.HttpSolrCall.call(HttpSolrCall.java:562)
at org.apache.solr.servlet.SolrDispatchFilter.doFilter(SolrDispatchFilter.java:424)
at org.apache.solr.servlet.SolrDispatchFilter.doFilter(SolrDispatchFilter.java:351)
at org.eclipse.jetty.servlet.ServletHandler$CachedChain.doFilter(ServletHandler.java:1610)
at org.apache.solr.client.solrj.embedded.JettySolrRunner$DebugFilter.doFilter(JettySolrRunner.java:167)
at org.eclipse.jetty.servlet.ServletHandler$CachedChain.doFilter(ServletHandler.java:1610)
at org.eclipse.jetty.servlet.ServletHandler.doHandle(ServletHandler.java:540)
at org.eclipse.jetty.server.handler.ScopedHandler.nextHandle(ScopedHandler.java:255)
at org.eclipse.jetty.server.session.SessionHandler.doHandle(SessionHandler.java:1711)
at org.eclipse.jetty.server.handler.ScopedHandler.nextHandle(ScopedHandler.java:255)
at org.eclipse.jetty.server.handler.ContextHandler.doHandle(ContextHandler.java:1347)
at org.eclipse.jetty.server.handler.ScopedHandler.nextScope(ScopedHandler.java:203)
at org.eclipse.jetty.servlet.ServletHandler.doScope(ServletHandler.java:480)
at org.eclipse.jetty.server.session.SessionHandler.doScope(SessionHandler.java:1678)
at org.eclipse.jetty.server.handler.ScopedHandler.nextScope(ScopedHandler.java:201)
at org.eclipse.jetty.server.handler.ContextHandler.doScope(ContextHandler.java:1249)
at org.eclipse.jetty.server.handler.ScopedHandler.handle(ScopedHandler.java:144)
at org.eclipse.jetty.server.handler.HandlerWrapper.handle(HandlerWrapper.java:132)
at org.eclipse.jetty.rewrite.handler.RewriteHandler.handle(RewriteHandler.java:335)
at org.eclipse.jetty.server.handler.gzip.GzipHandler.handle(GzipHandler.java:753)
at org.eclipse.jetty.server.handler.HandlerWrapper.handle(HandlerWrapper.java:132)
at org.eclipse.jetty.server.Server.handle(Server.java:505)
at org.eclipse.jetty.server.HttpChannel.handle(HttpChannel.java:370)
at org.eclipse.jetty.server.HttpConnection.onFillable(HttpConnection.java:267)
at org.eclipse.jetty.io.AbstractConnection$ReadCallback.succeeded(AbstractConnection.java:305)
at org.eclipse.jetty.io.FillInterest.fillable(FillInterest.java:103)
at org.eclipse.jetty.io.ssl.SslConnection$DecryptedEndPoint.onFillable(SslConnection.java:427)
at org.eclipse.jetty.io.ssl.SslConnection.onFillable(SslConnection.java:321)
at org.eclipse.jetty.io.ssl.SslConnection$2.succeeded(SslConnection.java:159)
at org.eclipse.jetty.io.FillInterest.fillable(FillInterest.java:103)
at org.eclipse.jetty.io.ChannelEndPoint$2.run(ChannelEndPoint.java:117)
at org.eclipse.jetty.util.thread.QueuedThreadPool.runJob(QueuedThreadPool.java:781)
at org.eclipse.jetty.util.thread.QueuedThreadPool$Runner.run(QueuedThreadPool.java:917)
at java.lang.Thread.run(Thread.java:748)
at __randomizedtesting.SeedInfo.seed([86A2BB39E38DBEE4:EF684E34D71D31C]:0)
at org.apache.solr.client.solrj.impl.HttpSolrClient.executeMethod(HttpSolrClient.java:665)
at org.apache.solr.client.solrj.impl.HttpSolrClient.request(HttpSolrClient.java:265)
at org.apache.solr.client.solrj.impl.HttpSolrClient.request(HttpSolrClient.java:248)
at org.apache.solr.client.solrj.impl.LBSolrClient.doRequest(LBSolrClient.java:368)
at org.apache.solr.client.solrj.impl.LBSolrClient.request(LBSolrClient.java:296)
at org.apache.solr.client.solrj.impl.BaseCloudSolrClient.sendRequest(BaseCloudSolrClient.java:1128)
at org.apache.solr.client.solrj.impl.BaseCloudSolrClient.requestWithRetryOnStaleState(BaseCloudSolrClient.java:897)
at org.apache.solr.client.solrj.impl.BaseCloudSolrClient.request(BaseCloudSolrClient.java:829)
at org.apache.solr.client.solrj.SolrRequest.process(SolrRequest.java:211)
at org.apache.solr.client.solrj.SolrRequest.process(SolrRequest.java:228)
at org.apache.solr.cloud.MoveReplicaTest.test(MoveReplicaTest.java:195)
at sun.reflect.NativeMethodAccessorImpl.invoke0(Native Method)
at sun.reflect.NativeMethodAccessorImpl.invoke(NativeMethodAccessorImpl.java:62)
at sun.reflect.DelegatingMethodAccessorImpl.invoke(DelegatingMethodAccessorImpl.java:43)
at java.lang.reflect.Method.invoke(Method.java:498)
at com.carrotsearch.randomizedtesting.RandomizedRunner.invoke(RandomizedRunner.java:1750)
at com.carrotsearch.randomizedtesting.RandomizedRunner$8.evaluate(RandomizedRunner.java:938)
at com.carrotsearch.randomizedtesting.RandomizedRunner$9.evaluate(RandomizedRunner.java:974)
at com.carrotsearch.randomizedtesting.RandomizedRunner$10.evaluate(RandomizedRunner.java:988)
at com.carrotsearch.randomizedtesting.rules.SystemPropertiesRestoreRule$1.evaluate(SystemPropertiesRestoreRule.java:57)
at org.apache.lucene.util.TestRuleSetupTeardownChained$1.evaluate(TestRuleSetupTeardownChained.java:49)
at org.apache.lucene.util.AbstractBeforeAfterRule$1.evaluate(AbstractBeforeAfterRule.java:45)
at org.apache.lucene.util.TestRuleThreadAndTestName$1.evaluate(TestRuleThreadAndTestName.java:48)
at org.apache.lucene.util.TestRuleIgnoreAfterMaxFailures$1.evaluate(TestRuleIgnoreAfterMaxFailures.java:64)
at org.apache.lucene.util.TestRuleMarkFailure$1.evaluate(TestRuleMarkFailure.java:47)
at com.carrotsearch.randomizedtesting.rules.StatementAdapter.evaluate(StatementAdapter.java:36)
at com.carrotsearch.randomizedtesting.ThreadLeakControl$StatementRunner.run(ThreadLeakControl.java:368)
at com.carrotsearch.randomizedtesting.ThreadLeakControl.forkTimeoutingTask(ThreadLeakControl.java:817)
at com.carrotsearch.randomizedtesting.ThreadLeakControl$3.evaluate(ThreadLeakControl.java:468)
at com.carrotsearch.randomizedtesting.RandomizedRunner.runSingleTest(RandomizedRunner.java:947)
at com.carrotsearch.randomizedtesting.RandomizedRunner$5.evaluate(RandomizedRunner.java:832)
at com.carrotsearch.randomizedtesting.RandomizedRunner$6.evaluate(RandomizedRunner.java:883)
at com.carrotsearch.randomizedtesting.RandomizedRunner$7.evaluate(RandomizedRunner.java:894)
at com.carrotsearch.randomizedtesting.rules.StatementAdapter.evaluate(StatementAdapter.java:36)
at com.carrotsearch.randomizedtesting.rules.SystemPropertiesRestoreRule$1.evaluate(SystemPropertiesRestoreRule.java:57)
at org.apache.lucene.util.AbstractBeforeAfterRule$1.evaluate(AbstractBeforeAfterRule.java:45)
at com.carrotsearch.randomizedtesting.rules.StatementAdapter.evaluate(StatementAdapter.java:36)
at org.apache.lucene.util.TestRuleStoreClassName$1.evaluate(TestRuleStoreClassName.java:41)
at com.carrotsearch.randomizedtesting.rules.NoShadowingOrOverridesOnMethodsRule$1.evaluate(NoShadowingOrOverridesOnMethodsRule.java:40)
at com.carrotsearch.randomizedtesting.rules.NoShadowingOrOverridesOnMethodsRule$1.evaluate(NoShadowingOrOverridesOnMethodsRule.java:40)
at com.carrotsearch.randomizedtesting.rules.StatementAdapter.evaluate(StatementAdapter.java:36)
at com.carrotsearch.randomizedtesting.rules.StatementAdapter.evaluate(StatementAdapter.java:36)
at com.carrotsearch.randomizedtesting.rules.StatementAdapter.evaluate(StatementAdapter.java:36)
at org.apache.lucene.util.TestRuleAssertionsRequired$1.evaluate(TestRuleAssertionsRequired.java:53)
at org.apache.lucene.util.TestRuleMarkFailure$1.evaluate(TestRuleMarkFailure.java:47)
at org.apache.lucene.util.TestRuleIgnoreAfterMaxFailures$1.evaluate(TestRuleIgnoreAfterMaxFailures.java:64)
at org.apache.lucene.util.TestRuleIgnoreTestSuites$1.evaluate(TestRuleIgnoreTestSuites.java:54)
at com.carrotsearch.randomizedtesting.rules.StatementAdapter.evaluate(StatementAdapter.java:36)
at com.carrotsearch.randomizedtesting.ThreadLeakControl$StatementRunner.run(ThreadLeakControl.java:368)
at java.lang.Thread.run(Thread.java:748)
Build Log:
[...truncated 11271 lines...]
[junit4] Suite: org.apache.lucene.document.TestXYPolygonShapeQueries
[junit4] 2> NOTE: download the large Jenkins line-docs file by running 'ant get-jenkins-line-docs' in the lucene directory.
[junit4] 2> NOTE: reproduce with: ant test -Dtestcase=TestXYPolygonShapeQueries -Dtests.method=testRandomBig -Dtests.seed=F177589AE826ED9F -Dtests.multiplier=2 -Dtests.nightly=true -Dtests.slow=true -Dtests.linedocsfile=/home/jenkins/jenkins-slave/workspace/Lucene-Solr-NightlyTests-8.3/test-data/enwiki.random.lines.txt -Dtests.locale=es-UY -Dtests.timezone=America/Shiprock -Dtests.asserts=true -Dtests.file.encoding=UTF-8
[junit4] ERROR 548s J0 | TestXYPolygonShapeQueries.testRandomBig <<<
[junit4] > Throwable #1: java.lang.OutOfMemoryError: Java heap space
[junit4] > at __randomizedtesting.SeedInfo.seed([F177589AE826ED9F:76202515797F911F]:0)
[junit4] > at org.apache.lucene.store.RAMFile.newBuffer(RAMFile.java:84)
[junit4] > at org.apache.lucene.store.RAMFile.addBuffer(RAMFile.java:57)
[junit4] > at org.apache.lucene.store.RAMOutputStream.switchCurrentBuffer(RAMOutputStream.java:168)
[junit4] > at org.apache.lucene.store.RAMOutputStream.writeBytes(RAMOutputStream.java:154)
[junit4] > at org.apache.lucene.store.MockIndexOutputWrapper.writeBytes(MockIndexOutputWrapper.java:141)
[junit4] > at org.apache.lucene.util.bkd.OfflinePointWriter.append(OfflinePointWriter.java:67)
[junit4] > at org.apache.lucene.util.bkd.BKDRadixSelector.offlinePartition(BKDRadixSelector.java:285)
[junit4] > at org.apache.lucene.util.bkd.BKDRadixSelector.buildHistogramAndPartition(BKDRadixSelector.java:258)
[junit4] > at org.apache.lucene.util.bkd.BKDRadixSelector.select(BKDRadixSelector.java:126)
[junit4] > at org.apache.lucene.util.bkd.BKDWriter.build(BKDWriter.java:1594)
[junit4] > at org.apache.lucene.util.bkd.BKDWriter.build(BKDWriter.java:1611)
[junit4] > at org.apache.lucene.util.bkd.BKDWriter.finish(BKDWriter.java:785)
[junit4] > at org.apache.lucene.index.RandomCodec$1$1.writeField(RandomCodec.java:140)
[junit4] > at org.apache.lucene.codecs.PointsWriter.mergeOneField(PointsWriter.java:62)
[junit4] > at org.apache.lucene.codecs.PointsWriter.merge(PointsWriter.java:191)
[junit4] > at org.apache.lucene.codecs.lucene60.Lucene60PointsWriter.merge(Lucene60PointsWriter.java:143)
[junit4] > at org.apache.lucene.codecs.asserting.AssertingPointsFormat$AssertingPointsWriter.merge(AssertingPointsFormat.java:149)
[junit4] > at org.apache.lucene.index.SegmentMerger.mergePoints(SegmentMerger.java:202)
[junit4] > at org.apache.lucene.index.SegmentMerger.merge(SegmentMerger.java:162)
[junit4] > at org.apache.lucene.index.IndexWriter.mergeMiddle(IndexWriter.java:4463)
[junit4] > at org.apache.lucene.index.IndexWriter.merge(IndexWriter.java:4057)
[junit4] > at org.apache.lucene.index.SerialMergeScheduler.merge(SerialMergeScheduler.java:40)
[junit4] > at org.apache.lucene.index.IndexWriter.maybeMerge(IndexWriter.java:2158)
[junit4] > at org.apache.lucene.index.IndexWriter.forceMerge(IndexWriter.java:1991)
[junit4] > at org.apache.lucene.index.IndexWriter.forceMerge(IndexWriter.java:1940)
[junit4] > at org.apache.lucene.document.BaseShapeTestCase.indexRandomShapes(BaseShapeTestCase.java:242)
[junit4] > at org.apache.lucene.document.BaseShapeTestCase.verify(BaseShapeTestCase.java:211)
[junit4] > at org.apache.lucene.document.BaseShapeTestCase.doTestRandom(BaseShapeTestCase.java:137)
[junit4] > at org.apache.lucene.document.TestXYPolygonShapeQueries.testRandomBig(TestXYPolygonShapeQueries.java:123)
[junit4] 2> NOTE: leaving temporary files on disk at: /home/jenkins/jenkins-slave/workspace/Lucene-Solr-NightlyTests-8.3/checkout/lucene/build/sandbox/test/J0/temp/lucene.document.TestXYPolygonShapeQueries_F177589AE826ED9F-001
[junit4] 2> NOTE: test params are: codec=Asserting(Lucene80): {id=Lucene50(blocksize=128)}, docValues:{shape=DocValuesFormat(name=Lucene80), id=DocValuesFormat(name=Lucene80)}, maxPointsInLeafNode=513, maxMBSortInHeap=6.067527815690394, sim=Asserting(org.apache.lucene.search.similarities.AssertingSimilarity@6fddbae1), locale=es-UY, timezone=America/Shiprock
[junit4] 2> NOTE: Linux 4.4.0-112-generic amd64/Oracle Corporation 1.8.0_191 (64-bit)/cpus=4,threads=1,free=190219856,total=449314816
[junit4] 2> NOTE: All tests run in this JVM: [TestLargeNumHitsTopDocsCollector, TestTessellator, TestFloatPointNearestNeighbor, TestLatLonShapeEncoding, TestXYPolygonShapeQueries]
[junit4] Completed [18/38 (1!)] on J0 in 600.15s, 5 tests, 1 error <<< FAILURES!
[...truncated 75 lines...]
[junit4] JVM J0: stdout was not empty, see: /home/jenkins/jenkins-slave/workspace/Lucene-Solr-NightlyTests-8.3/checkout/lucene/build/sandbox/test/temp/junit4-J0-20191106_193847_9388621909158444650473.sysout
[junit4] >>> JVM J0 emitted unexpected output (verbatim) ----
[junit4] java.lang.OutOfMemoryError: Java heap space
[junit4] Dumping heap to /home/jenkins/jenkins-slave/workspace/Lucene-Solr-NightlyTests-8.3/checkout/heapdumps/java_pid6951.hprof ...
[junit4] Heap dump file created [472852376 bytes in 0.671 secs]
[junit4] <<< JVM J0: EOF ----
[...truncated 4188 lines...]
[junit4] Suite: org.apache.solr.cloud.MoveReplicaHDFSTest
[junit4] 2> 4875259 INFO (SUITE-MoveReplicaHDFSTest-seed#[86A2BB39E38DBEE4]-worker) [ ] o.a.s.SolrTestCaseJ4 Created dataDir: /home/jenkins/jenkins-slave/workspace/Lucene-Solr-NightlyTests-8.3/checkout/solr/build/solr-core/test/J2/temp/solr.cloud.MoveReplicaHDFSTest_86A2BB39E38DBEE4-001/data-dir-214-001
[junit4] 2> 4875259 WARN (SUITE-MoveReplicaHDFSTest-seed#[86A2BB39E38DBEE4]-worker) [ ] o.a.s.SolrTestCaseJ4 startTrackingSearchers: numOpens=6 numCloses=6
[junit4] 2> 4875259 INFO (SUITE-MoveReplicaHDFSTest-seed#[86A2BB39E38DBEE4]-worker) [ ] o.a.s.SolrTestCaseJ4 Using PointFields (NUMERIC_POINTS_SYSPROP=true) w/NUMERIC_DOCVALUES_SYSPROP=true
[junit4] 2> 4875273 INFO (SUITE-MoveReplicaHDFSTest-seed#[86A2BB39E38DBEE4]-worker) [ ] o.a.s.SolrTestCaseJ4 Randomized ssl (true) and clientAuth (false) via: @org.apache.solr.util.RandomizeSSL(reason=, ssl=NaN, value=NaN, clientAuth=NaN)
[junit4] 2> 4875274 INFO (SUITE-MoveReplicaHDFSTest-seed#[86A2BB39E38DBEE4]-worker) [ ] o.a.s.SolrTestCaseJ4 SecureRandom sanity checks: test.solr.allowed.securerandom=null & java.security.egd=file:/dev/./urandom
[junit4] 1> Formatting using clusterid: testClusterID
[junit4] 2> 4875448 WARN (SUITE-MoveReplicaHDFSTest-seed#[86A2BB39E38DBEE4]-worker) [ ] o.a.h.m.i.MetricsConfig Cannot locate configuration: tried hadoop-metrics2-namenode.properties,hadoop-metrics2.properties
[junit4] 2> 4875558 WARN (SUITE-MoveReplicaHDFSTest-seed#[86A2BB39E38DBEE4]-worker) [ ] o.a.h.h.HttpRequestLog Jetty request log can only be enabled using Log4j
[junit4] 2> 4875560 INFO (SUITE-MoveReplicaHDFSTest-seed#[86A2BB39E38DBEE4]-worker) [ ] o.e.j.s.Server jetty-9.4.19.v20190610; built: 2019-06-10T16:30:51.723Z; git: afcf563148970e98786327af5e07c261fda175d3; jvm 1.8.0_191-b12
[junit4] 2> 4875561 INFO (SUITE-MoveReplicaHDFSTest-seed#[86A2BB39E38DBEE4]-worker) [ ] o.e.j.s.session DefaultSessionIdManager workerName=node0
[junit4] 2> 4875561 INFO (SUITE-MoveReplicaHDFSTest-seed#[86A2BB39E38DBEE4]-worker) [ ] o.e.j.s.session No SessionScavenger set, using defaults
[junit4] 2> 4875561 INFO (SUITE-MoveReplicaHDFSTest-seed#[86A2BB39E38DBEE4]-worker) [ ] o.e.j.s.session node0 Scavenging every 600000ms
[junit4] 2> 4875561 INFO (SUITE-MoveReplicaHDFSTest-seed#[86A2BB39E38DBEE4]-worker) [ ] o.e.j.s.h.ContextHandler Started o.e.j.s.ServletContextHandler@68050900{static,/static,jar:file:/home/jenkins/.ivy2/cache/org.apache.hadoop/hadoop-hdfs/tests/hadoop-hdfs-3.2.0-tests.jar!/webapps/static,AVAILABLE}
[junit4] 2> 4876177 INFO (SUITE-MoveReplicaHDFSTest-seed#[86A2BB39E38DBEE4]-worker) [ ] o.e.j.s.h.ContextHandler Started o.e.j.w.WebAppContext@11f845b{hdfs,/,file:///home/jenkins/jenkins-slave/workspace/Lucene-Solr-NightlyTests-8.3/checkout/solr/build/solr-core/test/J2/temp/jetty-lucene2-us-west.apache.org-37511-hdfs-_-any-5141218546626960591.dir/webapp/,AVAILABLE}{/hdfs}
[junit4] 2> 4876179 INFO (SUITE-MoveReplicaHDFSTest-seed#[86A2BB39E38DBEE4]-worker) [ ] o.e.j.s.AbstractConnector Started ServerConnector@2f49dd0{HTTP/1.1,[http/1.1]}{lucene2-us-west.apache.org:37511}
[junit4] 2> 4876179 INFO (SUITE-MoveReplicaHDFSTest-seed#[86A2BB39E38DBEE4]-worker) [ ] o.e.j.s.Server Started @4876376ms
[junit4] 2> 4876732 WARN (SUITE-MoveReplicaHDFSTest-seed#[86A2BB39E38DBEE4]-worker) [ ] o.a.h.h.HttpRequestLog Jetty request log can only be enabled using Log4j
[junit4] 2> 4876782 INFO (SUITE-MoveReplicaHDFSTest-seed#[86A2BB39E38DBEE4]-worker) [ ] o.e.j.s.Server jetty-9.4.19.v20190610; built: 2019-06-10T16:30:51.723Z; git: afcf563148970e98786327af5e07c261fda175d3; jvm 1.8.0_191-b12
[junit4] 2> 4876806 INFO (SUITE-MoveReplicaHDFSTest-seed#[86A2BB39E38DBEE4]-worker) [ ] o.e.j.s.session DefaultSessionIdManager workerName=node0
[junit4] 2> 4876806 INFO (SUITE-MoveReplicaHDFSTest-seed#[86A2BB39E38DBEE4]-worker) [ ] o.e.j.s.session No SessionScavenger set, using defaults
[junit4] 2> 4876806 INFO (SUITE-MoveReplicaHDFSTest-seed#[86A2BB39E38DBEE4]-worker) [ ] o.e.j.s.session node0 Scavenging every 660000ms
[junit4] 2> 4876807 INFO (SUITE-MoveReplicaHDFSTest-seed#[86A2BB39E38DBEE4]-worker) [ ] o.e.j.s.h.ContextHandler Started o.e.j.s.ServletContextHandler@1eb3caf2{static,/static,jar:file:/home/jenkins/.ivy2/cache/org.apache.hadoop/hadoop-hdfs/tests/hadoop-hdfs-3.2.0-tests.jar!/webapps/static,AVAILABLE}
[junit4] 2> 4877237 INFO (SUITE-MoveReplicaHDFSTest-seed#[86A2BB39E38DBEE4]-worker) [ ] o.e.j.s.h.ContextHandler Started o.e.j.w.WebAppContext@2a94d80{datanode,/,file:///home/jenkins/jenkins-slave/workspace/Lucene-Solr-NightlyTests-8.3/checkout/solr/build/solr-core/test/J2/temp/jetty-localhost-34791-datanode-_-any-8402028224102150704.dir/webapp/,AVAILABLE}{/datanode}
[junit4] 2> 4877237 INFO (SUITE-MoveReplicaHDFSTest-seed#[86A2BB39E38DBEE4]-worker) [ ] o.e.j.s.AbstractConnector Started ServerConnector@53237fe1{HTTP/1.1,[http/1.1]}{localhost:34791}
[junit4] 2> 4877237 INFO (SUITE-MoveReplicaHDFSTest-seed#[86A2BB39E38DBEE4]-worker) [ ] o.e.j.s.Server Started @4877435ms
[junit4] 2> 4878013 WARN (SUITE-MoveReplicaHDFSTest-seed#[86A2BB39E38DBEE4]-worker) [ ] o.a.h.h.HttpRequestLog Jetty request log can only be enabled using Log4j
[junit4] 2> 4878014 INFO (SUITE-MoveReplicaHDFSTest-seed#[86A2BB39E38DBEE4]-worker) [ ] o.e.j.s.Server jetty-9.4.19.v20190610; built: 2019-06-10T16:30:51.723Z; git: afcf563148970e98786327af5e07c261fda175d3; jvm 1.8.0_191-b12
[junit4] 2> 4878014 INFO (SUITE-MoveReplicaHDFSTest-seed#[86A2BB39E38DBEE4]-worker) [ ] o.e.j.s.session DefaultSessionIdManager workerName=node0
[junit4] 2> 4878014 INFO (SUITE-MoveReplicaHDFSTest-seed#[86A2BB39E38DBEE4]-worker) [ ] o.e.j.s.session No SessionScavenger set, using defaults
[junit4] 2> 4878014 INFO (SUITE-MoveReplicaHDFSTest-seed#[86A2BB39E38DBEE4]-worker) [ ] o.e.j.s.session node0 Scavenging every 660000ms
[junit4] 2> 4878015 INFO (SUITE-MoveReplicaHDFSTest-seed#[86A2BB39E38DBEE4]-worker) [ ] o.e.j.s.h.ContextHandler Started o.e.j.s.ServletContextHandler@1b82535e{static,/static,jar:file:/home/jenkins/.ivy2/cache/org.apache.hadoop/hadoop-hdfs/tests/hadoop-hdfs-3.2.0-tests.jar!/webapps/static,AVAILABLE}
[junit4] 2> 4878435 INFO (Block report processor) [ ] BlockStateChange BLOCK* processReport 0xa966a8bb92b6f247: Processing first storage report for DS-1053c6da-5ade-42b0-9693-837161ee88f3 from datanode 48c8648f-1398-4146-8da7-447de9cdb7c1
[junit4] 2> 4878435 INFO (Block report processor) [ ] BlockStateChange BLOCK* processReport 0xa966a8bb92b6f247: from storage DS-1053c6da-5ade-42b0-9693-837161ee88f3 node DatanodeRegistration(127.0.0.1:41149, datanodeUuid=48c8648f-1398-4146-8da7-447de9cdb7c1, infoPort=40034, infoSecurePort=0, ipcPort=45710, storageInfo=lv=-57;cid=testClusterID;nsid=1227549582;c=1573076666459), blocks: 0, hasStaleStorage: true, processing time: 0 msecs, invalidatedBlocks: 0
[junit4] 2> 4878435 INFO (Block report processor) [ ] BlockStateChange BLOCK* processReport 0xa966a8bb92b6f247: Processing first storage report for DS-62b29e50-95de-42d2-9e81-be6f9b0237b7 from datanode 48c8648f-1398-4146-8da7-447de9cdb7c1
[junit4] 2> 4878435 INFO (Block report processor) [ ] BlockStateChange BLOCK* processReport 0xa966a8bb92b6f247: from storage DS-62b29e50-95de-42d2-9e81-be6f9b0237b7 node DatanodeRegistration(127.0.0.1:41149, datanodeUuid=48c8648f-1398-4146-8da7-447de9cdb7c1, infoPort=40034, infoSecurePort=0, ipcPort=45710, storageInfo=lv=-57;cid=testClusterID;nsid=1227549582;c=1573076666459), blocks: 0, hasStaleStorage: false, processing time: 0 msecs, invalidatedBlocks: 0
[junit4] 2> 4878652 INFO (SUITE-MoveReplicaHDFSTest-seed#[86A2BB39E38DBEE4]-worker) [ ] o.e.j.s.h.ContextHandler Started o.e.j.w.WebAppContext@61a41cb6{datanode,/,file:///home/jenkins/jenkins-slave/workspace/Lucene-Solr-NightlyTests-8.3/checkout/solr/build/solr-core/test/J2/temp/jetty-localhost-44233-datanode-_-any-155729040057192854.dir/webapp/,AVAILABLE}{/datanode}
[junit4] 2> 4878652 INFO (SUITE-MoveReplicaHDFSTest-seed#[86A2BB39E38DBEE4]-worker) [ ] o.e.j.s.AbstractConnector Started ServerConnector@23f5ff1c{HTTP/1.1,[http/1.1]}{localhost:44233}
[junit4] 2> 4878652 INFO (SUITE-MoveReplicaHDFSTest-seed#[86A2BB39E38DBEE4]-worker) [ ] o.e.j.s.Server Started @4878850ms
[junit4] 2> 4879208 INFO (Block report processor) [ ] BlockStateChange BLOCK* processReport 0x3d0d044fb21e0842: Processing first storage report for DS-310dc528-f394-4492-a796-3ab15fd8d2a7 from datanode 6f8d875a-40fd-4826-8da9-6c9365651418
[junit4] 2> 4879208 INFO (Block report processor) [ ] BlockStateChange BLOCK* processReport 0x3d0d044fb21e0842: from storage DS-310dc528-f394-4492-a796-3ab15fd8d2a7 node DatanodeRegistration(127.0.0.1:41368, datanodeUuid=6f8d875a-40fd-4826-8da9-6c9365651418, infoPort=45762, infoSecurePort=0, ipcPort=44724, storageInfo=lv=-57;cid=testClusterID;nsid=1227549582;c=1573076666459), blocks: 0, hasStaleStorage: true, processing time: 0 msecs, invalidatedBlocks: 0
[junit4] 2> 4879208 INFO (Block report processor) [ ] BlockStateChange BLOCK* processReport 0x3d0d044fb21e0842: Processing first storage report for DS-c202a69d-bf96-419d-bfe1-01a698baab75 from datanode 6f8d875a-40fd-4826-8da9-6c9365651418
[junit4] 2> 4879208 INFO (Block report processor) [ ] BlockStateChange BLOCK* processReport 0x3d0d044fb21e0842: from storage DS-c202a69d-bf96-419d-bfe1-01a698baab75 node DatanodeRegistration(127.0.0.1:41368, datanodeUuid=6f8d875a-40fd-4826-8da9-6c9365651418, infoPort=45762, infoSecurePort=0, ipcPort=44724, storageInfo=lv=-57;cid=testClusterID;nsid=1227549582;c=1573076666459), blocks: 0, hasStaleStorage: false, processing time: 0 msecs, invalidatedBlocks: 0
[junit4] IGNOR/A 0.00s J2 | MoveReplicaHDFSTest.testFailedMove
[junit4] > Assumption #1: 'awaitsfix' test group is disabled (@AwaitsFix(bugUrl=https://issues.apache.org/jira/browse/SOLR-12080))
[junit4] 2> 4879713 INFO (TEST-MoveReplicaHDFSTest.test-seed#[86A2BB39E38DBEE4]) [ ] o.a.s.SolrTestCaseJ4 ###Starting test
[junit4] 2> 4879714 INFO (TEST-MoveReplicaHDFSTest.test-seed#[86A2BB39E38DBEE4]) [ ] o.a.s.c.MiniSolrCloudCluster Starting cluster of 4 servers in /home/jenkins/jenkins-slave/workspace/Lucene-Solr-NightlyTests-8.3/checkout/solr/build/solr-core/test/J2/temp/solr.cloud.MoveReplicaHDFSTest_86A2BB39E38DBEE4-001/tempDir-002
[junit4] 2> 4879714 INFO (TEST-MoveReplicaHDFSTest.test-seed#[86A2BB39E38DBEE4]) [ ] o.a.s.c.ZkTestServer STARTING ZK TEST SERVER
[junit4] 2> 4879744 INFO (ZkTestServer Run Thread) [ ] o.a.s.c.ZkTestServer client port:0.0.0.0/0.0.0.0:0
[junit4] 2> 4879744 INFO (ZkTestServer Run Thread) [ ] o.a.s.c.ZkTestServer Starting server
[junit4] 2> 4879844 INFO (TEST-MoveReplicaHDFSTest.test-seed#[86A2BB39E38DBEE4]) [ ] o.a.s.c.ZkTestServer start zk server on port:41828
[junit4] 2> 4879844 INFO (TEST-MoveReplicaHDFSTest.test-seed#[86A2BB39E38DBEE4]) [ ] o.a.s.c.ZkTestServer waitForServerUp: 127.0.0.1:41828
[junit4] 2> 4879844 INFO (TEST-MoveReplicaHDFSTest.test-seed#[86A2BB39E38DBEE4]) [ ] o.a.s.c.ZkTestServer parse host and port list: 127.0.0.1:41828
[junit4] 2> 4879844 INFO (TEST-MoveReplicaHDFSTest.test-seed#[86A2BB39E38DBEE4]) [ ] o.a.s.c.ZkTestServer connecting to 127.0.0.1 41828
[junit4] 2> 4879846 INFO (TEST-MoveReplicaHDFSTest.test-seed#[86A2BB39E38DBEE4]) [ ] o.a.s.c.c.ConnectionManager Waiting for client to connect to ZooKeeper
[junit4] 2> 4879849 INFO (zkConnectionManagerCallback-16401-thread-1) [ ] o.a.s.c.c.ConnectionManager zkClient has connected
[junit4] 2> 4879849 INFO (TEST-MoveReplicaHDFSTest.test-seed#[86A2BB39E38DBEE4]) [ ] o.a.s.c.c.ConnectionManager Client is connected to ZooKeeper
[junit4] 2> 4879852 INFO (TEST-MoveReplicaHDFSTest.test-seed#[86A2BB39E38DBEE4]) [ ] o.a.s.c.c.ConnectionManager Waiting for client to connect to ZooKeeper
[junit4] 2> 4879852 INFO (zkConnectionManagerCallback-16403-thread-1) [ ] o.a.s.c.c.ConnectionManager zkClient has connected
[junit4] 2> 4879852 INFO (TEST-MoveReplicaHDFSTest.test-seed#[86A2BB39E38DBEE4]) [ ] o.a.s.c.c.ConnectionManager Client is connected to ZooKeeper
[junit4] 2> 4879853 INFO (TEST-MoveReplicaHDFSTest.test-seed#[86A2BB39E38DBEE4]) [ ] o.a.s.c.c.ConnectionManager Waiting for client to connect to ZooKeeper
[junit4] 2> 4879866 INFO (zkConnectionManagerCallback-16405-thread-1) [ ] o.a.s.c.c.ConnectionManager zkClient has connected
[junit4] 2> 4879866 INFO (TEST-MoveReplicaHDFSTest.test-seed#[86A2BB39E38DBEE4]) [ ] o.a.s.c.c.ConnectionManager Client is connected to ZooKeeper
[junit4] 2> 4879970 WARN (jetty-launcher-16406-thread-4) [ ] o.e.j.s.AbstractConnector Ignoring deprecated socket close linger time
[junit4] 2> 4879970 WARN (jetty-launcher-16406-thread-3) [ ] o.e.j.s.AbstractConnector Ignoring deprecated socket close linger time
[junit4] 2> 4879971 INFO (jetty-launcher-16406-thread-4) [ ] o.a.s.c.s.e.JettySolrRunner Start Jetty (configured port=0, binding port=0)
[junit4] 2> 4879971 INFO (jetty-launcher-16406-thread-4) [ ] o.a.s.c.s.e.JettySolrRunner Trying to start Jetty on port 0 try number 1 ...
[junit4] 2> 4879971 INFO (jetty-launcher-16406-thread-4) [ ] o.e.j.s.Server jetty-9.4.19.v20190610; built: 2019-06-10T16:30:51.723Z; git: afcf563148970e98786327af5e07c261fda175d3; jvm 1.8.0_191-b12
[junit4] 2> 4879971 WARN (jetty-launcher-16406-thread-2) [ ] o.e.j.s.AbstractConnector Ignoring deprecated socket close linger time
[junit4] 2> 4879971 WARN (jetty-launcher-16406-thread-1) [ ] o.e.j.s.AbstractConnector Ignoring deprecated socket close linger time
[junit4] 2> 4879971 INFO (jetty-launcher-16406-thread-2) [ ] o.a.s.c.s.e.JettySolrRunner Start Jetty (configured port=0, binding port=0)
[junit4] 2> 4879971 INFO (jetty-launcher-16406-thread-2) [ ] o.a.s.c.s.e.JettySolrRunner Trying to start Jetty on port 0 try number 1 ...
[junit4] 2> 4879971 INFO (jetty-launcher-16406-thread-2) [ ] o.e.j.s.Server jetty-9.4.19.v20190610; built: 2019-06-10T16:30:51.723Z; git: afcf563148970e98786327af5e07c261fda175d3; jvm 1.8.0_191-b12
[junit4] 2> 4879971 INFO (jetty-launcher-16406-thread-1) [ ] o.a.s.c.s.e.JettySolrRunner Start Jetty (configured port=0, binding port=0)
[junit4] 2> 4879971 INFO (jetty-launcher-16406-thread-1) [ ] o.a.s.c.s.e.JettySolrRunner Trying to start Jetty on port 0 try number 1 ...
[junit4] 2> 4879971 INFO (jetty-launcher-16406-thread-1) [ ] o.e.j.s.Server jetty-9.4.19.v20190610; built: 2019-06-10T16:30:51.723Z; git: afcf563148970e98786327af5e07c261fda175d3; jvm 1.8.0_191-b12
[junit4] 2> 4879971 INFO (jetty-launcher-16406-thread-3) [ ] o.a.s.c.s.e.JettySolrRunner Start Jetty (configured port=0, binding port=0)
[junit4] 2> 4879971 INFO (jetty-launcher-16406-thread-3) [ ] o.a.s.c.s.e.JettySolrRunner Trying to start Jetty on port 0 try number 1 ...
[junit4] 2> 4879972 INFO (jetty-launcher-16406-thread-3) [ ] o.e.j.s.Server jetty-9.4.19.v20190610; built: 2019-06-10T16:30:51.723Z; git: afcf563148970e98786327af5e07c261fda175d3; jvm 1.8.0_191-b12
[junit4] 2> 4879974 INFO (jetty-launcher-16406-thread-2) [ ] o.e.j.s.session DefaultSessionIdManager workerName=node0
[junit4] 2> 4879974 INFO (jetty-launcher-16406-thread-2) [ ] o.e.j.s.session No SessionScavenger set, using defaults
[junit4] 2> 4879974 INFO (jetty-launcher-16406-thread-2) [ ] o.e.j.s.session node0 Scavenging every 660000ms
[junit4] 2> 4879974 INFO (jetty-launcher-16406-thread-1) [ ] o.e.j.s.session DefaultSessionIdManager workerName=node0
[junit4] 2> 4879974 INFO (jetty-launcher-16406-thread-1) [ ] o.e.j.s.session No SessionScavenger set, using defaults
[junit4] 2> 4879974 INFO (jetty-launcher-16406-thread-1) [ ] o.e.j.s.session node0 Scavenging every 660000ms
[junit4] 2> 4879974 INFO (jetty-launcher-16406-thread-2) [ ] o.e.j.s.h.ContextHandler Started o.e.j.s.ServletContextHandler@e3d8c7e{/solr,null,AVAILABLE}
[junit4] 2> 4879974 INFO (jetty-launcher-16406-thread-1) [ ] o.e.j.s.h.ContextHandler Started o.e.j.s.ServletContextHandler@24e35014{/solr,null,AVAILABLE}
[junit4] 2> 4879975 INFO (jetty-launcher-16406-thread-4) [ ] o.e.j.s.session DefaultSessionIdManager workerName=node0
[junit4] 2> 4879975 INFO (jetty-launcher-16406-thread-4) [ ] o.e.j.s.session No SessionScavenger set, using defaults
[junit4] 2> 4879975 INFO (jetty-launcher-16406-thread-4) [ ] o.e.j.s.session node0 Scavenging every 600000ms
[junit4] 2> 4879984 INFO (jetty-launcher-16406-thread-4) [ ] o.e.j.s.h.ContextHandler Started o.e.j.s.ServletContextHandler@4b1c99d7{/solr,null,AVAILABLE}
[junit4] 2> 4879992 INFO (jetty-launcher-16406-thread-3) [ ] o.e.j.s.session DefaultSessionIdManager workerName=node0
[junit4] 2> 4879992 INFO (jetty-launcher-16406-thread-3) [ ] o.e.j.s.session No SessionScavenger set, using defaults
[junit4] 2> 4879992 INFO (jetty-launcher-16406-thread-3) [ ] o.e.j.s.session node0 Scavenging every 660000ms
[junit4] 2> 4879992 INFO (jetty-launcher-16406-thread-1) [ ] o.e.j.s.AbstractConnector Started ServerConnector@32864c89{SSL,[ssl, http/1.1]}{127.0.0.1:40191}
[junit4] 2> 4879992 INFO (jetty-launcher-16406-thread-1) [ ] o.e.j.s.Server Started @4880190ms
[junit4] 2> 4879992 INFO (jetty-launcher-16406-thread-4) [ ] o.e.j.s.AbstractConnector Started ServerConnector@1b7c43a1{SSL,[ssl, http/1.1]}{127.0.0.1:36252}
[junit4] 2> 4879992 INFO (jetty-launcher-16406-thread-1) [ ] o.a.s.c.s.e.JettySolrRunner Jetty properties: {hostContext=/solr, hostPort=40191}
[junit4] 2> 4879992 INFO (jetty-launcher-16406-thread-4) [ ] o.e.j.s.Server Started @4880190ms
[junit4] 2> 4879992 INFO (jetty-launcher-16406-thread-4) [ ] o.a.s.c.s.e.JettySolrRunner Jetty properties: {hostContext=/solr, hostPort=36252}
[junit4] 2> 4879992 INFO (jetty-launcher-16406-thread-3) [ ] o.e.j.s.h.ContextHandler Started o.e.j.s.ServletContextHandler@6fd3aa38{/solr,null,AVAILABLE}
[junit4] 2> 4879992 ERROR (jetty-launcher-16406-thread-1) [ ] o.a.s.u.StartupLoggingUtils Missing Java Option solr.log.dir. Logging may be missing or incomplete.
[junit4] 2> 4879992 INFO (jetty-launcher-16406-thread-1) [ ] o.a.s.s.SolrDispatchFilter Using logger factory org.apache.logging.slf4j.Log4jLoggerFactory
[junit4] 2> 4879992 ERROR (jetty-launcher-16406-thread-4) [ ] o.a.s.u.StartupLoggingUtils Missing Java Option solr.log.dir. Logging may be missing or incomplete.
[junit4] 2> 4879992 INFO (jetty-launcher-16406-thread-4) [ ] o.a.s.s.SolrDispatchFilter Using logger factory org.apache.logging.slf4j.Log4jLoggerFactory
[junit4] 2> 4879992 INFO (jetty-launcher-16406-thread-4) [ ] o.a.s.s.SolrDispatchFilter ___ _ Welcome to Apache Solr™ version 8.3.1
[junit4] 2> 4879992 INFO (jetty-launcher-16406-thread-4) [ ] o.a.s.s.SolrDispatchFilter / __| ___| |_ _ Starting in cloud mode on port null
[junit4] 2> 4879992 INFO (jetty-launcher-16406-thread-4) [ ] o.a.s.s.SolrDispatchFilter \__ \/ _ \ | '_| Install dir: null
[junit4] 2> 4879992 INFO (jetty-launcher-16406-thread-4) [ ] o.a.s.s.SolrDispatchFilter |___/\___/_|_| Start time: 2019-11-06T21:44:31.112Z
[junit4] 2> 4879992 INFO (jetty-launcher-16406-thread-1) [ ] o.a.s.s.SolrDispatchFilter ___ _ Welcome to Apache Solr™ version 8.3.1
[junit4] 2> 4879992 INFO (jetty-launcher-16406-thread-1) [ ] o.a.s.s.SolrDispatchFilter / __| ___| |_ _ Starting in cloud mode on port null
[junit4] 2> 4879992 INFO (jetty-launcher-16406-thread-1) [ ] o.a.s.s.SolrDispatchFilter \__ \/ _ \ | '_| Install dir: null
[junit4] 2> 4879992 INFO (jetty-launcher-16406-thread-1) [ ] o.a.s.s.SolrDispatchFilter |___/\___/_|_| Start time: 2019-11-06T21:44:31.112Z
[junit4] 2> 4879993 INFO (jetty-launcher-16406-thread-3) [ ] o.e.j.s.AbstractConnector Started ServerConnector@7b12f153{SSL,[ssl, http/1.1]}{127.0.0.1:41143}
[junit4] 2> 4879993 INFO (jetty-launcher-16406-thread-3) [ ] o.e.j.s.Server Started @4880190ms
[junit4] 2> 4879993 INFO (jetty-launcher-16406-thread-3) [ ] o.a.s.c.s.e.JettySolrRunner Jetty properties: {hostContext=/solr, hostPort=41143}
[junit4] 2> 4879993 ERROR (jetty-launcher-16406-thread-3) [ ] o.a.s.u.StartupLoggingUtils Missing Java Option solr.log.dir. Logging may be missing or incomplete.
[junit4] 2> 4879993 INFO (jetty-launcher-16406-thread-3) [ ] o.a.s.s.SolrDispatchFilter Using logger factory org.apache.logging.slf4j.Log4jLoggerFactory
[junit4] 2> 4879993 INFO (jetty-launcher-16406-thread-3) [ ] o.a.s.s.SolrDispatchFilter ___ _ Welcome to Apache Solr™ version 8.3.1
[junit4] 2> 4879993 INFO (jetty-launcher-16406-thread-3) [ ] o.a.s.s.SolrDispatchFilter / __| ___| |_ _ Starting in cloud mode on port null
[junit4] 2> 4879993 INFO (jetty-launcher-16406-thread-3) [ ] o.a.s.s.SolrDispatchFilter \__ \/ _ \ | '_| Install dir: null
[junit4] 2> 4879993 INFO (jetty-launcher-16406-thread-3) [ ] o.a.s.s.SolrDispatchFilter |___/\___/_|_| Start time: 2019-11-06T21:44:31.113Z
[junit4] 2> 4879994 INFO (jetty-launcher-16406-thread-4) [ ] o.a.s.c.c.ConnectionManager Waiting for client to connect to ZooKeeper
[junit4] 2> 4879994 INFO (jetty-launcher-16406-thread-2) [ ] o.e.j.s.AbstractConnector Started ServerConnector@4fe9a983{SSL,[ssl, http/1.1]}{127.0.0.1:44277}
[junit4] 2> 4879994 INFO (jetty-launcher-16406-thread-2) [ ] o.e.j.s.Server Started @4880191ms
[junit4] 2> 4879994 INFO (jetty-launcher-16406-thread-2) [ ] o.a.s.c.s.e.JettySolrRunner Jetty properties: {hostContext=/solr, hostPort=44277}
[junit4] 2> 4879994 ERROR (jetty-launcher-16406-thread-2) [ ] o.a.s.u.StartupLoggingUtils Missing Java Option solr.log.dir. Logging may be missing or incomplete.
[junit4] 2> 4879994 INFO (jetty-launcher-16406-thread-2) [ ] o.a.s.s.SolrDispatchFilter Using logger factory org.apache.logging.slf4j.Log4jLoggerFactory
[junit4] 2> 4879994 INFO (jetty-launcher-16406-thread-2) [ ] o.a.s.s.SolrDispatchFilter ___ _ Welcome to Apache Solr™ version 8.3.1
[junit4] 2> 4879994 INFO (jetty-launcher-16406-thread-2) [ ] o.a.s.s.SolrDispatchFilter / __| ___| |_ _ Starting in cloud mode on port null
[junit4] 2> 4879994 INFO (jetty-launcher-16406-thread-2) [ ] o.a.s.s.SolrDispatchFilter \__ \/ _ \ | '_| Install dir: null
[junit4] 2> 4879994 INFO (jetty-launcher-16406-thread-2) [ ] o.a.s.s.SolrDispatchFilter |___/\___/_|_| Start time: 2019-11-06T21:44:31.114Z
[junit4] 2> 4879995 INFO (jetty-launcher-16406-thread-3) [ ] o.a.s.c.c.ConnectionManager Waiting for client to connect to ZooKeeper
[junit4] 2> 4879995 INFO (jetty-launcher-16406-thread-1) [ ] o.a.s.c.c.ConnectionManager Waiting for client to connect to ZooKeeper
[junit4] 2> 4879996 INFO (jetty-launcher-16406-thread-2) [ ] o.a.s.c.c.ConnectionManager Waiting for client to connect to ZooKeeper
[junit4] 2> 4879996 INFO (zkConnectionManagerCallback-16408-thread-1) [ ] o.a.s.c.c.ConnectionManager zkClient has connected
[junit4] 2> 4879996 INFO (jetty-launcher-16406-thread-4) [ ] o.a.s.c.c.ConnectionManager Client is connected to ZooKeeper
[junit4] 2> 4879999 INFO (jetty-launcher-16406-thread-4) [ ] o.a.s.s.SolrDispatchFilter solr.xml found in ZooKeeper. Loading...
[junit4] 2> 4880012 INFO (zkConnectionManagerCallback-16414-thread-1) [ ] o.a.s.c.c.ConnectionManager zkClient has connected
[junit4] 2> 4880012 INFO (zkConnectionManagerCallback-16412-thread-1) [ ] o.a.s.c.c.ConnectionManager zkClient has connected
[junit4] 2> 4880012 INFO (jetty-launcher-16406-thread-2) [ ] o.a.s.c.c.ConnectionManager Client is connected to ZooKeeper
[junit4] 2> 4880012 INFO (jetty-launcher-16406-thread-3) [ ] o.a.s.c.c.ConnectionManager Client is connected to ZooKeeper
[junit4] 2> 4880013 INFO (zkConnectionManagerCallback-16410-thread-1) [ ] o.a.s.c.c.ConnectionManager zkClient has connected
[junit4] 2> 4880013 INFO (jetty-launcher-16406-thread-1) [ ] o.a.s.c.c.ConnectionManager Client is connected to ZooKeeper
[junit4] 2> 4880013 INFO (jetty-launcher-16406-thread-3) [ ] o.a.s.s.SolrDispatchFilter solr.xml found in ZooKeeper. Loading...
[junit4] 2> 4880013 INFO (jetty-launcher-16406-thread-2) [ ] o.a.s.s.SolrDispatchFilter solr.xml found in ZooKeeper. Loading...
[junit4] 2> 4880013 INFO (jetty-launcher-16406-thread-1) [ ] o.a.s.s.SolrDispatchFilter solr.xml found in ZooKeeper. Loading...
[junit4] 2> 4880015 INFO (jetty-launcher-16406-thread-4) [ ] o.a.s.c.SolrXmlConfig Configuration parameter autoReplicaFailoverWorkLoopDelay is ignored
[junit4] 2> 4880015 INFO (jetty-launcher-16406-thread-2) [ ] o.a.s.c.SolrXmlConfig Configuration parameter autoReplicaFailoverWorkLoopDelay is ignored
[junit4] 2> 4880015 INFO (jetty-launcher-16406-thread-3) [ ] o.a.s.c.SolrXmlConfig Configuration parameter autoReplicaFailoverWorkLoopDelay is ignored
[junit4] 2> 4880015 INFO (jetty-launcher-16406-thread-4) [ ] o.a.s.c.SolrXmlConfig Configuration parameter autoReplicaFailoverBadNodeExpiration is ignored
[junit4] 2> 4880015 INFO (jetty-launcher-16406-thread-2) [ ] o.a.s.c.SolrXmlConfig Configuration parameter autoReplicaFailoverBadNodeExpiration is ignored
[junit4] 2> 4880015 INFO (jetty-launcher-16406-thread-3) [ ] o.a.s.c.SolrXmlConfig Configuration parameter autoReplicaFailoverBadNodeExpiration is ignored
[junit4] 2> 4880030 INFO (jetty-launcher-16406-thread-3) [ ] o.a.s.c.SolrXmlConfig MBean server found: com.sun.jmx.mbeanserver.JmxMBeanServer@51fb7a74, but no JMX reporters were configured - adding default JMX reporter.
[junit4] 2> 4880030 INFO (jetty-launcher-16406-thread-4) [ ] o.a.s.c.SolrXmlConfig MBean server found: com.sun.jmx.mbeanserver.JmxMBeanServer@51fb7a74, but no JMX reporters were configured - adding default JMX reporter.
[junit4] 2> 4880035 INFO (jetty-launcher-16406-thread-1) [ ] o.a.s.c.SolrXmlConfig Configuration parameter autoReplicaFailoverWorkLoopDelay is ignored
[junit4] 2> 4880035 INFO (jetty-launcher-16406-thread-1) [ ] o.a.s.c.SolrXmlConfig Configuration parameter autoReplicaFailoverBadNodeExpiration is ignored
[junit4] 2> 4880036 INFO (jetty-launcher-16406-thread-1) [ ] o.a.s.c.SolrXmlConfig MBean server found: com.sun.jmx.mbeanserver.JmxMBeanServer@51fb7a74, but no JMX reporters were configured - adding default JMX reporter.
[junit4] 2> 4880038 INFO (jetty-launcher-16406-thread-2) [ ] o.a.s.c.SolrXmlConfig MBean server found: com.sun.jmx.mbeanserver.JmxMBeanServer@51fb7a74, but no JMX reporters were configured - adding default JMX reporter.
[junit4] 2> 4880455 INFO (jetty-launcher-16406-thread-4) [ ] o.a.s.h.c.HttpShardHandlerFactory Host whitelist initialized: WhitelistHostChecker [whitelistHosts=null, whitelistHostCheckingEnabled=true]
[junit4] 2> 4880456 WARN (jetty-launcher-16406-thread-4) [ ] o.a.s.c.s.i.Http2SolrClient Create Http2SolrClient with HTTP/1.1 transport since Java 8 or lower versions does not support SSL + HTTP/2
[junit4] 2> 4880457 WARN (jetty-launcher-16406-thread-4) [ ] o.e.j.u.s.S.config Trusting all certificates configured for Client@7597de0e[provider=null,keyStore=null,trustStore=null]
[junit4] 2> 4880457 WARN (jetty-launcher-16406-thread-4) [ ] o.e.j.u.s.S.config No Client EndPointIdentificationAlgorithm configured for Client@7597de0e[provider=null,keyStore=null,trustStore=null]
[junit4] 2> 4880459 WARN (jetty-launcher-16406-thread-4) [ ] o.a.s.c.s.i.Http2SolrClient Create Http2SolrClient with HTTP/1.1 transport since Java 8 or lower versions does not support SSL + HTTP/2
[junit4] 2> 4880476 WARN (jetty-launcher-16406-thread-4) [ ] o.e.j.u.s.S.config Trusting all certificates configured for Client@70cc5d02[provider=null,keyStore=null,trustStore=null]
[junit4] 2> 4880476 WARN (jetty-launcher-16406-thread-4) [ ] o.e.j.u.s.S.config No Client EndPointIdentificationAlgorithm configured for Client@70cc5d02[provider=null,keyStore=null,trustStore=null]
[junit4] 2> 4880477 INFO (jetty-launcher-16406-thread-4) [ ] o.a.s.c.ZkContainer Zookeeper client=127.0.0.1:41828/solr
[junit4] 2> 4880492 INFO (jetty-launcher-16406-thread-4) [ ] o.a.s.c.c.ConnectionManager Waiting for client to connect to ZooKeeper
[junit4] 2> 4880493 INFO (zkConnectionManagerCallback-16424-thread-1) [ ] o.a.s.c.c.ConnectionManager zkClient has connected
[junit4] 2> 4880493 INFO (jetty-launcher-16406-thread-4) [ ] o.a.s.c.c.ConnectionManager Client is connected to ZooKeeper
[junit4] 2> 4880611 INFO (jetty-launcher-16406-thread-4) [n:127.0.0.1:36252_solr ] o.a.s.c.c.ConnectionManager Waiting for client to connect to ZooKeeper
[junit4] 2> 4880611 INFO (zkConnectionManagerCallback-16426-thread-1) [ ] o.a.s.c.c.ConnectionManager zkClient has connected
[junit4] 2> 4880611 INFO (jetty-launcher-16406-thread-4) [n:127.0.0.1:36252_solr ] o.a.s.c.c.ConnectionManager Client is connected to ZooKeeper
[junit4] 2> 4880848 INFO (jetty-launcher-16406-thread-4) [n:127.0.0.1:36252_solr ] o.a.s.c.OverseerElectionContext I am going to be the leader 127.0.0.1:36252_solr
[junit4] 2> 4880848 INFO (jetty-launcher-16406-thread-4) [n:127.0.0.1:36252_solr ] o.a.s.c.Overseer Overseer (id=75689210647543816-127.0.0.1:36252_solr-n_0000000000) starting
[junit4] 2> 4880864 INFO (OverseerStateUpdate-75689210647543816-127.0.0.1:36252_solr-n_0000000000) [n:127.0.0.1:36252_solr ] o.a.s.c.Overseer Starting to work on the main queue : 127.0.0.1:36252_solr
[junit4] 2> 4880899 INFO (jetty-launcher-16406-thread-4) [n:127.0.0.1:36252_solr ] o.a.s.c.ZkController Register node as live in ZooKeeper:/live_nodes/127.0.0.1:36252_solr
[junit4] 2> 4880923 INFO (zkCallback-16425-thread-1) [ ] o.a.s.c.c.ZkStateReader Updated live nodes from ZooKeeper... (0) -> (1)
[junit4] 2> 4880952 DEBUG (OverseerAutoScalingTriggerThread-75689210647543816-127.0.0.1:36252_solr-n_0000000000) [ ] o.a.s.c.a.NodeLostTrigger NodeLostTrigger .auto_add_replicas - Initial livenodes: [127.0.0.1:36252_solr]
[junit4] 2> 4880989 DEBUG (ScheduledTrigger-13004-thread-1) [ ] o.a.s.c.a.NodeLostTrigger Running NodeLostTrigger: .auto_add_replicas with currently live nodes: 1 and last live nodes: 1
[junit4] 2> 4881025 INFO (jetty-launcher-16406-thread-4) [n:127.0.0.1:36252_solr ] o.a.s.h.a.MetricsHistoryHandler No .system collection, keeping metrics history in memory.
[junit4] 2> 4881062 INFO (jetty-launcher-16406-thread-1) [ ] o.a.s.h.c.HttpShardHandlerFactory Host whitelist initialized: WhitelistHostChecker [whitelistHosts=null, whitelistHostCheckingEnabled=true]
[junit4] 2> 4881062 WARN (jetty-launcher-16406-thread-1) [ ] o.a.s.c.s.i.Http2SolrClient Create Http2SolrClient with HTTP/1.1 transport since Java 8 or lower versions does not support SSL + HTTP/2
[junit4] 2> 4881161 INFO (jetty-launcher-16406-thread-4) [n:127.0.0.1:36252_solr ] o.a.s.m.r.SolrJmxReporter JMX monitoring for 'solr.node' (registry 'solr.node') enabled at server: com.sun.jmx.mbeanserver.JmxMBeanServer@51fb7a74
[junit4] 2> 4881169 WARN (jetty-launcher-16406-thread-1) [ ] o.e.j.u.s.S.config Trusting all certificates configured for Client@14ee4d54[provider=null,keyStore=null,trustStore=null]
[junit4] 2> 4881169 WARN (jetty-launcher-16406-thread-1) [ ] o.e.j.u.s.S.config No Client EndPointIdentificationAlgorithm configured for Client@14ee4d54[provider=null,keyStore=null,trustStore=null]
[junit4] 2> 4881192 INFO (jetty-launcher-16406-thread-2) [ ] o.a.s.h.c.HttpShardHandlerFactory Host whitelist initialized: WhitelistHostChecker [whitelistHosts=null, whitelistHostCheckingEnabled=true]
[junit4] 2> 4881192 WARN (jetty-launcher-16406-thread-2) [ ] o.a.s.c.s.i.Http2SolrClient Create Http2SolrClient with HTTP/1.1 transport since Java 8 or lower versions does not support SSL + HTTP/2
[junit4] 2> 4881200 INFO (jetty-launcher-16406-thread-4) [n:127.0.0.1:36252_solr ] o.a.s.m.r.SolrJmxReporter JMX monitoring for 'solr.jvm' (registry 'solr.jvm') enabled at server: com.sun.jmx.mbeanserver.JmxMBeanServer@51fb7a74
[junit4] 2> 4881200 INFO (jetty-launcher-16406-thread-4) [n:127.0.0.1:36252_solr ] o.a.s.m.r.SolrJmxReporter JMX monitoring for 'solr.jetty' (registry 'solr.jetty') enabled at server: com.sun.jmx.mbeanserver.JmxMBeanServer@51fb7a74
[junit4] 2> 4881201 INFO (jetty-launcher-16406-thread-4) [n:127.0.0.1:36252_solr ] o.a.s.c.CorePropertiesLocator Found 0 core definitions underneath /home/jenkins/jenkins-slave/workspace/Lucene-Solr-NightlyTests-8.3/checkout/solr/build/solr-core/test/J2/temp/solr.cloud.MoveReplicaHDFSTest_86A2BB39E38DBEE4-001/tempDir-002/node4/.
[junit4] 2> 4881207 WARN (jetty-launcher-16406-thread-1) [ ] o.a.s.c.s.i.Http2SolrClient Create Http2SolrClient with HTTP/1.1 transport since Java 8 or lower versions does not support SSL + HTTP/2
[junit4] 2> 4881208 WARN (jetty-launcher-16406-thread-1) [ ] o.e.j.u.s.S.config Trusting all certificates configured for Client@7d72eec0[provider=null,keyStore=null,trustStore=null]
[junit4] 2> 4881208 WARN (jetty-launcher-16406-thread-1) [ ] o.e.j.u.s.S.config No Client EndPointIdentificationAlgorithm configured for Client@7d72eec0[provider=null,keyStore=null,trustStore=null]
[junit4] 2> 4881209 INFO (jetty-launcher-16406-thread-1) [ ] o.a.s.c.ZkContainer Zookeeper client=127.0.0.1:41828/solr
[junit4] 2> 4881209 INFO (jetty-launcher-16406-thread-3) [ ] o.a.s.h.c.HttpShardHandlerFactory Host whitelist initialized: WhitelistHostChecker [whitelistHosts=null, whitelistHostCheckingEnabled=true]
[junit4] 2> 4881209 WARN (jetty-launcher-16406-thread-3) [ ] o.a.s.c.s.i.Http2SolrClient Create Http2SolrClient with HTTP/1.1 transport since Java 8 or lower versions does not support SSL + HTTP/2
[junit4] 2> 4881209 INFO (jetty-launcher-16406-thread-1) [ ] o.a.s.c.c.ConnectionManager Waiting for client to connect to ZooKeeper
[junit4] 2> 4881210 WARN (jetty-launcher-16406-thread-2) [ ] o.e.j.u.s.S.config Trusting all certificates configured for Client@29a9c5d6[provider=null,keyStore=null,trustStore=null]
[junit4] 2> 4881210 WARN (jetty-launcher-16406-thread-2) [ ] o.e.j.u.s.S.config No Client EndPointIdentificationAlgorithm configured for Client@29a9c5d6[provider=null,keyStore=null,trustStore=null]
[junit4] 2> 4881211 WARN (jetty-launcher-16406-thread-3) [ ] o.e.j.u.s.S.config Trusting all certificates configured for Client@1bb71cfc[provider=null,keyStore=null,trustStore=null]
[junit4] 2> 4881211 WARN (jetty-launcher-16406-thread-3) [ ] o.e.j.u.s.S.config No Client EndPointIdentificationAlgorithm configured for Client@1bb71cfc[provider=null,keyStore=null,trustStore=null]
[junit4] 2> 4881212 WARN (jetty-launcher-16406-thread-2) [ ] o.a.s.c.s.i.Http2SolrClient Create Http2SolrClient with HTTP/1.1 transport since Java 8 or lower versions does not support SSL + HTTP/2
[junit4] 2> 4881212 WARN (jetty-launcher-16406-thread-3) [ ] o.a.s.c.s.i.Http2SolrClient Create Http2SolrClient with HTTP/1.1 transport since Java 8 or lower versions does not support SSL + HTTP/2
[junit4] 2> 4881213 INFO (zkConnectionManagerCallback-16437-thread-1) [ ] o.a.s.c.c.ConnectionManager zkClient has connected
[junit4] 2> 4881213 INFO (jetty-launcher-16406-thread-1) [ ] o.a.s.c.c.ConnectionManager Client is connected to ZooKeeper
[junit4] 2> 4881213 WARN (jetty-launcher-16406-thread-2) [ ] o.e.j.u.s.S.config Trusting all certificates configured for Client@a9bac26[provider=null,keyStore=null,trustStore=null]
[junit4] 2> 4881213 WARN (jetty-launcher-16406-thread-2) [ ] o.e.j.u.s.S.config No Client EndPointIdentificationAlgorithm configured for Client@a9bac26[provider=null,keyStore=null,trustStore=null]
[junit4] 2> 4881214 INFO (jetty-launcher-16406-thread-2) [ ] o.a.s.c.ZkContainer Zookeeper client=127.0.0.1:41828/solr
[junit4] 2> 4881214 INFO (jetty-launcher-16406-thread-2) [ ] o.a.s.c.c.ConnectionManager Waiting for client to connect to ZooKeeper
[junit4] 2> 4881215 WARN (jetty-launcher-16406-thread-3) [ ] o.e.j.u.s.S.config Trusting all certificates configured for Client@7203e422[provider=null,keyStore=null,trustStore=null]
[junit4] 2> 4881215 WARN (jetty-launcher-16406-thread-3) [ ] o.e.j.u.s.S.config No Client EndPointIdentificationAlgorithm configured for Client@7203e422[provider=null,keyStore=null,trustStore=null]
[junit4] 2> 4881215 INFO (jetty-launcher-16406-thread-3) [ ] o.a.s.c.ZkContainer Zookeeper client=127.0.0.1:41828/solr
[junit4] 2> 4881228 INFO (jetty-launcher-16406-thread-3) [ ] o.a.s.c.c.ConnectionManager Waiting for client to connect to ZooKeeper
[junit4] 2> 4881232 INFO (zkConnectionManagerCallback-16445-thread-1) [ ] o.a.s.c.c.ConnectionManager zkClient has connected
[junit4] 2> 4881232 INFO (jetty-launcher-16406-thread-2) [ ] o.a.s.c.c.ConnectionManager Client is connected to ZooKeeper
[junit4] 2> 4881233 INFO (zkConnectionManagerCallback-16448-thread-1) [ ] o.a.s.c.c.ConnectionManager zkClient has connected
[junit4] 2> 4881233 INFO (jetty-launcher-16406-thread-3) [ ] o.a.s.c.c.ConnectionManager Client is connected to ZooKeeper
[junit4] 2> 4881333 INFO (jetty-launcher-16406-thread-1) [n:127.0.0.1:40191_solr ] o.a.s.c.c.ConnectionManager Waiting for client to connect to ZooKeeper
[junit4] 2> 4881334 INFO (zkConnectionManagerCallback-16450-thread-1) [ ] o.a.s.c.c.ConnectionManager zkClient has connected
[junit4] 2> 4881334 INFO (jetty-launcher-16406-thread-1) [n:127.0.0.1:40191_solr ] o.a.s.c.c.ConnectionManager Client is connected to ZooKeeper
[junit4] 2> 4881338 INFO (jetty-launcher-16406-thread-1) [n:127.0.0.1:40191_solr ] o.a.s.c.c.ZkStateReader Updated live nodes from ZooKeeper... (0) -> (1)
[junit4] 2> 4881341 INFO (jetty-launcher-16406-thread-1) [n:127.0.0.1:40191_solr ] o.a.s.c.ZkController Publish node=127.0.0.1:40191_solr as DOWN
[junit4] 2> 4881342 INFO (jetty-launcher-16406-thread-1) [n:127.0.0.1:40191_solr ] o.a.s.c.TransientSolrCoreCacheDefault Allocating transient cache for 4 transient cores
[junit4] 2> 4881342 INFO (jetty-launcher-16406-thread-1) [n:127.0.0.1:40191_solr ] o.a.s.c.ZkController Register node as live in ZooKeeper:/live_nodes/127.0.0.1:40191_solr
[junit4] 2> 4881343 INFO (zkCallback-16425-thread-1) [ ] o.a.s.c.c.ZkStateReader Updated live nodes from ZooKeeper... (1) -> (2)
[junit4] 2> 4881343 INFO (zkCallback-16449-thread-1) [ ] o.a.s.c.c.ZkStateReader Updated live nodes from ZooKeeper... (1) -> (2)
[junit4] 2> 4881380 INFO (jetty-launcher-16406-thread-1) [n:127.0.0.1:40191_solr ] o.a.s.h.a.MetricsHistoryHandler No .system collection, keeping metrics history in memory.
[junit4] 2> 4881409 INFO (jetty-launcher-16406-thread-1) [n:127.0.0.1:40191_solr ] o.a.s.m.r.SolrJmxReporter JMX monitoring for 'solr.node' (registry 'solr.node') enabled at server: com.sun.jmx.mbeanserver.JmxMBeanServer@51fb7a74
[junit4] 2> 4881458 INFO (jetty-launcher-16406-thread-3) [n:127.0.0.1:41143_solr ] o.a.s.c.c.ConnectionManager Waiting for client to connect to ZooKeeper
[junit4] 2> 4881460 INFO (jetty-launcher-16406-thread-1) [n:127.0.0.1:40191_solr ] o.a.s.m.r.SolrJmxReporter JMX monitoring for 'solr.jvm' (registry 'solr.jvm') enabled at server: com.sun.jmx.mbeanserver.JmxMBeanServer@51fb7a74
[junit4] 2> 4881460 INFO (jetty-launcher-16406-thread-1) [n:127.0.0.1:40191_solr ] o.a.s.m.r.SolrJmxReporter JMX monitoring for 'solr.jetty' (registry 'solr.jetty') enabled at server: com.sun.jmx.mbeanserver.JmxMBeanServer@51fb7a74
[junit4] 2> 4881461 INFO (jetty-launcher-16406-thread-1) [n:127.0.0.1:40191_solr ] o.a.s.c.CorePropertiesLocator Found 0 core definitions underneath /home/jenkins/jenkins-slave/workspace/Lucene-Solr-NightlyTests-8.3/checkout/solr/build/solr-core/test/J2/temp/solr.cloud.MoveReplicaHDFSTest_86A2BB39E38DBEE4-001/tempDir-002/node1/.
[junit4] 2> 4881485 INFO (zkConnectionManagerCallback-16456-thread-1) [ ] o.a.s.c.c.ConnectionManager zkClient has connected
[junit4] 2> 4881485 INFO (jetty-launcher-16406-thread-3) [n:127.0.0.1:41143_solr ] o.a.s.c.c.ConnectionManager Client is connected to ZooKeeper
[junit4] 2> 4881532 INFO (jetty-launcher-16406-thread-3) [n:127.0.0.1:41143_solr ] o.a.s.c.c.ZkStateReader Updated live nodes from ZooKeeper... (0) -> (2)
[junit4] 2> 4881631 INFO (jetty-launcher-16406-thread-2) [n:127.0.0.1:44277_solr ] o.a.s.c.c.ConnectionManager Waiting for client to connect to ZooKeeper
[junit4] 2> 4881661 INFO (zkConnectionManagerCallback-16460-thread-1) [ ] o.a.s.c.c.ConnectionManager zkClient has connected
[junit4] 2> 4881661 INFO (jetty-launcher-16406-thread-2) [n:127.0.0.1:44277_solr ] o.a.s.c.c.ConnectionManager Client is connected to ZooKeeper
[junit4] 2> 4881679 INFO (jetty-launcher-16406-thread-3) [n:127.0.0.1:41143_solr ] o.a.s.c.ZkController Publish node=127.0.0.1:41143_solr as DOWN
[junit4] 2> 4881680 INFO (jetty-launcher-16406-thread-3) [n:127.0.0.1:41143_solr ] o.a.s.c.TransientSolrCoreCacheDefault Allocating transient cache for 4 transient cores
[junit4] 2> 4881680 INFO (jetty-launcher-16406-thread-3) [n:127.0.0.1:41143_solr ] o.a.s.c.ZkController Register node as live in ZooKeeper:/live_nodes/127.0.0.1:41143_solr
[junit4] 2> 4881681 INFO (zkCallback-16425-thread-1) [ ] o.a.s.c.c.ZkStateReader Updated live nodes from ZooKeeper... (2) -> (3)
[junit4] 2> 4881682 INFO (zkCallback-16455-thread-1) [ ] o.a.s.c.c.ZkStateReader Updated live nodes from ZooKeeper... (2) -> (3)
[junit4] 2> 4881691 INFO (zkCallback-16449-thread-1) [ ] o.a.s.c.c.ZkStateReader Updated live nodes from ZooKeeper... (2) -> (3)
[junit4] 2> 4881693 INFO (jetty-launcher-16406-thread-2) [n:127.0.0.1:44277_solr ] o.a.s.c.c.ZkStateReader Updated live nodes from ZooKeeper... (0) -> (3)
[junit4] 2> 4881705 INFO (jetty-launcher-16406-thread-2) [n:127.0.0.1:44277_solr ] o.a.s.c.ZkController Publish node=127.0.0.1:44277_solr as DOWN
[junit4] 2> 4881705 INFO (jetty-launcher-16406-thread-2) [n:127.0.0.1:44277_solr ] o.a.s.c.TransientSolrCoreCacheDefault Allocating transient cache for 4 transient cores
[junit4] 2> 4881705 INFO (jetty-launcher-16406-thread-2) [n:127.0.0.1:44277_solr ] o.a.s.c.ZkController Register node as live in ZooKeeper:/live_nodes/127.0.0.1:44277_solr
[junit4] 2> 4881706 INFO (zkCallback-16425-thread-1) [ ] o.a.s.c.c.ZkStateReader Updated live nodes from ZooKeeper... (3) -> (4)
[junit4] 2> 4881707 INFO (zkCallback-16455-thread-1) [ ] o.a.s.c.c.ZkStateReader Updated live nodes from ZooKeeper... (3) -> (4)
[junit4] 2> 4881716 INFO (zkCallback-16449-thread-1) [ ] o.a.s.c.c.ZkStateReader Updated live nodes from ZooKeeper... (3) -> (4)
[junit4] 2> 4881736 INFO (zkCallback-16459-thread-1) [ ] o.a.s.c.c.ZkStateReader Updated live nodes from ZooKeeper... (3) -> (4)
[junit4] 2> 4881753 INFO (jetty-launcher-16406-thread-3) [n:127.0.0.1:41143_solr ] o.a.s.h.a.MetricsHistoryHandler No .system collection, keeping metrics history in memory.
[junit4] 2> 4881777 INFO (jetty-launcher-16406-thread-2) [n:127.0.0.1:44277_solr ] o.a.s.h.a.MetricsHistoryHandler No .system collection, keeping metrics history in memory.
[junit4] 2> 4881837 INFO (jetty-launcher-16406-thread-3) [n:127.0.0.1:41143_solr ] o.a.s.m.r.SolrJmxReporter JMX monitoring for 'solr.node' (registry 'solr.node') enabled at server: com.sun.jmx.mbeanserver.JmxMBeanServer@51fb7a74
[junit4] 2> 4881862 INFO (jetty-launcher-16406-thread-2) [n:127.0.0.1:44277_solr ] o.a.s.m.r.SolrJmxReporter JMX monitoring for 'solr.node' (registry 'solr.node') enabled at server: com.sun.jmx.mbeanserver.JmxMBeanServer@51fb7a74
[junit4] 2> 4881895 INFO (jetty-launcher-16406-thread-3) [n:127.0.0.1:41143_solr ] o.a.s.m.r.SolrJmxReporter JMX monitoring for 'solr.jvm' (registry 'solr.jvm') enabled at server: com.sun.jmx.mbeanserver.JmxMBeanServer@51fb7a74
[junit4] 2> 4881895 INFO (jetty-launcher-16406-thread-3) [n:127.0.0.1:41143_solr ] o.a.s.m.r.SolrJmxReporter JMX monitoring for 'solr.jetty' (registry 'solr.jetty') enabled at server: com.sun.jmx.mbeanserver.JmxMBeanServer@51fb7a74
[junit4] 2> 4881896 INFO (jetty-launcher-16406-thread-3) [n:127.0.0.1:41143_solr ] o.a.s.c.CorePropertiesLocator Found 0 core definitions underneath /home/jenkins/jenkins-slave/workspace/Lucene-Solr-NightlyTests-8.3/checkout/solr/build/solr-core/test/J2/temp/solr.cloud.MoveReplicaHDFSTest_86A2BB39E38DBEE4-001/tempDir-002/node3/.
[junit4] 2> 4881897 INFO (jetty-launcher-16406-thread-2) [n:127.0.0.1:44277_solr ] o.a.s.m.r.SolrJmxReporter JMX monitoring for 'solr.jvm' (registry 'solr.jvm') enabled at server: com.sun.jmx.mbeanserver.JmxMBeanServer@51fb7a74
[junit4] 2> 4881897 INFO (jetty-launcher-16406-thread-2) [n:127.0.0.1:44277_solr ] o.a.s.m.r.SolrJmxReporter JMX monitoring for 'solr.jetty' (registry 'solr.jetty') enabled at server: com.sun.jmx.mbeanserver.JmxMBeanServer@51fb7a74
[junit4] 2> 4881898 INFO (jetty-launcher-16406-thread-2) [n:127.0.0.1:44277_solr ] o.a.s.c.CorePropertiesLocator Found 0 core definitions underneath /home/jenkins/jenkins-slave/workspace/Lucene-Solr-NightlyTests-8.3/checkout/solr/build/solr-core/test/J2/temp/solr.cloud.MoveReplicaHDFSTest_86A2BB39E38DBEE4-001/tempDir-002/node2/.
[junit4] 2> 4881990 DEBUG (ScheduledTrigger-13004-thread-3) [ ] o.a.s.c.a.NodeLostTrigger Running NodeLostTrigger: .auto_add_replicas with currently live nodes: 4 and last live nodes: 1
[junit4] 2> 4882158 INFO (TEST-MoveReplicaHDFSTest.test-seed#[86A2BB39E38DBEE4]) [ ] o.a.s.c.MiniSolrCloudCluster waitForAllNodes: numServers=4
[junit4] 2> 4882167 INFO (TEST-MoveReplicaHDFSTest.test-seed#[86A2BB39E38DBEE4]) [ ] o.a.s.c.c.ConnectionManager Waiting for client to connect to ZooKeeper
[junit4] 2> 4882171 INFO (zkConnectionManagerCallback-16471-thread-1) [ ] o.a.s.c.c.ConnectionManager zkClient has connected
[junit4] 2> 4882171 INFO (TEST-MoveReplicaHDFSTest.test-seed#[86A2BB39E38DBEE4]) [ ] o.a.s.c.c.ConnectionManager Client is connected to ZooKeeper
[junit4] 2> 4882173 INFO (TEST-MoveReplicaHDFSTest.test-seed#[86A2BB39E38DBEE4]) [ ] o.a.s.c.c.ZkStateReader Updated live nodes from ZooKeeper... (0) -> (4)
[junit4] 2> 4882174 INFO (TEST-MoveReplicaHDFSTest.test-seed#[86A2BB39E38DBEE4]) [ ] o.a.s.c.s.i.ZkClientClusterStateProvider Cluster at 127.0.0.1:41828/solr ready
[junit4] 2> 4882308 INFO (qtp1158791923-105327) [n:127.0.0.1:44277_solr ] o.a.s.h.a.CollectionsHandler Invoked Collection Action :overseerstatus with params action=OVERSEERSTATUS&wt=javabin&version=2 and sendToOCPQueue=true
[junit4] 2> 4882431 INFO (qtp1158791923-105327) [n:127.0.0.1:44277_solr ] o.a.s.s.HttpSolrCall [admin] webapp=null path=/admin/collections params={action=OVERSEERSTATUS&wt=javabin&version=2} status=0 QTime=122
[junit4] 2> 4882431 INFO (TEST-MoveReplicaHDFSTest.test-seed#[86A2BB39E38DBEE4]) [ ] o.a.s.c.MoveReplicaTest total_jettys: 4
[junit4] 2> 4882432 INFO (qtp1158791923-105330) [n:127.0.0.1:44277_solr ] o.a.s.h.a.CollectionsHandler Invoked Collection Action :create with params pullReplicas=1&collection.configName=conf1&maxShardsPerNode=2&autoAddReplicas=false&name=MoveReplicaHDFSTest_coll_true&nrtReplicas=1&action=CREATE&numShards=2&tlogReplicas=0&wt=javabin&version=2 and sendToOCPQueue=true
[junit4] 2> 4882445 INFO (OverseerThreadFactory-13006-thread-2-processing-n:127.0.0.1:36252_solr) [n:127.0.0.1:36252_solr ] o.a.s.c.a.c.CreateCollectionCmd Create collection MoveReplicaHDFSTest_coll_true
[junit4] 2> 4882445 INFO (OverseerCollectionConfigSetProcessor-75689210647543816-127.0.0.1:36252_solr-n_0000000000) [n:127.0.0.1:36252_solr ] o.a.s.c.OverseerTaskQueue Response ZK path: /overseer/collection-queue-work/qnr-0000000000 doesn't exist. Requestor may have disconnected from ZooKeeper
[junit4] 2> 4882583 INFO (OverseerStateUpdate-75689210647543816-127.0.0.1:36252_solr-n_0000000000) [n:127.0.0.1:36252_solr ] o.a.s.c.o.SliceMutator createReplica() {
[junit4] 2> "operation":"ADDREPLICA",
[junit4] 2> "collection":"MoveReplicaHDFSTest_coll_true",
[junit4] 2> "shard":"shard1",
[junit4] 2> "core":"MoveReplicaHDFSTest_coll_true_shard1_replica_n1",
[junit4] 2> "state":"down",
[junit4] 2> "base_url":"https://127.0.0.1:41143/solr",
[junit4] 2> "type":"NRT",
[junit4] 2> "waitForFinalState":"false"}
[junit4] 2> 4882585 INFO (OverseerStateUpdate-75689210647543816-127.0.0.1:36252_solr-n_0000000000) [n:127.0.0.1:36252_solr ] o.a.s.c.o.SliceMutator createReplica() {
[junit4] 2> "operation":"ADDREPLICA",
[junit4] 2> "collection":"MoveReplicaHDFSTest_coll_true",
[junit4] 2> "shard":"shard1",
[junit4] 2> "core":"MoveReplicaHDFSTest_coll_true_shard1_replica_p2",
[junit4] 2> "state":"down",
[junit4] 2> "base_url":"https://127.0.0.1:40191/solr",
[junit4] 2> "type":"PULL",
[junit4] 2> "waitForFinalState":"false"}
[junit4] 2> 4882596 INFO (OverseerStateUpdate-75689210647543816-127.0.0.1:36252_solr-n_0000000000) [n:127.0.0.1:36252_solr ] o.a.s.c.o.SliceMutator createReplica() {
[junit4] 2> "operation":"ADDREPLICA",
[junit4] 2> "collection":"MoveReplicaHDFSTest_coll_true",
[junit4] 2> "shard":"shard2",
[junit4] 2> "core":"MoveReplicaHDFSTest_coll_true_shard2_replica_n4",
[junit4] 2> "state":"down",
[junit4] 2> "base_url":"https://127.0.0.1:44277/solr",
[junit4] 2> "type":"NRT",
[junit4] 2> "waitForFinalState":"false"}
[junit4] 2> 4882606 INFO (OverseerStateUpdate-75689210647543816-127.0.0.1:36252_solr-n_0000000000) [n:127.0.0.1:36252_solr ] o.a.s.c.o.SliceMutator createReplica() {
[junit4] 2> "operation":"ADDREPLICA",
[junit4] 2> "collection":"MoveReplicaHDFSTest_coll_true",
[junit4] 2> "shard":"shard2",
[junit4] 2> "core":"MoveReplicaHDFSTest_coll_true_shard2_replica_p6",
[junit4] 2> "state":"down",
[junit4] 2> "base_url":"https://127.0.0.1:36252/solr",
[junit4] 2> "type":"PULL",
[junit4] 2> "waitForFinalState":"false"}
[junit4] 2> 4882822 INFO (qtp1158791923-105319) [n:127.0.0.1:44277_solr x:MoveReplicaHDFSTest_coll_true_shard2_replica_n4 ] o.a.s.h.a.CoreAdminOperation core create command qt=/admin/cores&coreNodeName=core_node7&collection.configName=conf1&newCollection=true&name=MoveReplicaHDFSTest_coll_true_shard2_replica_n4&action=CREATE&numShards=2&collection=MoveReplicaHDFSTest_coll_true&shard=shard2&wt=javabin&version=2&replicaType=NRT
[junit4] 2> 4882852 INFO (qtp1911200291-105338) [n:127.0.0.1:41143_solr x:MoveReplicaHDFSTest_coll_true_shard1_replica_n1 ] o.a.s.h.a.CoreAdminOperation core create command qt=/admin/cores&coreNodeName=core_node3&collection.configName=conf1&newCollection=true&name=MoveReplicaHDFSTest_coll_true_shard1_replica_n1&action=CREATE&numShards=2&collection=MoveReplicaHDFSTest_coll_true&shard=shard1&wt=javabin&version=2&replicaType=NRT
[junit4] 2> 4882870 INFO (qtp947791865-105326) [n:127.0.0.1:40191_solr x:MoveReplicaHDFSTest_coll_true_shard1_replica_p2 ] o.a.s.h.a.CoreAdminOperation core create command qt=/admin/cores&coreNodeName=core_node5&collection.configName=conf1&newCollection=true&name=MoveReplicaHDFSTest_coll_true_shard1_replica_p2&action=CREATE&numShards=2&collection=MoveReplicaHDFSTest_coll_true&shard=shard1&wt=javabin&version=2&replicaType=PULL
[junit4] 2> 4882871 INFO (qtp293873873-105335) [n:127.0.0.1:36252_solr x:MoveReplicaHDFSTest_coll_true_shard2_replica_p6 ] o.a.s.h.a.CoreAdminOperation core create command qt=/admin/cores&coreNodeName=core_node8&collection.configName=conf1&newCollection=true&name=MoveReplicaHDFSTest_coll_true_shard2_replica_p6&action=CREATE&numShards=2&collection=MoveReplicaHDFSTest_coll_true&shard=shard2&wt=javabin&version=2&replicaType=PULL
[junit4] 2> 4882871 INFO (qtp293873873-105335) [n:127.0.0.1:36252_solr x:MoveReplicaHDFSTest_coll_true_shard2_replica_p6 ] o.a.s.c.TransientSolrCoreCacheDefault Allocating transient cache for 4 transient cores
[junit4] 2> 4882991 DEBUG (ScheduledTrigger-13004-thread-4) [ ] o.a.s.c.a.NodeLostTrigger Running NodeLostTrigger: .auto_add_replicas with currently live nodes: 4 and last live nodes: 4
[junit4] 2> 4883949 INFO (qtp1158791923-105319) [n:127.0.0.1:44277_solr c:MoveReplicaHDFSTest_coll_true s:shard2 r:core_node7 x:MoveReplicaHDFSTest_coll_true_shard2_replica_n4 ] o.a.s.c.SolrConfig Using Lucene MatchVersion: 8.3.1
[junit4] 2> 4883952 INFO (qtp947791865-105326) [n:127.0.0.1:40191_solr c:MoveReplicaHDFSTest_coll_true s:shard1 r:core_node5 x:MoveReplicaHDFSTest_coll_true_shard1_replica_p2 ] o.a.s.c.SolrConfig Using Lucene MatchVersion: 8.3.1
[junit4] 2> 4883955 INFO (qtp293873873-105335) [n:127.0.0.1:36252_solr c:MoveReplicaHDFSTest_coll_true s:shard2 r:core_node8 x:MoveReplicaHDFSTest_coll_true_shard2_replica_p6 ] o.a.s.c.SolrConfig Using Lucene MatchVersion: 8.3.1
[junit4] 2> 4884000 DEBUG (ScheduledTrigger-13004-thread-4) [ ] o.a.s.c.a.NodeLostTrigger Running NodeLostTrigger: .auto_add_replicas with currently live nodes: 4 and last live nodes: 4
[junit4] 2> 4884013 INFO (qtp1911200291-105338) [n:127.0.0.1:41143_solr c:MoveReplicaHDFSTest_coll_true s:shard1 r:core_node3 x:MoveReplicaHDFSTest_coll_true_shard1_replica_n1 ] o.a.s.c.SolrConfig Using Lucene MatchVersion: 8.3.1
[junit4] 2> 4884052 INFO (qtp947791865-105326) [n:127.0.0.1:40191_solr c:MoveReplicaHDFSTest_coll_true s:shard1 r:core_node5 x:MoveReplicaHDFSTest_coll_true_shard1_replica_p2 ] o.a.s.s.IndexSchema [MoveReplicaHDFSTest_coll_true_shard1_replica_p2] Schema name=minimal
[junit4] 2> 4884060 INFO (qtp1158791923-105319) [n:127.0.0.1:44277_solr c:MoveReplicaHDFSTest_coll_true s:shard2 r:core_node7 x:MoveReplicaHDFSTest_coll_true_shard2_replica_n4 ] o.a.s.s.IndexSchema [MoveReplicaHDFSTest_coll_true_shard2_replica_n4] Schema name=minimal
[junit4] 2> 4884062 INFO (qtp1158791923-105319) [n:127.0.0.1:44277_solr c:MoveReplicaHDFSTest_coll_true s:shard2 r:core_node7 x:MoveReplicaHDFSTest_coll_true_shard2_replica_n4 ] o.a.s.s.IndexSchema Loaded schema minimal/1.1 with uniqueid field id
[junit4] 2> 4884062 INFO (qtp1158791923-105319) [n:127.0.0.1:44277_solr c:MoveReplicaHDFSTest_coll_true s:shard2 r:core_node7 x:MoveReplicaHDFSTest_coll_true_shard2_replica_n4 ] o.a.s.c.CoreContainer Creating SolrCore 'MoveReplicaHDFSTest_coll_true_shard2_replica_n4' using configuration from collection MoveReplicaHDFSTest_coll_true, trusted=true
[junit4] 2> 4884062 INFO (qtp1158791923-105319) [n:127.0.0.1:44277_solr c:MoveReplicaHDFSTest_coll_true s:shard2 r:core_node7 x:MoveReplicaHDFSTest_coll_true_shard2_replica_n4 ] o.a.s.m.r.SolrJmxReporter JMX monitoring for 'solr.core.MoveReplicaHDFSTest_coll_true.shard2.replica_n4' (registry 'solr.core.MoveReplicaHDFSTest_coll_true.shard2.replica_n4') enabled at server: com.sun.jmx.mbeanserver.JmxMBeanServer@51fb7a74
[junit4] 2> 4884064 INFO (qtp293873873-105335) [n:127.0.0.1:36252_solr c:MoveReplicaHDFSTest_coll_true s:shard2 r:core_node8 x:MoveReplicaHDFSTest_coll_true_shard2_replica_p6 ] o.a.s.s.IndexSchema [MoveReplicaHDFSTest_coll_true_shard2_replica_p6] Schema name=minimal
[junit4] 2> 4884075 INFO (qtp1911200291-105338) [n:127.0.0.1:41143_solr c:MoveReplicaHDFSTest_coll_true s:shard1 r:core_node3 x:MoveReplicaHDFSTest_coll_true_shard1_replica_n1 ] o.a.s.s.IndexSchema [MoveReplicaHDFSTest_coll_true_shard1_replica_n1] Schema name=minimal
[junit4] 2> 4884087 INFO (qtp1911200291-105338) [n:127.0.0.1:41143_solr c:MoveReplicaHDFSTest_coll_true s:shard1 r:core_node3 x:MoveReplicaHDFSTest_coll_true_shard1_replica_n1 ] o.a.s.s.IndexSchema Loaded schema minimal/1.1 with uniqueid field id
[junit4] 2> 4884087 INFO (qtp1911200291-105338) [n:127.0.0.1:41143_solr c:MoveReplicaHDFSTest_coll_true s:shard1 r:core_node3 x:MoveReplicaHDFSTest_coll_true_shard1_replica_n1 ] o.a.s.c.CoreContainer Creating SolrCore 'MoveReplicaHDFSTest_coll_true_shard1_replica_n1' using configuration from collection MoveReplicaHDFSTest_coll_true, trusted=true
[junit4] 2> 4884087 INFO (qtp1911200291-105338) [n:127.0.0.1:41143_solr c:MoveReplicaHDFSTest_coll_true s:shard1 r:core_node3 x:MoveReplicaHDFSTest_coll_true_shard1_replica_n1 ] o.a.s.m.r.SolrJmxReporter JMX monitoring for 'solr.core.MoveReplicaHDFSTest_coll_true.shard1.replica_n1' (registry 'solr.core.MoveReplicaHDFSTest_coll_true.shard1.replica_n1') enabled at server: com.sun.jmx.mbeanserver.JmxMBeanServer@51fb7a74
[junit4] 2> 4884096 INFO (qtp947791865-105326) [n:127.0.0.1:40191_solr c:MoveReplicaHDFSTest_coll_true s:shard1 r:core_node5 x:MoveReplicaHDFSTest_coll_true_shard1_replica_p2 ] o.a.s.s.IndexSchema Loaded schema minimal/1.1 with uniqueid field id
[junit4] 2> 4884096 INFO (qtp947791865-105326) [n:127.0.0.1:40191_solr c:MoveReplicaHDFSTest_coll_true s:shard1 r:core_node5 x:MoveReplicaHDFSTest_coll_true_shard1_replica_p2 ] o.a.s.c.CoreContainer Creating SolrCore 'MoveReplicaHDFSTest_coll_true_shard1_replica_p2' using configuration from collection MoveReplicaHDFSTest_coll_true, trusted=true
[junit4] 2> 4884096 INFO (qtp947791865-105326) [n:127.0.0.1:40191_solr c:MoveReplicaHDFSTest_coll_true s:shard1 r:core_node5 x:MoveReplicaHDFSTest_coll_true_shard1_replica_p2 ] o.a.s.m.r.SolrJmxReporter JMX monitoring for 'solr.core.MoveReplicaHDFSTest_coll_true.shard1.replica_p2' (registry 'solr.core.MoveReplicaHDFSTest_coll_true.shard1.replica_p2') enabled at server: com.sun.jmx.mbeanserver.JmxMBeanServer@51fb7a74
[junit4] 2> 4884102 INFO (qtp1158791923-105319) [n:127.0.0.1:44277_solr c:MoveReplicaHDFSTest_coll_true s:shard2 r:core_node7 x:MoveReplicaHDFSTest_coll_true_shard2_replica_n4 ] o.a.s.c.HdfsDirectoryFactory solr.hdfs.home=hdfs://lucene2-us-west.apache.org:46264/solr_hdfs_home
[junit4] 2> 4884102 INFO (qtp1158791923-105319) [n:127.0.0.1:44277_solr c:MoveReplicaHDFSTest_coll_true s:shard2 r:core_node7 x:MoveReplicaHDFSTest_coll_true_shard2_replica_n4 ] o.a.s.c.HdfsDirectoryFactory Solr Kerberos Authentication disabled
[junit4] 2> 4884102 INFO (qtp1158791923-105319) [n:127.0.0.1:44277_solr c:MoveReplicaHDFSTest_coll_true s:shard2 r:core_node7 x:MoveReplicaHDFSTest_coll_true_shard2_replica_n4 ] o.a.s.c.SolrCore [[MoveReplicaHDFSTest_coll_true_shard2_replica_n4] ] Opening new SolrCore at [/home/jenkins/jenkins-slave/workspace/Lucene-Solr-NightlyTests-8.3/checkout/solr/build/solr-core/test/J2/temp/solr.cloud.MoveReplicaHDFSTest_86A2BB39E38DBEE4-001/tempDir-002/node2/MoveReplicaHDFSTest_coll_true_shard2_replica_n4], dataDir=[hdfs://lucene2-us-west.apache.org:46264/solr_hdfs_home/MoveReplicaHDFSTest_coll_true/core_node7/data/]
[junit4] 2> 4884208 INFO (qtp1158791923-105319) [n:127.0.0.1:44277_solr c:MoveReplicaHDFSTest_coll_true s:shard2 r:core_node7 x:MoveReplicaHDFSTest_coll_true_shard2_replica_n4 ] o.a.s.c.HdfsDirectoryFactory creating directory factory for path hdfs://lucene2-us-west.apache.org:46264/solr_hdfs_home/MoveReplicaHDFSTest_coll_true/core_node7/data/snapshot_metadata
[junit4] 2> 4884209 INFO (qtp1911200291-105338) [n:127.0.0.1:41143_solr c:MoveReplicaHDFSTest_coll_true s:shard1 r:core_node3 x:MoveReplicaHDFSTest_coll_true_shard1_replica_n1 ] o.a.s.c.HdfsDirectoryFactory solr.hdfs.home=hdfs://lucene2-us-west.apache.org:46264/solr_hdfs_home
[junit4] 2> 4884209 INFO (qtp1911200291-105338) [n:127.0.0.1:41143_solr c:MoveReplicaHDFSTest_coll_true s:shard1 r:core_node3 x:MoveReplicaHDFSTest_coll_true_shard1_replica_n1 ] o.a.s.c.HdfsDirectoryFactory Solr Kerberos Authentication disabled
[junit4] 2> 4884209 INFO (qtp1911200291-105338) [n:127.0.0.1:41143_solr c:MoveReplicaHDFSTest_coll_true s:shard1 r:core_node3 x:MoveReplicaHDFSTest_coll_true_shard1_replica_n1 ] o.a.s.c.SolrCore [[MoveReplicaHDFSTest_coll_true_shard1_replica_n1] ] Opening new SolrCore at [/home/jenkins/jenkins-slave/workspace/Lucene-Solr-NightlyTests-8.3/checkout/solr/build/solr-core/test/J2/temp/solr.cloud.MoveReplicaHDFSTest_86A2BB39E38DBEE4-001/tempDir-002/node3/MoveReplicaHDFSTest_coll_true_shard1_replica_n1], dataDir=[hdfs://lucene2-us-west.apache.org:46264/solr_hdfs_home/MoveReplicaHDFSTest_coll_true/core_node3/data/]
[junit4] 2> 4884210 INFO (qtp1911200291-105338) [n:127.0.0.1:41143_solr c:MoveReplicaHDFSTest_coll_true s:shard1 r:core_node3 x:MoveReplicaHDFSTest_coll_true_shard1_replica_n1 ] o.a.s.c.HdfsDirectoryFactory creating directory factory for path hdfs://lucene2-us-west.apache.org:46264/solr_hdfs_home/MoveReplicaHDFSTest_coll_true/core_node3/data/snapshot_metadata
[junit4] 2> 4884221 INFO (qtp947791865-105326) [n:127.0.0.1:40191_solr c:MoveReplicaHDFSTest_coll_true s:shard1 r:core_node5 x:MoveReplicaHDFSTest_coll_true_shard1_replica_p2 ] o.a.s.c.HdfsDirectoryFactory solr.hdfs.home=hdfs://lucene2-us-west.apache.org:46264/solr_hdfs_home
[junit4] 2> 4884221 INFO (qtp947791865-105326) [n:127.0.0.1:40191_solr c:MoveReplicaHDFSTest_coll_true s:shard1 r:core_node5 x:MoveReplicaHDFSTest_coll_true_shard1_replica_p2 ] o.a.s.c.HdfsDirectoryFactory Solr Kerberos Authentication disabled
[junit4] 2> 4884221 INFO (qtp947791865-105326) [n:127.0.0.1:40191_solr c:MoveReplicaHDFSTest_coll_true s:shard1 r:core_node5 x:MoveReplicaHDFSTest_coll_true_shard1_replica_p2 ] o.a.s.c.SolrCore [[MoveReplicaHDFSTest_coll_true_shard1_replica_p2] ] Opening new SolrCore at [/home/jenkins/jenkins-slave/workspace/Lucene-Solr-NightlyTests-8.3/checkout/solr/build/solr-core/test/J2/temp/solr.cloud.MoveReplicaHDFSTest_86A2BB39E38DBEE4-001/tempDir-002/node1/MoveReplicaHDFSTest_coll_true_shard1_replica_p2], dataDir=[hdfs://lucene2-us-west.apache.org:46264/solr_hdfs_home/MoveReplicaHDFSTest_coll_true/core_node5/data/]
[junit4] 2> 4884222 INFO (qtp947791865-105326) [n:127.0.0.1:40191_solr c:MoveReplicaHDFSTest_coll_true s:shard1 r:core_node5 x:MoveReplicaHDFSTest_coll_true_shard1_replica_p2 ] o.a.s.c.HdfsDirectoryFactory creating directory factory for path hdfs://lucene2-us-west.apache.org:46264/solr_hdfs_home/MoveReplicaHDFSTest_coll_true/core_node5/data/snapshot_metadata
[junit4] 2> 4884228 INFO (qtp293873873-105335) [n:127.0.0.1:36252_solr c:MoveReplicaHDFSTest_coll_true s:shard2 r:core_node8 x:MoveReplicaHDFSTest_coll_true_shard2_replica_p6 ] o.a.s.s.IndexSchema Loaded schema minimal/1.1 with uniqueid field id
[junit4] 2> 4884228 INFO (qtp293873873-105335) [n:127.0.0.1:36252_solr c:MoveReplicaHDFSTest_coll_true s:shard2 r:core_node8 x:MoveReplicaHDFSTest_coll_true_shard2_replica_p6 ] o.a.s.c.CoreContainer Creating SolrCore 'MoveReplicaHDFSTest_coll_true_shard2_replica_p6' using configuration from collection MoveReplicaHDFSTest_coll_true, trusted=true
[junit4] 2> 4884228 INFO (qtp293873873-105335) [n:127.0.0.1:36252_solr c:MoveReplicaHDFSTest_coll_true s:shard2 r:core_node8 x:MoveReplicaHDFSTest_coll_true_shard2_replica_p6 ] o.a.s.m.r.SolrJmxReporter JMX monitoring for 'solr.core.MoveReplicaHDFSTest_coll_true.shard2.replica_p6' (registry 'solr.core.MoveReplicaHDFSTest_coll_true.shard2.replica_p6') enabled at server: com.sun.jmx.mbeanserver.JmxMBeanServer@51fb7a74
[junit4] 2> 4884228 INFO (qtp293873873-105335) [n:127.0.0.1:36252_solr c:MoveReplicaHDFSTest_coll_true s:shard2 r:core_node8 x:MoveReplicaHDFSTest_coll_true_shard2_replica_p6 ] o.a.s.c.HdfsDirectoryFactory solr.hdfs.home=hdfs://lucene2-us-west.apache.org:46264/solr_hdfs_home
[junit4] 2> 4884228 INFO (qtp293873873-105335) [n:127.0.0.1:36252_solr c:MoveReplicaHDFSTest_coll_true s:shard2 r:core_node8 x:MoveReplicaHDFSTest_coll_true_shard2_replica_p6 ] o.a.s.c.HdfsDirectoryFactory Solr Kerberos Authentication disabled
[junit4] 2> 4884228 INFO (qtp293873873-105335) [n:127.0.0.1:36252_solr c:MoveReplicaHDFSTest_coll_true s:shard2 r:core_node8 x:MoveReplicaHDFSTest_coll_true_shard2_replica_p6 ] o.a.s.c.SolrCore [[MoveReplicaHDFSTest_coll_true_shard2_replica_p6] ] Opening new SolrCore at [/home/jenkins/jenkins-slave/workspace/Lucene-Solr-NightlyTests-8.3/checkout/solr/build/solr-core/test/J2/temp/solr.cloud.MoveReplicaHDFSTest_86A2BB39E38DBEE4-001/tempDir-002/node4/MoveReplicaHDFSTest_coll_true_shard2_replica_p6], dataDir=[hdfs://lucene2-us-west.apache.org:46264/solr_hdfs_home/MoveReplicaHDFSTest_coll_true/core_node8/data/]
[junit4] 2> 4884229 INFO (qtp293873873-105335) [n:127.0.0.1:36252_solr c:MoveReplicaHDFSTest_coll_true s:shard2 r:core_node8 x:MoveReplicaHDFSTest_coll_true_shard2_replica_p6 ] o.a.s.c.HdfsDirectoryFactory creating directory factory for path hdfs://lucene2-us-west.apache.org:46264/solr_hdfs_home/MoveReplicaHDFSTest_coll_true/core_node8/data/snapshot_metadata
[junit4] 2> 4884261 INFO (qtp1158791923-105319) [n:127.0.0.1:44277_solr c:MoveReplicaHDFSTest_coll_true s:shard2 r:core_node7 x:MoveReplicaHDFSTest_coll_true_shard2_replica_n4 ] o.a.s.c.HdfsDirectoryFactory Number of slabs of block cache [1] with direct memory allocation set to [true]
[junit4] 2> 4884261 INFO (qtp1158791923-105319) [n:127.0.0.1:44277_solr c:MoveReplicaHDFSTest_coll_true s:shard2 r:core_node7 x:MoveReplicaHDFSTest_coll_true_shard2_replica_n4 ] o.a.s.c.HdfsDirectoryFactory Block cache target memory usage, slab size of [33554432] will allocate [1] slabs and use ~[33554432] bytes
[junit4] 2> 4884281 INFO (qtp293873873-105335) [n:127.0.0.1:36252_solr c:MoveReplicaHDFSTest_coll_true s:shard2 r:core_node8 x:MoveReplicaHDFSTest_coll_true_shard2_replica_p6 ] o.a.s.c.HdfsDirectoryFactory Number of slabs of block cache [1] with direct memory allocation set to [true]
[junit4] 2> 4884281 INFO (qtp293873873-105335) [n:127.0.0.1:36252_solr c:MoveReplicaHDFSTest_coll_true s:shard2 r:core_node8 x:MoveReplicaHDFSTest_coll_true_shard2_replica_p6 ] o.a.s.c.HdfsDirectoryFactory Block cache target memory usage, slab size of [33554432] will allocate [1] slabs and use ~[33554432] bytes
[junit4] 2> 4884283 INFO (qtp947791865-105326) [n:127.0.0.1:40191_solr c:MoveReplicaHDFSTest_coll_true s:shard1 r:core_node5 x:MoveReplicaHDFSTest_coll_true_shard1_replica_p2 ] o.a.s.c.HdfsDirectoryFactory Number of slabs of block cache [1] with direct memory allocation set to [true]
[junit4] 2> 4884283 INFO (qtp947791865-105326) [n:127.0.0.1:40191_solr c:MoveReplicaHDFSTest_coll_true s:shard1 r:core_node5 x:MoveReplicaHDFSTest_coll_true_shard1_replica_p2 ] o.a.s.c.HdfsDirectoryFactory Block cache target memory usage, slab size of [33554432] will allocate [1] slabs and use ~[33554432] bytes
[junit4] 2> 4884294 INFO (qtp1911200291-105338) [n:127.0.0.1:41143_solr c:MoveReplicaHDFSTest_coll_true s:shard1 r:core_node3 x:MoveReplicaHDFSTest_coll_true_shard1_replica_n1 ] o.a.s.c.HdfsDirectoryFactory Number of slabs of block cache [1] with direct memory allocation set to [true]
[junit4] 2> 4884294 INFO (qtp1911200291-105338) [n:127.0.0.1:41143_solr c:MoveReplicaHDFSTest_coll_true s:shard1 r:core_node3 x:MoveReplicaHDFSTest_coll_true_shard1_replica_n1 ] o.a.s.c.HdfsDirectoryFactory Block cache target memory usage, slab size of [33554432] will allocate [1] slabs and use ~[33554432] bytes
[junit4] 2> 4884306 INFO (qtp1158791923-105319) [n:127.0.0.1:44277_solr c:MoveReplicaHDFSTest_coll_true s:shard2 r:core_node7 x:MoveReplicaHDFSTest_coll_true_shard2_replica_n4 ] o.a.s.s.b.BlockDirectory Block cache on write is disabled
[junit4] 2> 4884314 INFO (qtp1158791923-105319) [n:127.0.0.1:44277_solr c:MoveReplicaHDFSTest_coll_true s:shard2 r:core_node7 x:MoveReplicaHDFSTest_coll_true_shard2_replica_n4 ] o.a.s.c.HdfsDirectoryFactory creating directory factory for path hdfs://lucene2-us-west.apache.org:46264/solr_hdfs_home/MoveReplicaHDFSTest_coll_true/core_node7/data
[junit4] 2> 4884358 INFO (qtp293873873-105335) [n:127.0.0.1:36252_solr c:MoveReplicaHDFSTest_coll_true s:shard2 r:core_node8 x:MoveReplicaHDFSTest_coll_true_shard2_replica_p6 ] o.a.s.s.b.BlockDirectory Block cache on write is disabled
[junit4] 2> 4884358 INFO (qtp293873873-105335) [n:127.0.0.1:36252_solr c:MoveReplicaHDFSTest_coll_true s:shard2 r:core_node8 x:MoveReplicaHDFSTest_coll_true_shard2_replica_p6 ] o.a.s.c.HdfsDirect
[...truncated too long message...]
licaHDFSTest_86A2BB39E38DBEE4-001/tempDir-001/hdfsBaseDir/data/data3/current/BP-1036290148-127.0.0.1-1573076666459) [ ] o.a.h.f.CachingGetSpaceUsed Thread Interrupted waiting to refresh disk information: sleep interrupted
[junit4] 2> 4925752 WARN (refreshUsed-/home/jenkins/jenkins-slave/workspace/Lucene-Solr-NightlyTests-8.3/checkout/solr/build/solr-core/test/J2/temp/solr.cloud.MoveReplicaHDFSTest_86A2BB39E38DBEE4-001/tempDir-001/hdfsBaseDir/data/data4/current/BP-1036290148-127.0.0.1-1573076666459) [ ] o.a.h.f.CachingGetSpaceUsed Thread Interrupted waiting to refresh disk information: sleep interrupted
[junit4] 2> 4925755 WARN (SUITE-MoveReplicaHDFSTest-seed#[86A2BB39E38DBEE4]-worker) [ ] o.a.h.h.s.d.DirectoryScanner DirectoryScanner: shutdown has been called
[junit4] 2> 4925763 INFO (SUITE-MoveReplicaHDFSTest-seed#[86A2BB39E38DBEE4]-worker) [ ] o.e.j.s.h.ContextHandler Stopped o.e.j.w.WebAppContext@2a94d80{datanode,/,null,UNAVAILABLE}{/datanode}
[junit4] 2> 4925764 INFO (SUITE-MoveReplicaHDFSTest-seed#[86A2BB39E38DBEE4]-worker) [ ] o.e.j.s.AbstractConnector Stopped ServerConnector@53237fe1{HTTP/1.1,[http/1.1]}{localhost:0}
[junit4] 2> 4925764 INFO (SUITE-MoveReplicaHDFSTest-seed#[86A2BB39E38DBEE4]-worker) [ ] o.e.j.s.session node0 Stopped scavenging
[junit4] 2> 4925764 INFO (SUITE-MoveReplicaHDFSTest-seed#[86A2BB39E38DBEE4]-worker) [ ] o.e.j.s.h.ContextHandler Stopped o.e.j.s.ServletContextHandler@1eb3caf2{static,/static,jar:file:/home/jenkins/.ivy2/cache/org.apache.hadoop/hadoop-hdfs/tests/hadoop-hdfs-3.2.0-tests.jar!/webapps/static,UNAVAILABLE}
[junit4] 2> 4925769 WARN (BP-1036290148-127.0.0.1-1573076666459 heartbeating to lucene2-us-west.apache.org/127.0.0.1:46264) [ ] o.a.h.h.s.d.IncrementalBlockReportManager IncrementalBlockReportManager interrupted
[junit4] 2> 4925769 WARN (BP-1036290148-127.0.0.1-1573076666459 heartbeating to lucene2-us-west.apache.org/127.0.0.1:46264) [ ] o.a.h.h.s.d.DataNode Ending block pool service for: Block pool BP-1036290148-127.0.0.1-1573076666459 (Datanode Uuid 48c8648f-1398-4146-8da7-447de9cdb7c1) service to lucene2-us-west.apache.org/127.0.0.1:46264
[junit4] 2> 4925777 WARN (refreshUsed-/home/jenkins/jenkins-slave/workspace/Lucene-Solr-NightlyTests-8.3/checkout/solr/build/solr-core/test/J2/temp/solr.cloud.MoveReplicaHDFSTest_86A2BB39E38DBEE4-001/tempDir-001/hdfsBaseDir/data/data1/current/BP-1036290148-127.0.0.1-1573076666459) [ ] o.a.h.f.CachingGetSpaceUsed Thread Interrupted waiting to refresh disk information: sleep interrupted
[junit4] 2> 4925785 WARN (refreshUsed-/home/jenkins/jenkins-slave/workspace/Lucene-Solr-NightlyTests-8.3/checkout/solr/build/solr-core/test/J2/temp/solr.cloud.MoveReplicaHDFSTest_86A2BB39E38DBEE4-001/tempDir-001/hdfsBaseDir/data/data2/current/BP-1036290148-127.0.0.1-1573076666459) [ ] o.a.h.f.CachingGetSpaceUsed Thread Interrupted waiting to refresh disk information: sleep interrupted
[junit4] 2> 4925792 INFO (SUITE-MoveReplicaHDFSTest-seed#[86A2BB39E38DBEE4]-worker) [ ] o.e.j.s.h.ContextHandler Stopped o.e.j.w.WebAppContext@11f845b{hdfs,/,null,UNAVAILABLE}{/hdfs}
[junit4] 2> 4925792 INFO (SUITE-MoveReplicaHDFSTest-seed#[86A2BB39E38DBEE4]-worker) [ ] o.e.j.s.AbstractConnector Stopped ServerConnector@2f49dd0{HTTP/1.1,[http/1.1]}{lucene2-us-west.apache.org:0}
[junit4] 2> 4925792 INFO (SUITE-MoveReplicaHDFSTest-seed#[86A2BB39E38DBEE4]-worker) [ ] o.e.j.s.session node0 Stopped scavenging
[junit4] 2> 4925792 INFO (SUITE-MoveReplicaHDFSTest-seed#[86A2BB39E38DBEE4]-worker) [ ] o.e.j.s.h.ContextHandler Stopped o.e.j.s.ServletContextHandler@68050900{static,/static,jar:file:/home/jenkins/.ivy2/cache/org.apache.hadoop/hadoop-hdfs/tests/hadoop-hdfs-3.2.0-tests.jar!/webapps/static,UNAVAILABLE}
[junit4] 2> NOTE: leaving temporary files on disk at: /home/jenkins/jenkins-slave/workspace/Lucene-Solr-NightlyTests-8.3/checkout/solr/build/solr-core/test/J2/temp/solr.cloud.MoveReplicaHDFSTest_86A2BB39E38DBEE4-001
[junit4] 2> Nov 06, 2019 9:45:17 PM com.carrotsearch.randomizedtesting.ThreadLeakControl checkThreadLeaks
[junit4] 2> WARNING: Will linger awaiting termination of 33 leaked thread(s).
[junit4] 2> NOTE: test params are: codec=Asserting(Lucene80), sim=Asserting(org.apache.lucene.search.similarities.AssertingSimilarity@45c1ac08), locale=ar-LY, timezone=Asia/Tbilisi
[junit4] 2> NOTE: Linux 4.4.0-112-generic amd64/Oracle Corporation 1.8.0_191 (64-bit)/cpus=4,threads=4,free=67481544,total=519045120
[junit4] 2> NOTE: All tests run in this JVM: [TestConfigSetImmutable, DocValuesNotIndexedTest, CSVRequestHandlerTest, TestMacroExpander, TestExtendedDismaxParser, TestLocalFSCloudBackupRestore, SystemCollectionCompatTest, TestCustomSort, ChangedSchemaMergeTest, ExitableDirectoryReaderTest, BasicAuthStandaloneTest, TestSolrCLIRunExample, AnalyticsQueryTest, PeerSyncWithBufferUpdatesTest, TestZkAclsWithHadoopAuth, TestDistributedMap, CloudMLTQParserTest, CoreMergeIndexesAdminHandlerTest, TestSuggestSpellingConverter, TestSkipOverseerOperations, MigrateRouteKeyTest, SpatialRPTFieldTypeTest, PropertiesRequestHandlerTest, V2StandaloneTest, TestFileDictionaryLookup, TestLogWatcher, HttpSolrCallGetCoreTest, TestCustomDocTransformer, ReplicationFactorTest, SchemaApiFailureTest, CoreAdminHandlerTest, PreAnalyzedFieldTest, SuggesterTSTTest, TriLevelCompositeIdRoutingTest, SolrTestCaseJ4Test, TestFaceting, BasicDistributedZkTest, MultiThreadedOCPTest, TestJoin, TestDynamicLoadingUrl, TestLegacyFieldCache, ProtectedTermFilterFactoryTest, TestCustomStream, QueryParsingTest, AtomicUpdatesTest, TestCodecSupport, DeleteNodeTest, SolrRequestParserTest, TestSchemaVersionResource, TriggerEventQueueTest, TestSimpleTrackingShardHandler, DistributedExpandComponentTest, MetricTriggerTest, ExternalFileFieldSortTest, TestExplainDocTransformer, TestSnapshotCloudManager, SolrShardReporterTest, PeerSyncWithLeaderTest, TestUninvertingReader, TokenizerChainTest, TestLegacyNumericRangeQueryBuilder, TermVectorComponentTest, TestDefaultStatsCache, TestDistributedGrouping, TestPrepRecovery, TestSchemaNameResource, ConnectionReuseTest, RemoteQueryErrorTest, TestOverriddenPrefixQueryForCustomFieldType, DefaultValueUpdateProcessorTest, LeaderFailureAfterFreshStartTest, DateFieldTest, TestNestedUpdateProcessor, DocExpirationUpdateProcessorFactoryTest, TimeRoutedAliasUpdateProcessorTest, EmbeddedSolrNoSerializeTest, TestSolrQueryResponse, TestClusterStateMutator, OpenExchangeRatesOrgProviderTest, TestSolrCloudWithSecureImpersonation, TestManagedSchema, TestTrackingShardHandlerFactory, TestInitQParser, ResponseLogComponentTest, AliasIntegrationTest, DistributedFacetPivotLongTailTest, TestSolrCloudSnapshots, BigEndianAscendingWordSerializerTest, ZookeeperStatusHandlerTest, TestSlowCompositeReaderWrapper, AutoAddReplicasIntegrationTest, TestSearchPerf, FullHLLTest, TestOmitPositions, DocumentBuilderTest, ComputePlanActionTest, PrimUtilsTest, AdminHandlersProxyTest, DocValuesMultiTest, CreateRoutedAliasTest, HdfsChaosMonkeyNothingIsSafeTest, TestShardHandlerFactory, TestSegmentSorting, TestCoreContainer, DeleteStatusTest, ShardSplitTest, ManagedSchemaRoundRobinCloudTest, TestFieldResource, HttpTriggerListenerTest, TestDynamicFieldCollectionResource, ParsingFieldUpdateProcessorsTest, TestSolrXml, ClusterStateTest, RecoveryAfterSoftCommitTest, TestSolrDeletionPolicy1, TestBulkSchemaConcurrent, TestIBSimilarityFactory, TestLockTree, TestSimNodeLostTrigger, TestPKIAuthenticationPlugin, TestTolerantUpdateProcessorRandomCloud, ConfigureRecoveryStrategyTest, TaggerTest, LegacyCloudClusterPropTest, TestStressLucene, SolrIndexSplitterTest, TestConfigSetsAPI, TestLazyCores, TestDelegationWithHadoopAuth, TestInfoStreamLogging, TestFieldCacheSortRandom, TestDistributedTracing, SolrMetricsIntegrationTest, TestHighFrequencyDictionaryFactory, TestCryptoKeys, TestSolrQueryParser, TestStressUserVersions, TestSQLHandler, TestFilteredDocIdSet, FileBasedSpellCheckerTest, DistributedIntervalFacetingTest, TestAddFieldRealTimeGet, ShufflingReplicaListTransformerTest, AnalysisAfterCoreReloadTest, BasicFunctionalityTest, ConvertedLegacyTest, EchoParamsTest, MinimalSchemaTest, OutputWriterTest, TestCrossCoreJoin, TestDistributedMissingSort, TestDistributedSearch, TestDocumentBuilder, TestGroupingSearch, TestRandomDVFaceting, TestSolrCoreProperties, TestSolrTestCaseJ4, TestTolerantSearch, TestTrie, TestDeprecatedFilters, TestLuceneMatchVersion, TestReversedWildcardFilterFactory, TestLuceneIndexBackCompat, TestEmbeddedSolrServerAdminHandler, TestEmbeddedSolrServerConstructors, TestEmbeddedSolrServerSchemaAPI, AssignBackwardCompatibilityTest, ChaosMonkeyNothingIsSafeTest, ChaosMonkeyNothingIsSafeWithPullReplicasTest, ChaosMonkeySafeLeaderTest, CleanupOldIndexTest, CollectionPropsTest, CollectionStateFormat2Test, ConcurrentCreateRoutedAliasTest, ConfigSetsAPITest, ConnectionManagerTest, DeleteReplicaTest, DistribCursorPagingTest, DistribDocExpirationUpdateProcessorTest, DistribJoinFromCollectionTest, ForceLeaderWithTlogReplicasTest, HttpPartitionTest, LeaderElectionContextKeyTest, LeaderElectionTest, LeaderTragicEventTest, MissingSegmentRecoveryTest, MoveReplicaHDFSTest]
[junit4] Completed [444/880 (1!)] on J2 in 53.82s, 4 tests, 1 error, 2 skipped <<< FAILURES!
[...truncated 10978 lines...]
BUILD FAILED
/home/jenkins/jenkins-slave/workspace/Lucene-Solr-NightlyTests-8.3/checkout/build.xml:652: The following error occurred while executing this line:
/home/jenkins/jenkins-slave/workspace/Lucene-Solr-NightlyTests-8.3/checkout/build.xml:586: Some of the tests produced a heap dump, but did not fail. Maybe a suppressed OutOfMemoryError? Dumps created:
* java_pid6951.hprof
Total time: 479 minutes 56 seconds
Build step 'Invoke Ant' marked build as failure
Archiving artifacts
Recording test results
Email was triggered for: Failure - Any
Sending email for trigger: Failure - Any