You are viewing a plain text version of this content. The canonical link for it is here.
Posted to commits@flex.apache.org by fl...@gmail.com on 2015/03/13 08:36:50 UTC
rc_flex-sdk_mustella-air - Build # 137 - Failure!
rc_flex-sdk_mustella-air - Build # 137 - Failure:
http://flex-mustella.cloudapp.net/job/rc_flex-sdk_mustella-air/137/
Changes for Build #137
No changes
--------------------------------
[...truncated 6873 lines...]
db_time:
[mkdir] Created dir: C:\jenkins_slave\workspace\rc_flex-sdk_mustella-air\mustella\tmp
[echo] db_time=2015/03/13 02:32:19
get_mobile_data:
device_fail:
handle_mobile_config:
echo-browser:
echo-apollo:
[echo] use_apollo=true
[echo] apollo_location is C:\ApacheFlex\dependencies\AdobeAIRSDK\3.7
setup:
[echo] player is C:\ApacheFlex\dependencies\FlashPlayer_Debug\flashplayer11_7r700_232_win_sa_debug.exe
[echo] fileset: apollo\HTML\Events\AIRHTMLEventsTester.mxml;apollo\Window\Styles\NewWindow_styles_tester.mxml;apollo\spark\components\Window\mirroring\window_mirroring_tester1.mxml
setbuildID:
[echo] Target file was: C:/jenkins_slave/workspace/rc_flex-sdk_mustella-air/mustella/successfulBuild.properties
[echo] ${server}
setHostName:
getConfigId:
getActualRunId:
getRunId:
compilemustellaswc:
realCompile:
[loadfile] C:\jenkins_slave\workspace\rc_flex-sdk_mustella-air\mustella\local.properties doesn't exist
build_shell_set:
[echo] shell_file_mxml_equivs is ,apollo/HTML/Events/AIRHTMLEventsTester.sh,apollo/Window/Styles/NewWindow_styles_tester.sh,apollo/spark/components/Window/mirroring/window_mirroring_tester1.sh
[echo] mxml_equiv_shells is ${mxml_equiv_shells}
[echo] tmp.sdk.mustella.scripts2 is C:\jenkins_slave\workspace\rc_flex-sdk_mustella-air\mustella\tests\apollo\spark\components\Window\SWFs\pre_compile.sh;;;
chmod_shells:
[echo] changing user shell files to executable
shells:
[exec] next: pre_compile.sh 0
[exec] done with pre compile step
[java] exclude_filename: C:/jenkins_slave/workspace/rc_flex-sdk_mustella-air/mustella/tests/ExcludeListWinAIR.txt
[java] os_version: ${os_version}
[java] target_os_name: windows
[java] device_name: ${device_name}
[java] result_include: -includes=SendResultsToRunner
[java] nothing left to do
[java] Choosing local runner bitmap save
[java] Choosing local runner bitmap save
[java] Choosing local runner bitmap save
[java] okey doke, going to compile C:\jenkins_slave\workspace\rc_flex-sdk_mustella-air\mustella\tests\apollo\Window\SWFs\NewWindow_main.mxml
[java] okey doke, going to compile C:\jenkins_slave\workspace\rc_flex-sdk_mustella-air\mustella\tests\apollo\HTML\SWFs\AIRHTMLMain.mxml
[java] okey doke, going to compile C:\jenkins_slave\workspace\rc_flex-sdk_mustella-air\mustella\tests\apollo\spark\components\Window\SWFs\window_mirroring_001.mxml
[java] Loading configuration file C:\jenkins_slave\workspace\rc_flex-sdk_mustella-air\frameworks\air-config.xml
[java] Loading configuration file C:\jenkins_slave\workspace\rc_flex-sdk_mustella-air\frameworks\air-config.xml
[java] Loading configuration file C:\jenkins_slave\workspace\rc_flex-sdk_mustella-air\frameworks\air-config.xml
[java] C:\jenkins_slave\workspace\rc_flex-sdk_mustella-air\mustella\tests\apollo\HTML\SWFs\AIRHTMLMain.swf (977809 bytes)
[java] C:\jenkins_slave\workspace\rc_flex-sdk_mustella-air\mustella\tests\apollo\Window\SWFs\NewWindow_Main.swf (1145255 bytes)
[java] C:\jenkins_slave\workspace\rc_flex-sdk_mustella-air\mustella\tests\apollo\spark\components\Window\SWFs\window_mirroring_001.swf (2954603 bytes)
[java] All done with the compile
[java] leaving the compile, elapsed: 27
[java] ...via exit
[echo] compileswfs jreturn is 0
[loadfile] C:\jenkins_slave\workspace\rc_flex-sdk_mustella-air\mustella\local.properties doesn't exist
do_fail:
compileswfs:
getExcludes:
getExcludeIds:
populateExcludeTable:
[echo] populate exclude, got this for db time: 2015/03/13 02:32:19
justrun:
[loadfile] C:\jenkins_slave\workspace\rc_flex-sdk_mustella-air\mustella\local.properties doesn't exist
delete_cache:
[echo] delete cache: /Users/ApacheFlex/Library/Caches/Adobe/Flash Player/AssetCache
[loadfile] C:\jenkins_slave\workspace\rc_flex-sdk_mustella-air\mustella\local.properties doesn't exist
delete_cache:
[echo] delete cache: /Users/ApacheFlex/AppData/Roaming/Adobe/Flash Player/AssetCache
[delete] Deleting directory C:\Users\ApacheFlex\AppData\Roaming\Adobe\Flash Player\AssetCache\MDZLZLT3
[delete] Deleting directory C:\Users\ApacheFlex\AppData\Roaming\Adobe\Flash Player\AssetCache
[loadfile] C:\jenkins_slave\workspace\rc_flex-sdk_mustella-air\mustella\local.properties doesn't exist
delete_cache:
[echo] delete cache: C:\Users\ApacheFlex/Application Data/Adobe/Flash Player/AssetCache
[loadfile] C:\jenkins_slave\workspace\rc_flex-sdk_mustella-air\mustella\local.properties doesn't exist
android_runner:
ios_runner:
qnx_runner:
desktop_runner:
[echo] **** Willkommen auf Runner ****
[java] the apollo situation: C:\ApacheFlex\dependencies\AdobeAIRSDK\3.7/adl.exe -runtime C:\ApacheFlex\dependencies\AdobeAIRSDK\3.7\runtimes\air\win
[java] starting results server
[java] starting baseline server
[java] test script count: 2
[java] apollo adj with : C:\jenkins_slave\workspace\rc_flex-sdk_mustella-air\mustella\tests\apollo\HTML\SWFs\AIRHTMLMain.swf
[java] apollo adj thinks it's a swf
[java] writing Apollo file!
[java] full swf is C:\jenkins_slave\workspace\rc_flex-sdk_mustella-air\mustella\tests\apollo\HTML\SWFs\AIRHTMLMain.swf
[java] starting the baseline server: Fri Mar 13 02:33:54 ACT 2015
[java] post ApolloAdjuster: C:\jenkins_slave\workspace\rc_flex-sdk_mustella-air\mustella\tests\apollo\HTML\SWFs\AIRHTMLMain.xml
[java] new test file: C:\jenkins_slave\workspace\rc_flex-sdk_mustella-air\mustella\tests\apollo\HTML\SWFs\AIRHTMLMain.xml
[java] ******** cmdArr before:
[java] C:\ApacheFlex\dependencies\AdobeAIRSDK\3.7\bin\adl.exe
[java] C:\jenkins_slave\workspace\rc_flex-sdk_mustella-air\mustella\tests\apollo\HTML\SWFs\AIRHTMLMain.xml
[java] ******** moreParameters before:
[java] ******** cmdArr after:
[java] C:\ApacheFlex\dependencies\AdobeAIRSDK\3.7\bin\adl.exe
[java] C:\jenkins_slave\workspace\rc_flex-sdk_mustella-air\mustella\tests\apollo\HTML\SWFs\AIRHTMLMain.xml
[java] getting directory from the swf file
[java] derived directory: C:\jenkins_slave\workspace\rc_flex-sdk_mustella-air\mustella\tests\apollo\HTML\SWFs
[java] Launching:
[java] C:\ApacheFlex\dependencies\AdobeAIRSDK\3.7\bin\adl.exe C:\jenkins_slave\workspace\rc_flex-sdk_mustella-air\mustella\tests\apollo\HTML\SWFs\AIRHTMLMain.xml Launching: C:\ApacheFlex\dependencies\AdobeAIRSDK\3.7\bin\adl.exe C:\jenkins_slave\workspace\rc_flex-sdk_mustella-air\mustella\tests\apollo\HTML\SWFs\AIRHTMLMain.xml
[java] USING directory: C:\jenkins_slave\workspace\rc_flex-sdk_mustella-air\mustella\tests\apollo\HTML\SWFs
[java] time: 02:33:56.267
[java] Firing Meta Timeout for process start after 12000 millis at: 02:34:08.281
[java] clobberProcess true
[java] ClobberProcess, destroying process
[java] unpacked result: C:\jenkins_slave\workspace\rc_flex-sdk_mustella-air\mustella\tests\apollo\HTML\SWFs\AIRHTMLMain.xml Failed Timed out 0 Fri Mar 13 02:33:56 ACT 2015 0.0
[java] Total Results so far: 1
[java] removing the xml app file
[java] Grab log, do parse = false
[java] Grabbing the log from: C:\Users\ApacheFlex\AppData/Roaming\Macromedia/Flash Player/Logs/flashlog.txt to: C:\jenkins_slave\workspace\rc_flex-sdk_mustella-air\mustella\tests\apollo\HTML\SWFs\AIRHTMLMain.log
[java] Grablog: never saw the ScriptDone for C:\jenkins_slave\workspace\rc_flex-sdk_mustella-air\mustella\tests\apollo\HTML\SWFs\AIRHTMLMain.swf
[java] apollo adj with : C:\jenkins_slave\workspace\rc_flex-sdk_mustella-air\mustella\tests\apollo\spark\components\Window\SWFs\window_mirroring_001.swf
[java] apollo adj thinks it's a swf
[java] writing Apollo file!
[java] full swf is C:\jenkins_slave\workspace\rc_flex-sdk_mustella-air\mustella\tests\apollo\spark\components\Window\SWFs\window_mirroring_001.swf
[java] post ApolloAdjuster: C:\jenkins_slave\workspace\rc_flex-sdk_mustella-air\mustella\tests\apollo\spark\components\Window\SWFs\window_mirroring_001.xml
[java] new test file: C:\jenkins_slave\workspace\rc_flex-sdk_mustella-air\mustella\tests\apollo\spark\components\Window\SWFs\window_mirroring_001.xml
[java] ******** cmdArr before:
[java] C:\ApacheFlex\dependencies\AdobeAIRSDK\3.7\bin\adl.exe
[java] C:\jenkins_slave\workspace\rc_flex-sdk_mustella-air\mustella\tests\apollo\spark\components\Window\SWFs\window_mirroring_001.xml
[java] ******** moreParameters before:
[java] ******** cmdArr after:
[java] C:\ApacheFlex\dependencies\AdobeAIRSDK\3.7\bin\adl.exe
[java] C:\jenkins_slave\workspace\rc_flex-sdk_mustella-air\mustella\tests\apollo\spark\components\Window\SWFs\window_mirroring_001.xml
[java] getting directory from the swf file
[java] derived directory: C:\jenkins_slave\workspace\rc_flex-sdk_mustella-air\mustella\tests\apollo\spark\components\Window\SWFs
[java] Launching:
[java] C:\ApacheFlex\dependencies\AdobeAIRSDK\3.7\bin\adl.exe C:\jenkins_slave\workspace\rc_flex-sdk_mustella-air\mustella\tests\apollo\spark\components\Window\SWFs\window_mirroring_001.xml Launching: C:\ApacheFlex\dependencies\AdobeAIRSDK\3.7\bin\adl.exe C:\jenkins_slave\workspace\rc_flex-sdk_mustella-air\mustella\tests\apollo\spark\components\Window\SWFs\window_mirroring_001.xml
[java] USING directory: C:\jenkins_slave\workspace\rc_flex-sdk_mustella-air\mustella\tests\apollo\spark\components\Window\SWFs
[java] time: 02:34:08.377
[java] Wrote file: c:/jenkins_slave/workspace/rc_flex-sdk_mustella-air/mustella/tests/apollo/spark/components/Window/mirroring/baselines/Window_layoutDirection_rtl4.png.bad.png length: 1883
[java] FAIL: apollo/spark/components/Window/mirroring/window_mirroring_tester1 Window_layoutDirection_rtl4
[java] SCRIPTDONE! 02:34:15.335
[java] GET /ScriptComplete?0 HTTP/1.1
[java] Before Wait loop 02:34:15.335 waiting = 0
[java] After Wait loop 02:34:15.335 waiting = 0
[java] clobberProcess false
[java] Total Results so far: 2
[java] removing the xml app file
[java] Grab log, do parse = false
[java] Grabbing the log from: C:\Users\ApacheFlex\AppData/Roaming\Macromedia/Flash Player/Logs/flashlog.txt to: C:\jenkins_slave\workspace\rc_flex-sdk_mustella-air\mustella\tests\apollo\spark\components\Window\SWFs\window_mirroring_001.log
[java] at the end of main
[java] Shutting down the results server
[java] shutting down the baseline server
[java] done waiting for results...bye
[java] =====================================================
[java] Passes: 0
[java] Fails: 2
[java] =====================================================
[java]
[java] =====================================================
[java] =====================================================
[java] Passed:
[java] =====================================================
[java] =====================================================
[java] Failed:
[java] =====================================================
[java] C:\jenkins_slave\workspace\rc_flex-sdk_mustella-air\mustella\tests\apollo\HTML\SWFs\AIRHTMLMain.xml Failed Timed out
[java] apollo/spark/components/Window/mirroring/window_mirroring_tester1 Window_layoutDirection_rtl4 Failed CompareBitmap(body:step 3) compare returned[object BitmapData]
[java]
[java]
[java] =====================================================
[java] Passes: 0
[java] Fails: 2
[java] =====================================================
[java]
[java]
[java] Wrote summary to results.txt
[java] Wrote failures to failures.txt
waited 2000
ClobberProcess, it was already null
BUILD FAILED
C:\jenkins_slave\workspace\rc_flex-sdk_mustella-air\mustella\build.xml:1547: The following error occurred while executing this line:
C:\jenkins_slave\workspace\rc_flex-sdk_mustella-air\mustella\build.xml:1665: Java returned: 1
Total time: 2 minutes 44 seconds
============ JENKINS MUSTELLA RUN REPORT ============
Date/Time: 03-13-2015 07:34
Run duration: 0 days 0 hours 46 mins 53 seconds
Settings:
player.version = 11.7
air.version = 3.7
FLASHPLAYER_DEBUGGER = C:\ApacheFlex\dependencies\FlashPlayer_Debug\flashplayer11_7r700_232_win_sa_debug.exe
AIR_HOME = C:\ApacheFlex\dependencies\AdobeAIRSDK\3.7
Build:
type = air
command = -apollo
set = tests/apollo
Log:
- Made Cygwin ignore carriage returns
- Set FLASH_VERSION to '11.7' and AIR_VERSION to '3.7'
- Set AIR_HOME to 'C:\ApacheFlex\dependencies\AdobeAIRSDK\3.7'
- Set FLASHPLAYER_DEBUGGER to 'C:\ApacheFlex\dependencies\FlashPlayer_Debug\flashplayer11_7r700_232_win_sa_debug.exe'
- Cleaned up 'local.properties' files from previous runs
- Created fresh 'local.properties' files with containing run specific values
- Ran 'clean', 'main' and 'other.locales' ant targets to prepare the SDK for testing
- Ran Mustella on the SDK with these parameters: '-apollo tests/apollo'
- Some tests failed: running '-failures'
- Some of tests failed, even after running '-failures'...
=====================================================
Build step 'Execute shell' marked build as failure
Archiving artifacts
Email was triggered for: Failure - Any
Sending email for trigger: Failure - Any
(sent from ext-email)
rc_flex-sdk_mustella-air - Build # 139 - Fixed!
Posted by fl...@gmail.com.
rc_flex-sdk_mustella-air - Build # 139 - Fixed:
http://flex-mustella.cloudapp.net/job/rc_flex-sdk_mustella-air/139/
Changes for Build #137
No changes
Changes for Build #138
No changes
Changes for Build #139
No changes
--------------------------------
[...truncated 6861 lines...]
[java] Passes: 786
[java] Fails: 19
[java] =====================================================
[java]
[java]
[java] Wrote summary to results.txt
[java] waited 1500
[java] ClobberProcess, it was already null
[java] Wrote failures to failures.txt
BUILD FAILED
C:\jenkins_slave\workspace\rc_flex-sdk_mustella-air\mustella\build.xml:1547: The following error occurred while executing this line:
C:\jenkins_slave\workspace\rc_flex-sdk_mustella-air\mustella\build.xml:1665: Java returned: 1
Total time: 19 minutes 43 seconds
apollo/Window/Styles/NewWindow_styles_tester.mxml
NewWindow_main.swf
apollo/spark/components/Window/mirroring/window_mirroring_tester1.mxml
window_mirroring_001.swf
Skipping testcase check
Doing a regular mini run
Buildfile: C:\jenkins_slave\workspace\rc_flex-sdk_mustella-air\mustella\build.xml
[loadfile] C:\jenkins_slave\workspace\rc_flex-sdk_mustella-air\mustella\local.properties doesn't exist
cleanswfs:
clean:
[echo] Deleting old results and files from previous testsuite build.
[delete] Deleting directory C:\jenkins_slave\workspace\rc_flex-sdk_mustella-air\mustella\tmp
check-fonts:
handle_adt_jar:
prepare:
[echo] Preparing testsuite.
prepare:
[echo] Creating build directory...
compile-mustella:
[echo] Compiling mustella source code...
[javac] C:\jenkins_slave\workspace\rc_flex-sdk_mustella-air\mustella\java\src\build.xml:79: warning: 'includeantruntime' was not set, defaulting to build.sysclasspath=last; set to false for repeatable builds
echo-info:
[echo] JAVA_HOME: C:/Program Files (x86)/Java/jdk1.6.0
[echo] FLASHPLAYER_DEBUGGER: C:\ApacheFlex\dependencies\FlashPlayer_Debug\flashplayer_16_sa_debug.exe
[echo] sdk.dir: C:\jenkins_slave\workspace\rc_flex-sdk_mustella-air\mustella/..
[echo] mustella exclude file: C:/jenkins_slave/workspace/rc_flex-sdk_mustella-air/mustella/tests/ExcludeListWinAIR.txt
get_date:
get_os:
setup_mac:
setup_windows:
[echo] doing windows setup
[echo] homepath: C:\Users\ApacheFlex
[echo] trace output file: 1
[echo] player is C:\ApacheFlex\dependencies\FlashPlayer_Debug\flashplayer_16_sa_debug.exe
setup_linux:
db_time:
[mkdir] Created dir: C:\jenkins_slave\workspace\rc_flex-sdk_mustella-air\mustella\tmp
[echo] db_time=2015/03/14 03:02:18
get_mobile_data:
device_fail:
handle_mobile_config:
echo-browser:
echo-apollo:
[echo] use_apollo=true
[echo] apollo_location is C:\ApacheFlex\dependencies\AdobeAIRSDK\16
setup:
[echo] player is C:\ApacheFlex\dependencies\FlashPlayer_Debug\flashplayer_16_sa_debug.exe
[echo] fileset: apollo\Window\Styles\NewWindow_styles_tester.mxml;apollo\spark\components\Window\mirroring\window_mirroring_tester1.mxml
setbuildID:
[echo] Target file was: C:/jenkins_slave/workspace/rc_flex-sdk_mustella-air/mustella/successfulBuild.properties
[echo] ${server}
setHostName:
getConfigId:
getActualRunId:
getRunId:
compilemustellaswc:
realCompile:
[loadfile] C:\jenkins_slave\workspace\rc_flex-sdk_mustella-air\mustella\local.properties doesn't exist
build_shell_set:
[echo] shell_file_mxml_equivs is ,apollo/Window/Styles/NewWindow_styles_tester.sh,apollo/spark/components/Window/mirroring/window_mirroring_tester1.sh
[echo] mxml_equiv_shells is ${mxml_equiv_shells}
[echo] tmp.sdk.mustella.scripts2 is C:\jenkins_slave\workspace\rc_flex-sdk_mustella-air\mustella\tests\apollo\spark\components\Window\SWFs\pre_compile.sh;;
chmod_shells:
[echo] changing user shell files to executable
shells:
[exec] next: pre_compile.sh 0
[exec] done with pre compile step
[java] exclude_filename: C:/jenkins_slave/workspace/rc_flex-sdk_mustella-air/mustella/tests/ExcludeListWinAIR.txt
[java] os_version: ${os_version}
[java] target_os_name: windows
[java] device_name: ${device_name}
[java] result_include: -includes=SendResultsToRunner
[java] nothing left to do
[java] Choosing local runner bitmap save
[java] Choosing local runner bitmap save
[java] okey doke, going to compile C:\jenkins_slave\workspace\rc_flex-sdk_mustella-air\mustella\tests\apollo\Window\SWFs\NewWindow_main.mxml
[java] okey doke, going to compile C:\jenkins_slave\workspace\rc_flex-sdk_mustella-air\mustella\tests\apollo\spark\components\Window\SWFs\window_mirroring_001.mxml
[java] Loading configuration file C:\jenkins_slave\workspace\rc_flex-sdk_mustella-air\frameworks\air-config.xml
[java] Loading configuration file C:\jenkins_slave\workspace\rc_flex-sdk_mustella-air\frameworks\air-config.xml
[java] C:\jenkins_slave\workspace\rc_flex-sdk_mustella-air\mustella\tests\apollo\Window\SWFs\NewWindow_Main.swf (1145245 bytes)
[java] All done with the compile
[java] leaving the compile, elapsed: 22
[java] ...via exit
[echo] compileswfs jreturn is 0
[loadfile] C:\jenkins_slave\workspace\rc_flex-sdk_mustella-air\mustella\local.properties doesn't exist
do_fail:
compileswfs:
getExcludes:
getExcludeIds:
populateExcludeTable:
[echo] populate exclude, got this for db time: 2015/03/14 03:02:18
justrun:
[loadfile] C:\jenkins_slave\workspace\rc_flex-sdk_mustella-air\mustella\local.properties doesn't exist
delete_cache:
[echo] delete cache: /Users/ApacheFlex/Library/Caches/Adobe/Flash Player/AssetCache
[loadfile] C:\jenkins_slave\workspace\rc_flex-sdk_mustella-air\mustella\local.properties doesn't exist
delete_cache:
[echo] delete cache: /Users/ApacheFlex/AppData/Roaming/Adobe/Flash Player/AssetCache
[delete] Deleting directory C:\Users\ApacheFlex\AppData\Roaming\Adobe\Flash Player\AssetCache\QW4Z3RC9
[delete] Deleting directory C:\Users\ApacheFlex\AppData\Roaming\Adobe\Flash Player\AssetCache
[loadfile] C:\jenkins_slave\workspace\rc_flex-sdk_mustella-air\mustella\local.properties doesn't exist
delete_cache:
[echo] delete cache: C:\Users\ApacheFlex/Application Data/Adobe/Flash Player/AssetCache
[loadfile] C:\jenkins_slave\workspace\rc_flex-sdk_mustella-air\mustella\local.properties doesn't exist
android_runner:
ios_runner:
qnx_runner:
desktop_runner:
[echo] **** Willkommen auf Runner ****
[java] the apollo situation: C:\ApacheFlex\dependencies\AdobeAIRSDK\16/adl.exe -runtime C:\ApacheFlex\dependencies\AdobeAIRSDK\16\runtimes\air\win
[java] starting results server
[java] starting baseline server
[java] test script count: 1
[java] Skipping:
[java] at the end of main
[java] Shutting down the results server
[java] shutting down the baseline server
[java] done waiting for results...bye
[java] =====================================================
[java] Passes: 0
[java] Fails: 0
[java] =====================================================
[java]
[java] =====================================================
[java] =====================================================
[java] Passed:
[java] =====================================================
[java] =====================================================
[java] Failed:
[java] =====================================================
[java]
[java]
[java] =====================================================
[java] Passes: 0
[java] Fails: 0
[java] =====================================================
[java]
[java]
[java] Wrote summary to results.txt
[java] Wrote failures to failures.txt
call_runners:
run:
BUILD SUCCESSFUL
Total time: 2 minutes 21 seconds
starting the baseline server: Sat Mar 14 03:03:50 ACT 2015
============ JENKINS MUSTELLA RUN REPORT ============
Date/Time: 03-14-2015 08:03
Run duration: 0 days 0 hours 50 mins 35 seconds
Settings:
player.version = 16.0
air.version = 16
FLASHPLAYER_DEBUGGER = C:\ApacheFlex\dependencies\FlashPlayer_Debug\flashplayer_16_sa_debug.exe
AIR_HOME = C:\ApacheFlex\dependencies\AdobeAIRSDK\16
Build:
type = air
command = -apollo
set = tests/apollo
Log:
- Made Cygwin ignore carriage returns
- Set FLASH_VERSION to '16.0' and AIR_VERSION to '16'
- Set AIR_HOME to 'C:\ApacheFlex\dependencies\AdobeAIRSDK\16'
- Set FLASHPLAYER_DEBUGGER to 'C:\ApacheFlex\dependencies\FlashPlayer_Debug\flashplayer_16_sa_debug.exe'
- Cleaned up 'local.properties' files from previous runs
- Created fresh 'local.properties' files with containing run specific values
- Ran 'clean', 'main' and 'other.locales' ant targets to prepare the SDK for testing
- Ran Mustella on the SDK with these parameters: '-apollo tests/apollo'
- Some tests failed: running '-failures'
- All tests passed after running '-failures'
=====================================================
Archiving artifacts
WARN: No artifacts found that match the file pattern "mustella/tests/**/*.bad.png". Configuration error?
WARN: java.lang.InterruptedException: no matches found within 10000
Email was triggered for: Fixed
Trigger Success was overridden by another trigger and will not send an email.
Sending email for trigger: Fixed
(sent from ext-email)
rc_flex-sdk_mustella-air - Build # 138 - Still Failing!
Posted by fl...@gmail.com.
rc_flex-sdk_mustella-air - Build # 138 - Still Failing:
http://flex-mustella.cloudapp.net/job/rc_flex-sdk_mustella-air/138/
Changes for Build #137
No changes
Changes for Build #138
No changes
--------------------------------
[...truncated 92917 lines...]
[java] ******** moreParameters before:
[java] ******** cmdArr after:
[java] C:\ApacheFlex\dependencies\AdobeAIRSDK\4.0\bin\adl.exe
[java] C:\jenkins_slave\workspace\rc_flex-sdk_mustella-air\mustella\tests\spark\validators\NumberValidator\SWFs\NV_minValue_Main.xml
[java] getting directory from the swf file
[java] derived directory: C:\jenkins_slave\workspace\rc_flex-sdk_mustella-air\mustella\tests\spark\validators\NumberValidator\SWFs
[java] Launching:
[java] C:\ApacheFlex\dependencies\AdobeAIRSDK\4.0\bin\adl.exe C:\jenkins_slave\workspace\rc_flex-sdk_mustella-air\mustella\tests\spark\validators\NumberValidator\SWFs\NV_minValue_Main.xml Launching: C:\ApacheFlex\dependencies\AdobeAIRSDK\4.0\bin\adl.exe C:\jenkins_slave\workspace\rc_flex-sdk_mustella-air\mustella\tests\spark\validators\NumberValidator\SWFs\NV_minValue_Main.xml
[java] USING directory: C:\jenkins_slave\workspace\rc_flex-sdk_mustella-air\mustella\tests\spark\validators\NumberValidator\SWFs
[java] time: 15:12:44.280
[java] Total Results so far: 2
[java] removing the xml app file
[java] Grab log, do parse = false
[java] Grabbing the log from: C:\Users\ApacheFlex\AppData/Roaming\Macromedia/Flash Player/Logs/flashlog.txt to: C:\jenkins_slave\workspace\rc_flex-sdk_mustella-air\mustella\tests\spark\validators\NumberValidator\SWFs\NV_minValue_Main.log
[java] Grablog: never saw the ScriptDone for C:\jenkins_slave\workspace\rc_flex-sdk_mustella-air\mustella\tests\spark\validators\NumberValidator\SWFs\NV_minValue_Main.swf
[java] Skipping: C:\jenkins_slave\workspace\rc_flex-sdk_mustella-air\mustella\tests\spark\validators\NumberValidator\SWFs\NV_negativeNumberFormat_Main.lnk.xml
[java] Skipping: C:\jenkins_slave\workspace\rc_flex-sdk_mustella-air\mustella\tests\spark\validators\NumberValidator\SWFs\NV_negativeNumberFormat_Main.mxml
[java] apollo adj with : C:\jenkins_slave\workspace\rc_flex-sdk_mustella-air\mustella\tests\spark\validators\NumberValidator\SWFs\NV_negativeNumberFormat_Main.swf
[java] apollo adj thinks it's a swf
[java] writing Apollo file!
[java] full swf is C:\jenkins_slave\workspace\rc_flex-sdk_mustella-air\mustella\tests\spark\validators\NumberValidator\SWFs\NV_negativeNumberFormat_Main.swf
[java] post ApolloAdjuster: C:\jenkins_slave\workspace\rc_flex-sdk_mustella-air\mustella\tests\spark\validators\NumberValidator\SWFs\NV_negativeNumberFormat_Main.xml
[java] new test file: C:\jenkins_slave\workspace\rc_flex-sdk_mustella-air\mustella\tests\spark\validators\NumberValidator\SWFs\NV_negativeNumberFormat_Main.xml
[java] ******** cmdArr before:
[java] C:\ApacheFlex\dependencies\AdobeAIRSDK\4.0\bin\adl.exe
[java] C:\jenkins_slave\workspace\rc_flex-sdk_mustella-air\mustella\tests\spark\validators\NumberValidator\SWFs\NV_negativeNumberFormat_Main.xml
[java] ******** moreParameters before:
[java] ******** cmdArr after:
[java] C:\ApacheFlex\dependencies\AdobeAIRSDK\4.0\bin\adl.exe
[java] C:\jenkins_slave\workspace\rc_flex-sdk_mustella-air\mustella\tests\spark\validators\NumberValidator\SWFs\NV_negativeNumberFormat_Main.xml
[java] getting directory from the swf file
[java] derived directory: C:\jenkins_slave\workspace\rc_flex-sdk_mustella-air\mustella\tests\spark\validators\NumberValidator\SWFs
[java] Launching:
[java] C:\ApacheFlex\dependencies\AdobeAIRSDK\4.0\bin\adl.exe C:\jenkins_slave\workspace\rc_flex-sdk_mustella-air\mustella\tests\spark\validators\NumberValidator\SWFs\NV_negativeNumberFormat_Main.xml Launching: C:\ApacheFlex\dependencies\AdobeAIRSDK\4.0\bin\adl.exe C:\jenkins_slave\workspace\rc_flex-sdk_mustella-air\mustella\tests\spark\validators\NumberValidator\SWFs\NV_negativeNumberFormat_Main.xml
[java] USING directory: C:\jenkins_slave\workspace\rc_flex-sdk_mustella-air\mustella\tests\spark\validators\NumberValidator\SWFs
[java] time: 15:12:44.693
[java] Total Results so far: 2
[java] removing the xml app file
[java] Grab log, do parse = false
[java] Grabbing the log from: C:\Users\ApacheFlex\AppData/Roaming\Macromedia/Flash Player/Logs/flashlog.txt to: C:\jenkins_slave\workspace\rc_flex-sdk_mustella-air\mustella\tests\spark\validators\NumberValidator\SWFs\NV_negativeNumberFormat_Main.log
[java] Grablog: never saw the ScriptDone for C:\jenkins_slave\workspace\rc_flex-sdk_mustella-air\mustella\tests\spark\validators\NumberValidator\SWFs\NV_negativeNumberFormat_Main.swf
[java] Skipping: C:\jenkins_slave\workspace\rc_flex-sdk_mustella-air\mustella\tests\spark\validators\NumberValidator\SWFs\NV_negativeSymbol_Main.lnk.xml
[java] Skipping: C:\jenkins_slave\workspace\rc_flex-sdk_mustella-air\mustella\tests\spark\validators\NumberValidator\SWFs\NV_negativeSymbol_Main.mxml
[java] apollo adj with : C:\jenkins_slave\workspace\rc_flex-sdk_mustella-air\mustella\tests\spark\validators\NumberValidator\SWFs\NV_negativeSymbol_Main.swf
[java] apollo adj thinks it's a swf
[java] writing Apollo file!
[java] full swf is C:\jenkins_slave\workspace\rc_flex-sdk_mustella-air\mustella\tests\spark\validators\NumberValidator\SWFs\NV_negativeSymbol_Main.swf
[java] post ApolloAdjuster: C:\jenkins_slave\workspace\rc_flex-sdk_mustella-air\mustella\tests\spark\validators\NumberValidator\SWFs\NV_negativeSymbol_Main.xml
[java] new test file: C:\jenkins_slave\workspace\rc_flex-sdk_mustella-air\mustella\tests\spark\validators\NumberValidator\SWFs\NV_negativeSymbol_Main.xml
[java] ******** cmdArr before:
[java] C:\ApacheFlex\dependencies\AdobeAIRSDK\4.0\bin\adl.exe
[java] C:\jenkins_slave\workspace\rc_flex-sdk_mustella-air\mustella\tests\spark\validators\NumberValidator\SWFs\NV_negativeSymbol_Main.xml
[java] ******** moreParameters before:
[java] ******** cmdArr after:
[java] C:\ApacheFlex\dependencies\AdobeAIRSDK\4.0\bin\adl.exe
[java] C:\jenkins_slave\workspace\rc_flex-sdk_mustella-air\mustella\tests\spark\validators\NumberValidator\SWFs\NV_negativeSymbol_Main.xml
[java] getting directory from the swf file
[java] derived directory: C:\jenkins_slave\workspace\rc_flex-sdk_mustella-air\mustella\tests\spark\validators\NumberValidator\SWFs
[java] Launching:
[java] C:\ApacheFlex\dependencies\AdobeAIRSDK\4.0\bin\adl.exe C:\jenkins_slave\workspace\rc_flex-sdk_mustella-air\mustella\tests\spark\validators\NumberValidator\SWFs\NV_negativeSymbol_Main.xml Launching: C:\ApacheFlex\dependencies\AdobeAIRSDK\4.0\bin\adl.exe C:\jenkins_slave\workspace\rc_flex-sdk_mustella-air\mustella\tests\spark\validators\NumberValidator\SWFs\NV_negativeSymbol_Main.xml
[java] USING directory: C:\jenkins_slave\workspace\rc_flex-sdk_mustella-air\mustella\tests\spark\validators\NumberValidator\SWFs
[java] time: 15:12:45.112
[java] Total Results so far: 2
[java] removing the xml app file
[java] Grab log, do parse = false
[java] Grabbing the log from: C:\Users\ApacheFlex\AppData/Roaming\Macromedia/Flash Player/Logs/flashlog.txt to: C:\jenkins_slave\workspace\rc_flex-sdk_mustella-air\mustella\tests\spark\validators\NumberValidator\SWFs\NV_negativeSymbol_Main.log
[java] Grablog: never saw the ScriptDone for C:\jenkins_slave\workspace\rc_flex-sdk_mustella-air\mustella\tests\spark\validators\NumberValidator\SWFs\NV_negativeSymbol_Main.swf
[java] Skipping: C:\jenkins_slave\workspace\rc_flex-sdk_mustella-air\mustella\tests\spark\validators\NumberValidator\SWFs\NV_validate.lnk.xml
[java] Skipping: C:\jenkins_slave\workspace\rc_flex-sdk_mustella-air\mustella\tests\spark\validators\NumberValidator\SWFs\NV_validate.mxml
[java] apollo adj with : C:\jenkins_slave\workspace\rc_flex-sdk_mustella-air\mustella\tests\spark\validators\NumberValidator\SWFs\NV_validate.swf
[java] apollo adj thinks it's a swf
[java] writing Apollo file!
[java] full swf is C:\jenkins_slave\workspace\rc_flex-sdk_mustella-air\mustella\tests\spark\validators\NumberValidator\SWFs\NV_validate.swf
[java] post ApolloAdjuster: C:\jenkins_slave\workspace\rc_flex-sdk_mustella-air\mustella\tests\spark\validators\NumberValidator\SWFs\NV_validate.xml
[java] new test file: C:\jenkins_slave\workspace\rc_flex-sdk_mustella-air\mustella\tests\spark\validators\NumberValidator\SWFs\NV_validate.xml
[java] ******** cmdArr before:
[java] C:\ApacheFlex\dependencies\AdobeAIRSDK\4.0\bin\adl.exe
[java] C:\jenkins_slave\workspace\rc_flex-sdk_mustella-air\mustella\tests\spark\validators\NumberValidator\SWFs\NV_validate.xml
[java] ******** moreParameters before:
[java] ******** cmdArr after:
[java] C:\ApacheFlex\dependencies\AdobeAIRSDK\4.0\bin\adl.exe
[java] C:\jenkins_slave\workspace\rc_flex-sdk_mustella-air\mustella\tests\spark\validators\NumberValidator\SWFs\NV_validate.xml
[java] getting directory from the swf file
[java] derived directory: C:\jenkins_slave\workspace\rc_flex-sdk_mustella-air\mustella\tests\spark\validators\NumberValidator\SWFs
[java] Launching:
[java] C:\ApacheFlex\dependencies\AdobeAIRSDK\4.0\bin\adl.exe C:\jenkins_slave\workspace\rc_flex-sdk_mustella-air\mustella\tests\spark\validators\NumberValidator\SWFs\NV_validate.xml Launching: C:\ApacheFlex\dependencies\AdobeAIRSDK\4.0\bin\adl.exe C:\jenkins_slave\workspace\rc_flex-sdk_mustella-air\mustella\tests\spark\validators\NumberValidator\SWFs\NV_validate.xml
[java] USING directory: C:\jenkins_slave\workspace\rc_flex-sdk_mustella-air\mustella\tests\spark\validators\NumberValidator\SWFs
[java] time: 15:12:45.543
[java] Total Results so far: 2
[java] removing the xml app file
[java] Grab log, do parse = false
[java] Grabbing the log from: C:\Users\ApacheFlex\AppData/Roaming\Macromedia/Flash Player/Logs/flashlog.txt to: C:\jenkins_slave\workspace\rc_flex-sdk_mustella-air\mustella\tests\spark\validators\NumberValidator\SWFs\NV_validate.log
[java] Grablog: never saw the ScriptDone for C:\jenkins_slave\workspace\rc_flex-sdk_mustella-air\mustella\tests\spark\validators\NumberValidator\SWFs\NV_validate.swf
[java] Skipping: C:\jenkins_slave\workspace\rc_flex-sdk_mustella-air\mustella\tests\spark\validators\NumberValidator\SWFs\NV_validateAll.lnk.xml
[java] Skipping: C:\jenkins_slave\workspace\rc_flex-sdk_mustella-air\mustella\tests\spark\validators\NumberValidator\SWFs\NV_validateAll.mxml
[java] apollo adj with : C:\jenkins_slave\workspace\rc_flex-sdk_mustella-air\mustella\tests\spark\validators\NumberValidator\SWFs\NV_validateAll.swf
[java] apollo adj thinks it's a swf
[java] writing Apollo file!
[java] full swf is C:\jenkins_slave\workspace\rc_flex-sdk_mustella-air\mustella\tests\spark\validators\NumberValidator\SWFs\NV_validateAll.swf
[java] post ApolloAdjuster: C:\jenkins_slave\workspace\rc_flex-sdk_mustella-air\mustella\tests\spark\validators\NumberValidator\SWFs\NV_validateAll.xml
[java] new test file: C:\jenkins_slave\workspace\rc_flex-sdk_mustella-air\mustella\tests\spark\validators\NumberValidator\SWFs\NV_validateAll.xml
[java] ******** cmdArr before:
[java] C:\ApacheFlex\dependencies\AdobeAIRSDK\4.0\bin\adl.exe
[java] C:\jenkins_slave\workspace\rc_flex-sdk_mustella-air\mustella\tests\spark\validators\NumberValidator\SWFs\NV_validateAll.xml
[java] ******** moreParameters before:
[java] ******** cmdArr after:
[java] C:\ApacheFlex\dependencies\AdobeAIRSDK\4.0\bin\adl.exe
[java] C:\jenkins_slave\workspace\rc_flex-sdk_mustella-air\mustella\tests\spark\validators\NumberValidator\SWFs\NV_validateAll.xml
[java] getting directory from the swf file
[java] derived directory: C:\jenkins_slave\workspace\rc_flex-sdk_mustella-air\mustella\tests\spark\validators\NumberValidator\SWFs
[java] Launching:
[java] C:\ApacheFlex\dependencies\AdobeAIRSDK\4.0\bin\adl.exe C:\jenkins_slave\workspace\rc_flex-sdk_mustella-air\mustella\tests\spark\validators\NumberValidator\SWFs\NV_validateAll.xml Launching: C:\ApacheFlex\dependencies\AdobeAIRSDK\4.0\bin\adl.exe C:\jenkins_slave\workspace\rc_flex-sdk_mustella-air\mustella\tests\spark\validators\NumberValidator\SWFs\NV_validateAll.xml
[java] USING directory: C:\jenkins_slave\workspace\rc_flex-sdk_mustella-air\mustella\tests\spark\validators\NumberValidator\SWFs
[java] time: 15:12:45.970
[java] Total Results so far: 2
[java] removing the xml app file
[java] Grab log, do parse = false
[java] Grabbing the log from: C:\Users\ApacheFlex\AppData/Roaming\Macromedia/Flash Player/Logs/flashlog.txt to: C:\jenkins_slave\workspace\rc_flex-sdk_mustella-air\mustella\tests\spark\validators\NumberValidator\SWFs\NV_validateAll.log
[java] Grablog: never saw the ScriptDone for C:\jenkins_slave\workspace\rc_flex-sdk_mustella-air\mustella\tests\spark\validators\NumberValidator\SWFs\NV_validateAll.swf
[java] Skipping: C:\jenkins_slave\workspace\rc_flex-sdk_mustella-air\mustella\tests\spark\validators\NumberValidator\SWFs\NV_validateNumber.lnk.xml
[java] Skipping: C:\jenkins_slave\workspace\rc_flex-sdk_mustella-air\mustella\tests\spark\validators\NumberValidator\SWFs\NV_validateNumber.mxml
[java] apollo adj with : C:\jenkins_slave\workspace\rc_flex-sdk_mustella-air\mustella\tests\spark\validators\NumberValidator\SWFs\NV_validateNumber.swf
[java] apollo adj thinks it's a swf
[java] writing Apollo file!
[java] full swf is C:\jenkins_slave\workspace\rc_flex-sdk_mustella-air\mustella\tests\spark\validators\NumberValidator\SWFs\NV_validateNumber.swf
[java] post ApolloAdjuster: C:\jenkins_slave\workspace\rc_flex-sdk_mustella-air\mustella\tests\spark\validators\NumberValidator\SWFs\NV_validateNumber.xml
[java] new test file: C:\jenkins_slave\workspace\rc_flex-sdk_mustella-air\mustella\tests\spark\validators\NumberValidator\SWFs\NV_validateNumber.xml
[java] ******** cmdArr before:
[java] C:\ApacheFlex\dependencies\AdobeAIRSDK\4.0\bin\adl.exe
[java] C:\jenkins_slave\workspace\rc_flex-sdk_mustella-air\mustella\tests\spark\validators\NumberValidator\SWFs\NV_validateNumber.xml
[java] ******** moreParameters before:
[java] ******** cmdArr after:
[java] C:\ApacheFlex\dependencies\AdobeAIRSDK\4.0\bin\adl.exe
[java] C:\jenkins_slave\workspace\rc_flex-sdk_mustella-air\mustella\tests\spark\validators\NumberValidator\SWFs\NV_validateNumber.xml
[java] getting directory from the swf file
[java] derived directory: C:\jenkins_slave\workspace\rc_flex-sdk_mustella-air\mustella\tests\spark\validators\NumberValidator\SWFs
[java] Launching:
[java] C:\ApacheFlex\dependencies\AdobeAIRSDK\4.0\bin\adl.exe C:\jenkins_slave\workspace\rc_flex-sdk_mustella-air\mustella\tests\spark\validators\NumberValidator\SWFs\NV_validateNumber.xml Launching: C:\ApacheFlex\dependencies\AdobeAIRSDK\4.0\bin\adl.exe C:\jenkins_slave\workspace\rc_flex-sdk_mustella-air\mustella\tests\spark\validators\NumberValidator\SWFs\NV_validateNumber.xml
[java] USING directory: C:\jenkins_slave\workspace\rc_flex-sdk_mustella-air\mustella\tests\spark\validators\NumberValidator\SWFs
[java] time: 15:12:46.386
[java] Total Results so far: 2
[java] removing the xml app file
[java] Grab log, do parse = false
[java] Grabbing the log from: C:\Users\ApacheFlex\AppData/Roaming\Macromedia/Flash Player/Logs/flashlog.txt to: C:\jenkins_slave\workspace\rc_flex-sdk_mustella-air\mustella\tests\spark\validators\NumberValidator\SWFs\NV_validateNumber.log
[java] Grablog: never saw the ScriptDone for C:\jenkins_slave\workspace\rc_flex-sdk_mustella-air\mustella\tests\spark\validators\NumberValidator\SWFs\NV_validateNumber.swf
[java] Skipping: C:\jenkins_slave\workspace\rc_flex-sdk_mustella-air\mustella\tests\spark\validators\NumberValidator\SWFs\assets\CustomNV.mxml
[java] Skipping: C:\jenkins_slave\workspace\rc_flex-sdk_mustella-air\mustella\tests\spark\validators\NumberValidator\SWFs\assets\CustomNVAll.mxml
[java] Skipping: C:\jenkins_slave\workspace\rc_flex-sdk_mustella-air\mustella\tests\spark\validators\NumberValidator\SWFs\assets\CustomNVComp.mxml
[java] Skipping: C:\jenkins_slave\workspace\rc_flex-sdk_mustella-air\mustella\tests\spark\validators\NumberValidator\SWFs\assets\DefaultLocaleComponent.mxml
[java] Skipping: C:\jenkins_slave\workspace\rc_flex-sdk_mustella-air\mustella\tests\spark\validators\NumberValidator\SWFs\assets\FallbackNVComp.mxml
[java] Skipping: C:\jenkins_slave\workspace\rc_flex-sdk_mustella-air\mustella\tests\spark\validators\NumberValidator\SWFs\assets\FlexNVBorderContainerComponent.mxml
[java] Skipping: C:\jenkins_slave\workspace\rc_flex-sdk_mustella-air\mustella\tests\spark\validators\NumberValidator\SWFs\assets\FlexNVComponent.mxml
[java] Skipping: C:\jenkins_slave\workspace\rc_flex-sdk_mustella-air\mustella\tests\spark\validators\NumberValidator\SWFs\assets\INVModuleInterface.as
[java] Skipping: C:\jenkins_slave\workspace\rc_flex-sdk_mustella-air\mustella\tests\spark\validators\NumberValidator\SWFs\assets\MyNumValidatorComp.mxml
[java] Skipping: C:\jenkins_slave\workspace\rc_flex-sdk_mustella-air\mustella\tests\spark\validators\NumberValidator\SWFs\assets\MyNumberValidator.as
[java] Skipping: C:\jenkins_slave\workspace\rc_flex-sdk_mustella-air\mustella\tests\spark\validators\NumberValidator\SWFs\assets\NVConstants.as
[java] Skipping: C:\jenkins_slave\workspace\rc_flex-sdk_mustella-air\mustella\tests\spark\validators\NumberValidator\SWFs\assets\NV_FlexModule.mxml
[java] Skipping: C:\jenkins_slave\workspace\rc_flex-sdk_mustella-air\mustella\tests\spark\validators\NumberValidator\SWFs\assets\NV_Style_FlexModule.mxml
[java] Skipping: C:\jenkins_slave\workspace\rc_flex-sdk_mustella-air\mustella\tests\spark\validators\NumberValidator\SWFs\assets\myExtStyle.css
[java] Skipping: C:\jenkins_slave\workspace\rc_flex-sdk_mustella-air\mustella\tests\spark\validators\NumberValidator\SWFs\pre_compile.sh
[java] Skipping: C:\jenkins_slave\workspace\rc_flex-sdk_mustella-air\mustella\tests\spark\validators\NumberValidator\SWFs\pre_compile.sh.0.log
[java] Skipping: C:\jenkins_slave\workspace\rc_flex-sdk_mustella-air\mustella\tests\spark\validators\NumberValidator\Styles\NV_Ext_Style_tester.mxml
[java] Skipping: C:\jenkins_slave\workspace\rc_flex-sdk_mustella-air\mustella\tests\spark\validators\NumberValidator\Styles\NV_StyleManager_loadExtCSS_tester.mxml
[java] Skipping: C:\jenkins_slave\workspace\rc_flex-sdk_mustella-air\mustella\tests\spark\validators\NumberValidator\Styles\NV_StyleManager_tester.mxml
[java] Skipping: C:\jenkins_slave\workspace\rc_flex-sdk_mustella-air\mustella\tests\spark\validators\NumberValidator\Styles\NV_Style_DefaultLocale_comp_app_tester.mxml
[java] Skipping: C:\jenkins_slave\workspace\rc_flex-sdk_mustella-air\mustella\tests\spark\validators\NumberValidator\Styles\NV_Style_DefaultLocale_comp_global_tester.mxml
[java] Skipping: C:\jenkins_slave\workspace\rc_flex-sdk_mustella-air\mustella\tests\spark\validators\NumberValidator\Styles\NV_Style_DefaultLocale_comp_tester.mxml
[java] Skipping: C:\jenkins_slave\workspace\rc_flex-sdk_mustella-air\mustella\tests\spark\validators\NumberValidator\Styles\NV_Style_DefaultLocale_module_app_tester.mxml
[java] Skipping: C:\jenkins_slave\workspace\rc_flex-sdk_mustella-air\mustella\tests\spark\validators\NumberValidator\Styles\NV_Style_DefaultLocale_module_global_tester.mxml
[java] Skipping: C:\jenkins_slave\workspace\rc_flex-sdk_mustella-air\mustella\tests\spark\validators\NumberValidator\Styles\NV_Style_DefaultLocale_module_tester.mxml
[java] Skipping: C:\jenkins_slave\workspace\rc_flex-sdk_mustella-air\mustella\tests\spark\validators\NumberValidator\Styles\NV_Style_DefaultLocale_tester.mxml
[java] Skipping: C:\jenkins_slave\workspace\rc_flex-sdk_mustella-air\mustella\tests\spark\validators\NumberValidator\Styles\NV_inline_style_tester.mxml
[java] Skipping: C:\jenkins_slave\workspace\rc_flex-sdk_mustella-air\mustella\tests\spark\validators\NumberValidator\Styles\NV_localCSSStyle_tester.mxml
[java] Skipping: C:\jenkins_slave\workspace\rc_flex-sdk_mustella-air\mustella\tests\spark\validators\NumberValidator\Styles\NV_localStyle_typeSelector_tester.mxml
[java] at the end of main
[java] Shutting down the results server
[java] shutting down the baseline server
[java] done waiting for results...bye
[java] =====================================================
[java] Passes: 0
[java] Fails: 2
[java] =====================================================
[java]
[java] =====================================================
[java] =====================================================
[java] Passed:
[java] =====================================================
[java] =====================================================
[java] Failed:
[java] =====================================================
[java] C:\jenkins_slave\workspace\rc_flex-sdk_mustella-air\mustella\tests\Formatters\SWFs\DateFormatter_Main.xml Failed Timed out
[java] C:\jenkins_slave\workspace\rc_flex-sdk_mustella-air\mustella\tests\GraphicTags\SWFs\GraphicTags_RenderPosition.xml Failed Timed out
[java]
[java]
[java] =====================================================
[java] Passes: 0
[java] Fails: 2
[java] =====================================================
[java]
[java]
[java] Wrote summary to results.txt
[java] Wrote failures to failures.txt
BUILD FAILED
C:\jenkins_slave\workspace\rc_flex-sdk_mustella-air\mustella\build.xml:1547: The following error occurred while executing this line:
C:\jenkins_slave\workspace\rc_flex-sdk_mustella-air\mustella\build.xml:1665: Java returned: 1
Total time: 131 minutes 52 seconds
============ JENKINS MUSTELLA RUN REPORT ============
Date/Time: 03-13-2015 20:12
Run duration: 0 days 2 hours 49 mins 9 seconds
Settings:
player.version = 13.0
air.version = 4.0
FLASHPLAYER_DEBUGGER = C:\ApacheFlex\dependencies\FlashPlayer_Debug\flashplayer13_0r0_214_win_sa_debug.exe
AIR_HOME = C:\ApacheFlex\dependencies\AdobeAIRSDK\4.0
Build:
type = air
command = -apollo
set = tests/apollo
Log:
- Made Cygwin ignore carriage returns
- Set FLASH_VERSION to '13.0' and AIR_VERSION to '4.0'
- Set AIR_HOME to 'C:\ApacheFlex\dependencies\AdobeAIRSDK\4.0'
- Set FLASHPLAYER_DEBUGGER to 'C:\ApacheFlex\dependencies\FlashPlayer_Debug\flashplayer13_0r0_214_win_sa_debug.exe'
- Cleaned up 'local.properties' files from previous runs
- Created fresh 'local.properties' files with containing run specific values
- Ran 'clean', 'main' and 'other.locales' ant targets to prepare the SDK for testing
- Ran Mustella on the SDK with these parameters: '-apollo tests/apollo'
- Some tests failed: running '-failures'
- Some of tests failed, even after running '-failures'...
=====================================================
Build step 'Execute shell' marked build as failure
Archiving artifacts
Email was triggered for: Failure - Any
Sending email for trigger: Failure - Any
(sent from ext-email)