You are viewing a plain text version of this content. The canonical link for it is here.
Posted to dev@zookeeper.apache.org by Apache Jenkins Server <je...@builds.apache.org> on 2018/10/19 06:07:48 UTC
ZooKeeper_branch34_jdk7 - Build # 2097 - Failure
See https://builds.apache.org/job/ZooKeeper_branch34_jdk7/2097/
###################################################################################
########################## LAST 60 LINES OF THE CONSOLE ###########################
[...truncated 42.81 KB...]
[junit] Running org.apache.zookeeper.test.RestoreCommittedLogTest
[junit] Tests run: 1, Failures: 0, Errors: 0, Skipped: 0, Time elapsed: 2.726 sec
[junit] Running org.apache.zookeeper.test.SaslAuthDesignatedClientTest
[junit] Tests run: 2, Failures: 0, Errors: 0, Skipped: 0, Time elapsed: 1.59 sec
[junit] Running org.apache.zookeeper.test.SaslAuthDesignatedServerTest
[junit] Tests run: 1, Failures: 0, Errors: 0, Skipped: 0, Time elapsed: 0.564 sec
[junit] Running org.apache.zookeeper.test.SaslAuthFailDesignatedClientTest
[junit] Tests run: 1, Failures: 0, Errors: 0, Skipped: 0, Time elapsed: 0.762 sec
[junit] Running org.apache.zookeeper.test.SaslAuthFailNotifyTest
[junit] Tests run: 1, Failures: 0, Errors: 0, Skipped: 0, Time elapsed: 0.493 sec
[junit] Running org.apache.zookeeper.test.SaslAuthFailTest
[junit] Tests run: 1, Failures: 0, Errors: 0, Skipped: 0, Time elapsed: 0.607 sec
[junit] Running org.apache.zookeeper.test.SaslAuthMissingClientConfigTest
[junit] Tests run: 1, Failures: 0, Errors: 0, Skipped: 0, Time elapsed: 0.503 sec
[junit] Running org.apache.zookeeper.test.SaslClientTest
[junit] Tests run: 1, Failures: 0, Errors: 0, Skipped: 0, Time elapsed: 0.084 sec
[junit] Running org.apache.zookeeper.test.SessionInvalidationTest
[junit] Tests run: 1, Failures: 0, Errors: 0, Skipped: 0, Time elapsed: 0.477 sec
[junit] Running org.apache.zookeeper.test.SessionTest
[junit] Tests run: 5, Failures: 0, Errors: 0, Skipped: 0, Time elapsed: 10.525 sec
[junit] Running org.apache.zookeeper.test.SessionTimeoutTest
[junit] Tests run: 4, Failures: 0, Errors: 0, Skipped: 0, Time elapsed: 0.627 sec
[junit] Running org.apache.zookeeper.test.StandaloneTest
[junit] Tests run: 1, Failures: 0, Errors: 0, Skipped: 0, Time elapsed: 0.883 sec
[junit] Running org.apache.zookeeper.test.StatTest
[junit] Tests run: 4, Failures: 0, Errors: 0, Skipped: 0, Time elapsed: 0.598 sec
[junit] Running org.apache.zookeeper.test.StaticHostProviderTest
[junit] Tests run: 13, Failures: 0, Errors: 0, Skipped: 0, Time elapsed: 2.436 sec
[junit] Running org.apache.zookeeper.test.SyncCallTest
[junit] Tests run: 1, Failures: 0, Errors: 0, Skipped: 0, Time elapsed: 0.573 sec
[junit] Running org.apache.zookeeper.test.TruncateTest
[junit] Tests run: 3, Failures: 0, Errors: 0, Skipped: 0, Time elapsed: 6.031 sec
[junit] Running org.apache.zookeeper.test.UpgradeTest
[junit] Tests run: 1, Failures: 0, Errors: 0, Skipped: 0, Time elapsed: 1.486 sec
[junit] Running org.apache.zookeeper.test.WatchedEventTest
[junit] Tests run: 4, Failures: 0, Errors: 0, Skipped: 0, Time elapsed: 0.101 sec
[junit] Running org.apache.zookeeper.test.WatcherFuncTest
[junit] Tests run: 6, Failures: 0, Errors: 0, Skipped: 0, Time elapsed: 0.782 sec
[junit] Running org.apache.zookeeper.test.WatcherTest
[junit] Tests run: 7, Failures: 0, Errors: 0, Skipped: 0, Time elapsed: 27.025 sec
[junit] Running org.apache.zookeeper.test.ZkDatabaseCorruptionTest
[junit] Tests run: 1, Failures: 0, Errors: 0, Skipped: 0, Time elapsed: 6.707 sec
[junit] Running org.apache.zookeeper.test.ZooKeeperQuotaTest
[junit] Tests run: 1, Failures: 0, Errors: 0, Skipped: 0, Time elapsed: 0.558 sec
[junit] Running org.apache.jute.BinaryInputArchiveTest
[junit] Tests run: 1, Failures: 0, Errors: 0, Skipped: 0, Time elapsed: 0.082 sec
fail.build.on.test.failure:
BUILD FAILED
/home/jenkins/jenkins-slave/workspace/ZooKeeper_branch34_jdk7/build.xml:1467: The following error occurred while executing this line:
/home/jenkins/jenkins-slave/workspace/ZooKeeper_branch34_jdk7/build.xml:1470: Tests failed!
Total time: 29 minutes 29 seconds
Build step 'Invoke Ant' marked build as failure
Archiving artifacts
Recording test results
Email was triggered for: Failure - Any
Sending email for trigger: Failure - Any
###################################################################################
############################## FAILED TESTS (if any) ##############################
1 tests failed.
FAILED: org.apache.zookeeper.server.quorum.QuorumPeerMainTest.testLeaderOutOfView
Error Message:
null
Stack Trace:
junit.framework.AssertionFailedError
at org.apache.zookeeper.server.quorum.QuorumPeerMainTest.testLeaderOutOfView(QuorumPeerMainTest.java:1321)
at org.apache.zookeeper.JUnit4ZKTestRunner$LoggedInvokeMethod.evaluate(JUnit4ZKTestRunner.java:55)