You are viewing a plain text version of this content. The canonical link for it is here.
Posted to dev@lucene.apache.org by Apache Jenkins Server <je...@builds.apache.org> on 2016/10/11 03:22:52 UTC

[JENKINS] Lucene-Solr-Tests-master - Build # 1409 - Unstable

Build: https://builds.apache.org/job/Lucene-Solr-Tests-master/1409/

1 tests failed.
FAILED:  org.apache.solr.cloud.RecoveryZkTest.test

Error Message:
There are still nodes recoverying - waited for 120 seconds

Stack Trace:
java.lang.AssertionError: There are still nodes recoverying - waited for 120 seconds
	at __randomizedtesting.SeedInfo.seed([7E7F568F98BD8F6D:F62B69553641E295]:0)
	at org.junit.Assert.fail(Assert.java:93)
	at org.apache.solr.cloud.AbstractDistribZkTestBase.waitForRecoveriesToFinish(AbstractDistribZkTestBase.java:181)
	at org.apache.solr.cloud.AbstractFullDistribZkTestBase.waitForRecoveriesToFinish(AbstractFullDistribZkTestBase.java:862)
	at org.apache.solr.cloud.AbstractFullDistribZkTestBase.waitForThingsToLevelOut(AbstractFullDistribZkTestBase.java:1418)
	at org.apache.solr.cloud.RecoveryZkTest.test(RecoveryZkTest.java:105)
	at sun.reflect.NativeMethodAccessorImpl.invoke0(Native Method)
	at sun.reflect.NativeMethodAccessorImpl.invoke(NativeMethodAccessorImpl.java:62)
	at sun.reflect.DelegatingMethodAccessorImpl.invoke(DelegatingMethodAccessorImpl.java:43)
	at java.lang.reflect.Method.invoke(Method.java:498)
	at com.carrotsearch.randomizedtesting.RandomizedRunner.invoke(RandomizedRunner.java:1764)
	at com.carrotsearch.randomizedtesting.RandomizedRunner$8.evaluate(RandomizedRunner.java:871)
	at com.carrotsearch.randomizedtesting.RandomizedRunner$9.evaluate(RandomizedRunner.java:907)
	at com.carrotsearch.randomizedtesting.RandomizedRunner$10.evaluate(RandomizedRunner.java:921)
	at org.apache.solr.BaseDistributedSearchTestCase$ShardsRepeatRule$ShardsFixedStatement.callStatement(BaseDistributedSearchTestCase.java:985)
	at org.apache.solr.BaseDistributedSearchTestCase$ShardsRepeatRule$ShardsStatement.evaluate(BaseDistributedSearchTestCase.java:960)
	at com.carrotsearch.randomizedtesting.rules.SystemPropertiesRestoreRule$1.evaluate(SystemPropertiesRestoreRule.java:57)
	at org.apache.lucene.util.TestRuleSetupTeardownChained$1.evaluate(TestRuleSetupTeardownChained.java:49)
	at org.apache.lucene.util.AbstractBeforeAfterRule$1.evaluate(AbstractBeforeAfterRule.java:45)
	at org.apache.lucene.util.TestRuleThreadAndTestName$1.evaluate(TestRuleThreadAndTestName.java:48)
	at org.apache.lucene.util.TestRuleIgnoreAfterMaxFailures$1.evaluate(TestRuleIgnoreAfterMaxFailures.java:64)
	at org.apache.lucene.util.TestRuleMarkFailure$1.evaluate(TestRuleMarkFailure.java:47)
	at com.carrotsearch.randomizedtesting.rules.StatementAdapter.evaluate(StatementAdapter.java:36)
	at com.carrotsearch.randomizedtesting.ThreadLeakControl$StatementRunner.run(ThreadLeakControl.java:367)
	at com.carrotsearch.randomizedtesting.ThreadLeakControl.forkTimeoutingTask(ThreadLeakControl.java:809)
	at com.carrotsearch.randomizedtesting.ThreadLeakControl$3.evaluate(ThreadLeakControl.java:460)
	at com.carrotsearch.randomizedtesting.RandomizedRunner.runSingleTest(RandomizedRunner.java:880)
	at com.carrotsearch.randomizedtesting.RandomizedRunner$5.evaluate(RandomizedRunner.java:781)
	at com.carrotsearch.randomizedtesting.RandomizedRunner$6.evaluate(RandomizedRunner.java:816)
	at com.carrotsearch.randomizedtesting.RandomizedRunner$7.evaluate(RandomizedRunner.java:827)
	at com.carrotsearch.randomizedtesting.rules.StatementAdapter.evaluate(StatementAdapter.java:36)
	at com.carrotsearch.randomizedtesting.rules.SystemPropertiesRestoreRule$1.evaluate(SystemPropertiesRestoreRule.java:57)
	at org.apache.lucene.util.AbstractBeforeAfterRule$1.evaluate(AbstractBeforeAfterRule.java:45)
	at com.carrotsearch.randomizedtesting.rules.StatementAdapter.evaluate(StatementAdapter.java:36)
	at org.apache.lucene.util.TestRuleStoreClassName$1.evaluate(TestRuleStoreClassName.java:41)
	at com.carrotsearch.randomizedtesting.rules.NoShadowingOrOverridesOnMethodsRule$1.evaluate(NoShadowingOrOverridesOnMethodsRule.java:40)
	at com.carrotsearch.randomizedtesting.rules.NoShadowingOrOverridesOnMethodsRule$1.evaluate(NoShadowingOrOverridesOnMethodsRule.java:40)
	at com.carrotsearch.randomizedtesting.rules.StatementAdapter.evaluate(StatementAdapter.java:36)
	at com.carrotsearch.randomizedtesting.rules.StatementAdapter.evaluate(StatementAdapter.java:36)
	at com.carrotsearch.randomizedtesting.rules.StatementAdapter.evaluate(StatementAdapter.java:36)
	at org.apache.lucene.util.TestRuleAssertionsRequired$1.evaluate(TestRuleAssertionsRequired.java:53)
	at org.apache.lucene.util.TestRuleMarkFailure$1.evaluate(TestRuleMarkFailure.java:47)
	at org.apache.lucene.util.TestRuleIgnoreAfterMaxFailures$1.evaluate(TestRuleIgnoreAfterMaxFailures.java:64)
	at org.apache.lucene.util.TestRuleIgnoreTestSuites$1.evaluate(TestRuleIgnoreTestSuites.java:54)
	at com.carrotsearch.randomizedtesting.rules.StatementAdapter.evaluate(StatementAdapter.java:36)
	at com.carrotsearch.randomizedtesting.ThreadLeakControl$StatementRunner.run(ThreadLeakControl.java:367)
	at java.lang.Thread.run(Thread.java:745)




Build Log:
[...truncated 11539 lines...]
   [junit4] Suite: org.apache.solr.cloud.RecoveryZkTest
   [junit4]   2> Creating dataDir: /x1/jenkins/jenkins-slave/workspace/Lucene-Solr-Tests-master/solr/build/solr-core/test/J0/temp/solr.cloud.RecoveryZkTest_7E7F568F98BD8F6D-001/init-core-data-001
   [junit4]   2> 905028 INFO  (SUITE-RecoveryZkTest-seed#[7E7F568F98BD8F6D]-worker) [    ] o.a.s.SolrTestCaseJ4 Randomized ssl (true) and clientAuth (true) via: @org.apache.solr.util.RandomizeSSL(reason=, ssl=NaN, value=NaN, clientAuth=NaN)
   [junit4]   2> 905029 INFO  (SUITE-RecoveryZkTest-seed#[7E7F568F98BD8F6D]-worker) [    ] o.a.s.BaseDistributedSearchTestCase Setting hostContext system property: /y_dy/b
   [junit4]   2> 905031 INFO  (TEST-RecoveryZkTest.test-seed#[7E7F568F98BD8F6D]) [    ] o.a.s.c.ZkTestServer STARTING ZK TEST SERVER
   [junit4]   2> 905032 INFO  (Thread-7587) [    ] o.a.s.c.ZkTestServer client port:0.0.0.0/0.0.0.0:0
   [junit4]   2> 905032 INFO  (Thread-7587) [    ] o.a.s.c.ZkTestServer Starting server
   [junit4]   2> 905132 INFO  (TEST-RecoveryZkTest.test-seed#[7E7F568F98BD8F6D]) [    ] o.a.s.c.ZkTestServer start zk server on port:38805
   [junit4]   2> 905143 WARN  (NIOServerCxn.Factory:0.0.0.0/0.0.0.0:0) [    ] o.a.z.s.NIOServerCnxn caught end of stream exception
   [junit4]   2> EndOfStreamException: Unable to read additional data from client sessionid 0x157b1a726ab0000, likely client has closed socket
   [junit4]   2> 	at org.apache.zookeeper.server.NIOServerCnxn.doIO(NIOServerCnxn.java:228)
   [junit4]   2> 	at org.apache.zookeeper.server.NIOServerCnxnFactory.run(NIOServerCnxnFactory.java:208)
   [junit4]   2> 	at java.lang.Thread.run(Thread.java:745)
   [junit4]   2> 905148 INFO  (TEST-RecoveryZkTest.test-seed#[7E7F568F98BD8F6D]) [    ] o.a.s.c.AbstractZkTestCase put /x1/jenkins/jenkins-slave/workspace/Lucene-Solr-Tests-master/solr/core/src/test-files/solr/collection1/conf/solrconfig-tlog.xml to /configs/conf1/solrconfig.xml
   [junit4]   2> 905150 INFO  (TEST-RecoveryZkTest.test-seed#[7E7F568F98BD8F6D]) [    ] o.a.s.c.AbstractZkTestCase put /x1/jenkins/jenkins-slave/workspace/Lucene-Solr-Tests-master/solr/core/src/test-files/solr/collection1/conf/schema15.xml to /configs/conf1/schema.xml
   [junit4]   2> 905151 INFO  (TEST-RecoveryZkTest.test-seed#[7E7F568F98BD8F6D]) [    ] o.a.s.c.AbstractZkTestCase put /x1/jenkins/jenkins-slave/workspace/Lucene-Solr-Tests-master/solr/core/src/test-files/solr/collection1/conf/solrconfig.snippet.randomindexconfig.xml to /configs/conf1/solrconfig.snippet.randomindexconfig.xml
   [junit4]   2> 905152 INFO  (TEST-RecoveryZkTest.test-seed#[7E7F568F98BD8F6D]) [    ] o.a.s.c.AbstractZkTestCase put /x1/jenkins/jenkins-slave/workspace/Lucene-Solr-Tests-master/solr/core/src/test-files/solr/collection1/conf/stopwords.txt to /configs/conf1/stopwords.txt
   [junit4]   2> 905153 INFO  (TEST-RecoveryZkTest.test-seed#[7E7F568F98BD8F6D]) [    ] o.a.s.c.AbstractZkTestCase put /x1/jenkins/jenkins-slave/workspace/Lucene-Solr-Tests-master/solr/core/src/test-files/solr/collection1/conf/protwords.txt to /configs/conf1/protwords.txt
   [junit4]   2> 905154 INFO  (TEST-RecoveryZkTest.test-seed#[7E7F568F98BD8F6D]) [    ] o.a.s.c.AbstractZkTestCase put /x1/jenkins/jenkins-slave/workspace/Lucene-Solr-Tests-master/solr/core/src/test-files/solr/collection1/conf/currency.xml to /configs/conf1/currency.xml
   [junit4]   2> 905155 INFO  (TEST-RecoveryZkTest.test-seed#[7E7F568F98BD8F6D]) [    ] o.a.s.c.AbstractZkTestCase put /x1/jenkins/jenkins-slave/workspace/Lucene-Solr-Tests-master/solr/core/src/test-files/solr/collection1/conf/enumsConfig.xml to /configs/conf1/enumsConfig.xml
   [junit4]   2> 905156 INFO  (TEST-RecoveryZkTest.test-seed#[7E7F568F98BD8F6D]) [    ] o.a.s.c.AbstractZkTestCase put /x1/jenkins/jenkins-slave/workspace/Lucene-Solr-Tests-master/solr/core/src/test-files/solr/collection1/conf/open-exchange-rates.json to /configs/conf1/open-exchange-rates.json
   [junit4]   2> 905157 INFO  (TEST-RecoveryZkTest.test-seed#[7E7F568F98BD8F6D]) [    ] o.a.s.c.AbstractZkTestCase put /x1/jenkins/jenkins-slave/workspace/Lucene-Solr-Tests-master/solr/core/src/test-files/solr/collection1/conf/mapping-ISOLatin1Accent.txt to /configs/conf1/mapping-ISOLatin1Accent.txt
   [junit4]   2> 905158 INFO  (TEST-RecoveryZkTest.test-seed#[7E7F568F98BD8F6D]) [    ] o.a.s.c.AbstractZkTestCase put /x1/jenkins/jenkins-slave/workspace/Lucene-Solr-Tests-master/solr/core/src/test-files/solr/collection1/conf/old_synonyms.txt to /configs/conf1/old_synonyms.txt
   [junit4]   2> 905159 INFO  (TEST-RecoveryZkTest.test-seed#[7E7F568F98BD8F6D]) [    ] o.a.s.c.AbstractZkTestCase put /x1/jenkins/jenkins-slave/workspace/Lucene-Solr-Tests-master/solr/core/src/test-files/solr/collection1/conf/synonyms.txt to /configs/conf1/synonyms.txt
   [junit4]   2> 905226 INFO  (TEST-RecoveryZkTest.test-seed#[7E7F568F98BD8F6D]) [    ] o.a.s.SolrTestCaseJ4 Writing core.properties file to /x1/jenkins/jenkins-slave/workspace/Lucene-Solr-Tests-master/solr/build/solr-core/test/J0/temp/solr.cloud.RecoveryZkTest_7E7F568F98BD8F6D-001/control-001/cores/collection1
   [junit4]   2> 905227 INFO  (TEST-RecoveryZkTest.test-seed#[7E7F568F98BD8F6D]) [    ] o.e.j.s.Server jetty-9.3.8.v20160314
   [junit4]   2> 905230 INFO  (TEST-RecoveryZkTest.test-seed#[7E7F568F98BD8F6D]) [    ] o.e.j.s.h.ContextHandler Started o.e.j.s.ServletContextHandler@15eb4530{/y_dy/b,null,AVAILABLE}
   [junit4]   2> 905232 INFO  (TEST-RecoveryZkTest.test-seed#[7E7F568F98BD8F6D]) [    ] o.e.j.s.ServerConnector Started ServerConnector@44a19a6e{SSL,[ssl, http/1.1]}{127.0.0.1:54440}
   [junit4]   2> 905232 INFO  (TEST-RecoveryZkTest.test-seed#[7E7F568F98BD8F6D]) [    ] o.e.j.s.Server Started @907739ms
   [junit4]   2> 905232 INFO  (TEST-RecoveryZkTest.test-seed#[7E7F568F98BD8F6D]) [    ] o.a.s.c.s.e.JettySolrRunner Jetty properties: {solr.data.dir=/x1/jenkins/jenkins-slave/workspace/Lucene-Solr-Tests-master/solr/build/solr-core/test/J0/temp/solr.cloud.RecoveryZkTest_7E7F568F98BD8F6D-001/tempDir-001/control/data, hostContext=/y_dy/b, hostPort=54440, coreRootDirectory=/x1/jenkins/jenkins-slave/workspace/Lucene-Solr-Tests-master/solr/build/solr-core/test/J0/../../../../../../../../../../x1/jenkins/jenkins-slave/workspace/Lucene-Solr-Tests-master/solr/build/solr-core/test/J0/temp/solr.cloud.RecoveryZkTest_7E7F568F98BD8F6D-001/control-001/cores}
   [junit4]   2> 905233 INFO  (TEST-RecoveryZkTest.test-seed#[7E7F568F98BD8F6D]) [    ] o.a.s.s.SolrDispatchFilter  ___      _       Welcome to Apache Solr? version 7.0.0
   [junit4]   2> 905233 INFO  (TEST-RecoveryZkTest.test-seed#[7E7F568F98BD8F6D]) [    ] o.a.s.s.SolrDispatchFilter / __| ___| |_ _   Starting in cloud mode on port null
   [junit4]   2> 905233 INFO  (TEST-RecoveryZkTest.test-seed#[7E7F568F98BD8F6D]) [    ] o.a.s.s.SolrDispatchFilter \__ \/ _ \ | '_|  Install dir: null
   [junit4]   2> 905233 INFO  (TEST-RecoveryZkTest.test-seed#[7E7F568F98BD8F6D]) [    ] o.a.s.s.SolrDispatchFilter |___/\___/_|_|    Start time: 2016-10-11T02:51:44.371Z
   [junit4]   2> 905235 INFO  (TEST-RecoveryZkTest.test-seed#[7E7F568F98BD8F6D]) [    ] o.a.s.s.SolrDispatchFilter Loading solr.xml from SolrHome (not found in ZooKeeper)
   [junit4]   2> 905235 INFO  (TEST-RecoveryZkTest.test-seed#[7E7F568F98BD8F6D]) [    ] o.a.s.c.SolrXmlConfig Loading container configuration from /x1/jenkins/jenkins-slave/workspace/Lucene-Solr-Tests-master/solr/build/solr-core/test/J0/temp/solr.cloud.RecoveryZkTest_7E7F568F98BD8F6D-001/control-001/solr.xml
   [junit4]   2> 905240 INFO  (TEST-RecoveryZkTest.test-seed#[7E7F568F98BD8F6D]) [    ] o.a.s.c.ZkContainer Zookeeper client=127.0.0.1:38805/solr
   [junit4]   2> 905258 INFO  (TEST-RecoveryZkTest.test-seed#[7E7F568F98BD8F6D]) [n:127.0.0.1:54440_y_dy%2Fb    ] o.a.s.c.OverseerElectionContext I am going to be the leader 127.0.0.1:54440_y_dy%2Fb
   [junit4]   2> 905259 INFO  (TEST-RecoveryZkTest.test-seed#[7E7F568F98BD8F6D]) [n:127.0.0.1:54440_y_dy%2Fb    ] o.a.s.c.Overseer Overseer (id=96741248478150661-127.0.0.1:54440_y_dy%2Fb-n_0000000000) starting
   [junit4]   2> 905267 INFO  (TEST-RecoveryZkTest.test-seed#[7E7F568F98BD8F6D]) [n:127.0.0.1:54440_y_dy%2Fb    ] o.a.s.c.ZkController Register node as live in ZooKeeper:/live_nodes/127.0.0.1:54440_y_dy%2Fb
   [junit4]   2> 905274 INFO  (zkCallback-16666-thread-1-processing-n:127.0.0.1:54440_y_dy%2Fb) [n:127.0.0.1:54440_y_dy%2Fb    ] o.a.s.c.c.ZkStateReader Updated live nodes from ZooKeeper... (0) -> (1)
   [junit4]   2> 905276 INFO  (TEST-RecoveryZkTest.test-seed#[7E7F568F98BD8F6D]) [n:127.0.0.1:54440_y_dy%2Fb    ] o.a.s.c.CorePropertiesLocator Found 1 core definitions underneath /x1/jenkins/jenkins-slave/workspace/Lucene-Solr-Tests-master/solr/build/solr-core/test/J0/../../../../../../../../../../x1/jenkins/jenkins-slave/workspace/Lucene-Solr-Tests-master/solr/build/solr-core/test/J0/temp/solr.cloud.RecoveryZkTest_7E7F568F98BD8F6D-001/control-001/cores
   [junit4]   2> 905276 INFO  (TEST-RecoveryZkTest.test-seed#[7E7F568F98BD8F6D]) [n:127.0.0.1:54440_y_dy%2Fb    ] o.a.s.c.CorePropertiesLocator Cores are: [collection1]
   [junit4]   2> 905278 INFO  (OverseerStateUpdate-96741248478150661-127.0.0.1:54440_y_dy%2Fb-n_0000000000) [n:127.0.0.1:54440_y_dy%2Fb    ] o.a.s.c.o.ReplicaMutator Assigning new node to shard shard=shard1
   [junit4]   2> 906298 INFO  (coreLoadExecutor-6749-thread-1-processing-n:127.0.0.1:54440_y_dy%2Fb) [n:127.0.0.1:54440_y_dy%2Fb c:control_collection   x:collection1] o.a.s.c.SolrConfig Using Lucene MatchVersion: 7.0.0
   [junit4]   2> 906309 INFO  (coreLoadExecutor-6749-thread-1-processing-n:127.0.0.1:54440_y_dy%2Fb) [n:127.0.0.1:54440_y_dy%2Fb c:control_collection   x:collection1] o.a.s.s.IndexSchema [collection1] Schema name=test
   [junit4]   2> 906357 WARN  (coreLoadExecutor-6749-thread-1-processing-n:127.0.0.1:54440_y_dy%2Fb) [n:127.0.0.1:54440_y_dy%2Fb c:control_collection   x:collection1] o.a.s.s.IndexSchema [collection1] default search field in schema is text. WARNING: Deprecated, please use 'df' on request instead.
   [junit4]   2> 906358 INFO  (coreLoadExecutor-6749-thread-1-processing-n:127.0.0.1:54440_y_dy%2Fb) [n:127.0.0.1:54440_y_dy%2Fb c:control_collection   x:collection1] o.a.s.s.IndexSchema Loaded schema test/1.6 with uniqueid field id
   [junit4]   2> 906385 INFO  (coreLoadExecutor-6749-thread-1-processing-n:127.0.0.1:54440_y_dy%2Fb) [n:127.0.0.1:54440_y_dy%2Fb c:control_collection   x:collection1] o.a.s.c.CoreContainer Creating SolrCore 'collection1' using configuration from collection control_collection
   [junit4]   2> 906385 INFO  (coreLoadExecutor-6749-thread-1-processing-n:127.0.0.1:54440_y_dy%2Fb) [n:127.0.0.1:54440_y_dy%2Fb c:control_collection s:shard1 r:core_node1 x:collection1] o.a.s.c.SolrCore [[collection1] ] Opening new SolrCore at [/x1/jenkins/jenkins-slave/workspace/Lucene-Solr-Tests-master/solr/build/solr-core/test/J0/temp/solr.cloud.RecoveryZkTest_7E7F568F98BD8F6D-001/control-001/cores/collection1], dataDir=[/x1/jenkins/jenkins-slave/workspace/Lucene-Solr-Tests-master/solr/build/solr-core/test/J0/../../../../../../../../../../x1/jenkins/jenkins-slave/workspace/Lucene-Solr-Tests-master/solr/build/solr-core/test/J0/temp/solr.cloud.RecoveryZkTest_7E7F568F98BD8F6D-001/control-001/cores/collection1/data/]
   [junit4]   2> 906385 INFO  (coreLoadExecutor-6749-thread-1-processing-n:127.0.0.1:54440_y_dy%2Fb) [n:127.0.0.1:54440_y_dy%2Fb c:control_collection s:shard1 r:core_node1 x:collection1] o.a.s.c.JmxMonitoredMap JMX monitoring is enabled. Adding Solr mbeans to JMX Server: com.sun.jmx.mbeanserver.JmxMBeanServer@28350b32
   [junit4]   2> 906386 INFO  (coreLoadExecutor-6749-thread-1-processing-n:127.0.0.1:54440_y_dy%2Fb) [n:127.0.0.1:54440_y_dy%2Fb c:control_collection s:shard1 r:core_node1 x:collection1] o.a.s.u.RandomMergePolicy RandomMergePolicy wrapping class org.apache.lucene.index.TieredMergePolicy: [TieredMergePolicy: maxMergeAtOnce=38, maxMergeAtOnceExplicit=11, maxMergedSegmentMB=23.482421875, floorSegmentMB=0.6025390625, forceMergeDeletesPctAllowed=20.046041689821777, segmentsPerTier=40.0, maxCFSSegmentSizeMB=8.796093022207999E12, noCFSRatio=0.655467893355304
   [junit4]   2> 906393 WARN  (coreLoadExecutor-6749-thread-1-processing-n:127.0.0.1:54440_y_dy%2Fb) [n:127.0.0.1:54440_y_dy%2Fb c:control_collection s:shard1 r:core_node1 x:collection1] o.a.s.c.RequestHandlers INVALID paramSet a in requestHandler {type = requestHandler,name = /dump,class = DumpRequestHandler,args = {defaults={a=A,b=B}}}
   [junit4]   2> 906402 INFO  (coreLoadExecutor-6749-thread-1-processing-n:127.0.0.1:54440_y_dy%2Fb) [n:127.0.0.1:54440_y_dy%2Fb c:control_collection s:shard1 r:core_node1 x:collection1] o.a.s.u.UpdateHandler Using UpdateLog implementation: org.apache.solr.update.UpdateLog
   [junit4]   2> 906402 INFO  (coreLoadExecutor-6749-thread-1-processing-n:127.0.0.1:54440_y_dy%2Fb) [n:127.0.0.1:54440_y_dy%2Fb c:control_collection s:shard1 r:core_node1 x:collection1] o.a.s.u.UpdateLog Initializing UpdateLog: dataDir= defaultSyncLevel=FLUSH numRecordsToKeep=100 maxNumLogsToKeep=10 numVersionBuckets=65536
   [junit4]   2> 906403 INFO  (coreLoadExecutor-6749-thread-1-processing-n:127.0.0.1:54440_y_dy%2Fb) [n:127.0.0.1:54440_y_dy%2Fb c:control_collection s:shard1 r:core_node1 x:collection1] o.a.s.u.CommitTracker Hard AutoCommit: disabled
   [junit4]   2> 906403 INFO  (coreLoadExecutor-6749-thread-1-processing-n:127.0.0.1:54440_y_dy%2Fb) [n:127.0.0.1:54440_y_dy%2Fb c:control_collection s:shard1 r:core_node1 x:collection1] o.a.s.u.CommitTracker Soft AutoCommit: disabled
   [junit4]   2> 906403 INFO  (coreLoadExecutor-6749-thread-1-processing-n:127.0.0.1:54440_y_dy%2Fb) [n:127.0.0.1:54440_y_dy%2Fb c:control_collection s:shard1 r:core_node1 x:collection1] o.a.s.u.RandomMergePolicy RandomMergePolicy wrapping class org.apache.lucene.index.TieredMergePolicy: [TieredMergePolicy: maxMergeAtOnce=20, maxMergeAtOnceExplicit=32, maxMergedSegmentMB=28.068359375, floorSegmentMB=1.9287109375, forceMergeDeletesPctAllowed=11.84038114255454, segmentsPerTier=20.0, maxCFSSegmentSizeMB=8.796093022207999E12, noCFSRatio=1.0
   [junit4]   2> 906403 INFO  (coreLoadExecutor-6749-thread-1-processing-n:127.0.0.1:54440_y_dy%2Fb) [n:127.0.0.1:54440_y_dy%2Fb c:control_collection s:shard1 r:core_node1 x:collection1] o.a.s.s.SolrIndexSearcher Opening [Searcher@28698de0[collection1] main]
   [junit4]   2> 906404 INFO  (coreLoadExecutor-6749-thread-1-processing-n:127.0.0.1:54440_y_dy%2Fb) [n:127.0.0.1:54440_y_dy%2Fb c:control_collection s:shard1 r:core_node1 x:collection1] o.a.s.r.ManagedResourceStorage Configured ZooKeeperStorageIO with znodeBase: /configs/conf1
   [junit4]   2> 906405 INFO  (coreLoadExecutor-6749-thread-1-processing-n:127.0.0.1:54440_y_dy%2Fb) [n:127.0.0.1:54440_y_dy%2Fb c:control_collection s:shard1 r:core_node1 x:collection1] o.a.s.r.ManagedResourceStorage Loaded null at path _rest_managed.json using ZooKeeperStorageIO:path=/configs/conf1
   [junit4]   2> 906406 INFO  (coreLoadExecutor-6749-thread-1-processing-n:127.0.0.1:54440_y_dy%2Fb) [n:127.0.0.1:54440_y_dy%2Fb c:control_collection s:shard1 r:core_node1 x:collection1] o.a.s.h.ReplicationHandler Commits will be reserved for  10000
   [junit4]   2> 906407 INFO  (searcherExecutor-6750-thread-1-processing-n:127.0.0.1:54440_y_dy%2Fb x:collection1 s:shard1 c:control_collection r:core_node1) [n:127.0.0.1:54440_y_dy%2Fb c:control_collection s:shard1 r:core_node1 x:collection1] o.a.s.c.SolrCore [collection1] Registered new searcher Searcher@28698de0[collection1] main{ExitableDirectoryReader(UninvertingDirectoryReader())}
   [junit4]   2> 906408 INFO  (coreLoadExecutor-6749-thread-1-processing-n:127.0.0.1:54440_y_dy%2Fb) [n:127.0.0.1:54440_y_dy%2Fb c:control_collection s:shard1 r:core_node1 x:collection1] o.a.s.u.UpdateLog Could not find max version in index or recent updates, using new clock 1547859977092202496
   [junit4]   2> 906416 INFO  (coreZkRegister-6742-thread-1-processing-n:127.0.0.1:54440_y_dy%2Fb x:collection1 s:shard1 c:control_collection r:core_node1) [n:127.0.0.1:54440_y_dy%2Fb c:control_collection s:shard1 r:core_node1 x:collection1] o.a.s.c.ShardLeaderElectionContext Enough replicas found to continue.
   [junit4]   2> 906416 INFO  (coreZkRegister-6742-thread-1-processing-n:127.0.0.1:54440_y_dy%2Fb x:collection1 s:shard1 c:control_collection r:core_node1) [n:127.0.0.1:54440_y_dy%2Fb c:control_collection s:shard1 r:core_node1 x:collection1] o.a.s.c.ShardLeaderElectionContext I may be the new leader - try and sync
   [junit4]   2> 906417 INFO  (coreZkRegister-6742-thread-1-processing-n:127.0.0.1:54440_y_dy%2Fb x:collection1 s:shard1 c:control_collection r:core_node1) [n:127.0.0.1:54440_y_dy%2Fb c:control_collection s:shard1 r:core_node1 x:collection1] o.a.s.c.SyncStrategy Sync replicas to https://127.0.0.1:54440/y_dy/b/collection1/
   [junit4]   2> 906417 INFO  (coreZkRegister-6742-thread-1-processing-n:127.0.0.1:54440_y_dy%2Fb x:collection1 s:shard1 c:control_collection r:core_node1) [n:127.0.0.1:54440_y_dy%2Fb c:control_collection s:shard1 r:core_node1 x:collection1] o.a.s.c.SyncStrategy Sync Success - now sync replicas to me
   [junit4]   2> 906417 INFO  (coreZkRegister-6742-thread-1-processing-n:127.0.0.1:54440_y_dy%2Fb x:collection1 s:shard1 c:control_collection r:core_node1) [n:127.0.0.1:54440_y_dy%2Fb c:control_collection s:shard1 r:core_node1 x:collection1] o.a.s.c.SyncStrategy https://127.0.0.1:54440/y_dy/b/collection1/ has no replicas
   [junit4]   2> 906420 INFO  (coreZkRegister-6742-thread-1-processing-n:127.0.0.1:54440_y_dy%2Fb x:collection1 s:shard1 c:control_collection r:core_node1) [n:127.0.0.1:54440_y_dy%2Fb c:control_collection s:shard1 r:core_node1 x:collection1] o.a.s.c.ShardLeaderElectionContext I am the new leader: https://127.0.0.1:54440/y_dy/b/collection1/ shard1
   [junit4]   2> 906571 INFO  (coreZkRegister-6742-thread-1-processing-n:127.0.0.1:54440_y_dy%2Fb x:collection1 s:shard1 c:control_collection r:core_node1) [n:127.0.0.1:54440_y_dy%2Fb c:control_collection s:shard1 r:core_node1 x:collection1] o.a.s.c.ZkController I am the leader, no recovery necessary
   [junit4]   2> 906780 INFO  (TEST-RecoveryZkTest.test-seed#[7E7F568F98BD8F6D]) [    ] o.a.s.c.c.ZkStateReader Updated live nodes from ZooKeeper... (0) -> (1)
   [junit4]   2> 906781 INFO  (TEST-RecoveryZkTest.test-seed#[7E7F568F98BD8F6D]) [    ] o.a.s.c.ChaosMonkey monkey: init - expire sessions:false cause connection loss:false
   [junit4]   2> 906851 INFO  (TEST-RecoveryZkTest.test-seed#[7E7F568F98BD8F6D]) [    ] o.a.s.SolrTestCaseJ4 Writing core.properties file to /x1/jenkins/jenkins-slave/workspace/Lucene-Solr-Tests-master/solr/build/solr-core/test/J0/temp/solr.cloud.RecoveryZkTest_7E7F568F98BD8F6D-001/shard-1-001/cores/collection1
   [junit4]   2> 906852 INFO  (TEST-RecoveryZkTest.test-seed#[7E7F568F98BD8F6D]) [    ] o.a.s.c.AbstractFullDistribZkTestBase create jetty 1 in directory /x1/jenkins/jenkins-slave/workspace/Lucene-Solr-Tests-master/solr/build/solr-core/test/J0/temp/solr.cloud.RecoveryZkTest_7E7F568F98BD8F6D-001/shard-1-001
   [junit4]   2> 906853 INFO  (TEST-RecoveryZkTest.test-seed#[7E7F568F98BD8F6D]) [    ] o.e.j.s.Server jetty-9.3.8.v20160314
   [junit4]   2> 906856 INFO  (TEST-RecoveryZkTest.test-seed#[7E7F568F98BD8F6D]) [    ] o.e.j.s.h.ContextHandler Started o.e.j.s.ServletContextHandler@3cb46e8b{/y_dy/b,null,AVAILABLE}
   [junit4]   2> 906858 INFO  (TEST-RecoveryZkTest.test-seed#[7E7F568F98BD8F6D]) [    ] o.e.j.s.ServerConnector Started ServerConnector@2e32365d{SSL,[ssl, http/1.1]}{127.0.0.1:47442}
   [junit4]   2> 906858 INFO  (TEST-RecoveryZkTest.test-seed#[7E7F568F98BD8F6D]) [    ] o.e.j.s.Server Started @909365ms
   [junit4]   2> 906858 INFO  (TEST-RecoveryZkTest.test-seed#[7E7F568F98BD8F6D]) [    ] o.a.s.c.s.e.JettySolrRunner Jetty properties: {solr.data.dir=/x1/jenkins/jenkins-slave/workspace/Lucene-Solr-Tests-master/solr/build/solr-core/test/J0/temp/solr.cloud.RecoveryZkTest_7E7F568F98BD8F6D-001/tempDir-001/jetty1, solrconfig=solrconfig.xml, hostContext=/y_dy/b, hostPort=47442, coreRootDirectory=/x1/jenkins/jenkins-slave/workspace/Lucene-Solr-Tests-master/solr/build/solr-core/test/J0/../../../../../../../../../../x1/jenkins/jenkins-slave/workspace/Lucene-Solr-Tests-master/solr/build/solr-core/test/J0/temp/solr.cloud.RecoveryZkTest_7E7F568F98BD8F6D-001/shard-1-001/cores}
   [junit4]   2> 906858 INFO  (TEST-RecoveryZkTest.test-seed#[7E7F568F98BD8F6D]) [    ] o.a.s.s.SolrDispatchFilter  ___      _       Welcome to Apache Solr? version 7.0.0
   [junit4]   2> 906858 INFO  (TEST-RecoveryZkTest.test-seed#[7E7F568F98BD8F6D]) [    ] o.a.s.s.SolrDispatchFilter / __| ___| |_ _   Starting in cloud mode on port null
   [junit4]   2> 906858 INFO  (TEST-RecoveryZkTest.test-seed#[7E7F568F98BD8F6D]) [    ] o.a.s.s.SolrDispatchFilter \__ \/ _ \ | '_|  Install dir: null
   [junit4]   2> 906858 INFO  (TEST-RecoveryZkTest.test-seed#[7E7F568F98BD8F6D]) [    ] o.a.s.s.SolrDispatchFilter |___/\___/_|_|    Start time: 2016-10-11T02:51:45.996Z
   [junit4]   2> 906860 INFO  (TEST-RecoveryZkTest.test-seed#[7E7F568F98BD8F6D]) [    ] o.a.s.s.SolrDispatchFilter Loading solr.xml from SolrHome (not found in ZooKeeper)
   [junit4]   2> 906860 INFO  (TEST-RecoveryZkTest.test-seed#[7E7F568F98BD8F6D]) [    ] o.a.s.c.SolrXmlConfig Loading container configuration from /x1/jenkins/jenkins-slave/workspace/Lucene-Solr-Tests-master/solr/build/solr-core/test/J0/temp/solr.cloud.RecoveryZkTest_7E7F568F98BD8F6D-001/shard-1-001/solr.xml
   [junit4]   2> 906866 INFO  (TEST-RecoveryZkTest.test-seed#[7E7F568F98BD8F6D]) [    ] o.a.s.c.ZkContainer Zookeeper client=127.0.0.1:38805/solr
   [junit4]   2> 906873 INFO  (TEST-RecoveryZkTest.test-seed#[7E7F568F98BD8F6D]) [n:127.0.0.1:47442_y_dy%2Fb    ] o.a.s.c.c.ZkStateReader Updated live nodes from ZooKeeper... (0) -> (1)
   [junit4]   2> 906876 INFO  (TEST-RecoveryZkTest.test-seed#[7E7F568F98BD8F6D]) [n:127.0.0.1:47442_y_dy%2Fb    ] o.a.s.c.ZkController Register node as live in ZooKeeper:/live_nodes/127.0.0.1:47442_y_dy%2Fb
   [junit4]   2> 906877 INFO  (zkCallback-16666-thread-2-processing-n:127.0.0.1:54440_y_dy%2Fb) [n:127.0.0.1:54440_y_dy%2Fb    ] o.a.s.c.c.ZkStateReader Updated live nodes from ZooKeeper... (1) -> (2)
   [junit4]   2> 906878 INFO  (zkCallback-16670-thread-1) [    ] o.a.s.c.c.ZkStateReader Updated live nodes from ZooKeeper... (1) -> (2)
   [junit4]   2> 906879 INFO  (zkCallback-16675-thread-1-processing-n:127.0.0.1:47442_y_dy%2Fb) [n:127.0.0.1:47442_y_dy%2Fb    ] o.a.s.c.c.ZkStateReader Updated live nodes from ZooKeeper... (1) -> (2)
   [junit4]   2> 906897 INFO  (TEST-RecoveryZkTest.test-seed#[7E7F568F98BD8F6D]) [n:127.0.0.1:47442_y_dy%2Fb    ] o.a.s.c.CorePropertiesLocator Found 1 core definitions underneath /x1/jenkins/jenkins-slave/workspace/Lucene-Solr-Tests-master/solr/build/solr-core/test/J0/../../../../../../../../../../x1/jenkins/jenkins-slave/workspace/Lucene-Solr-Tests-master/solr/build/solr-core/test/J0/temp/solr.cloud.RecoveryZkTest_7E7F568F98BD8F6D-001/shard-1-001/cores
   [junit4]   2> 906897 INFO  (TEST-RecoveryZkTest.test-seed#[7E7F568F98BD8F6D]) [n:127.0.0.1:47442_y_dy%2Fb    ] o.a.s.c.CorePropertiesLocator Cores are: [collection1]
   [junit4]   2> 906899 INFO  (OverseerStateUpdate-96741248478150661-127.0.0.1:54440_y_dy%2Fb-n_0000000000) [n:127.0.0.1:54440_y_dy%2Fb    ] o.a.s.c.o.ReplicaMutator Assigning new node to shard shard=shard1
   [junit4]   2> 907908 INFO  (coreLoadExecutor-6760-thread-1-processing-n:127.0.0.1:47442_y_dy%2Fb) [n:127.0.0.1:47442_y_dy%2Fb c:collection1   x:collection1] o.a.s.c.SolrConfig Using Lucene MatchVersion: 7.0.0
   [junit4]   2> 907917 INFO  (coreLoadExecutor-6760-thread-1-processing-n:127.0.0.1:47442_y_dy%2Fb) [n:127.0.0.1:47442_y_dy%2Fb c:collection1   x:collection1] o.a.s.s.IndexSchema [collection1] Schema name=test
   [junit4]   2> 907975 WARN  (coreLoadExecutor-6760-thread-1-processing-n:127.0.0.1:47442_y_dy%2Fb) [n:127.0.0.1:47442_y_dy%2Fb c:collection1   x:collection1] o.a.s.s.IndexSchema [collection1] default search field in schema is text. WARNING: Deprecated, please use 'df' on request instead.
   [junit4]   2> 907977 INFO  (coreLoadExecutor-6760-thread-1-processing-n:127.0.0.1:47442_y_dy%2Fb) [n:127.0.0.1:47442_y_dy%2Fb c:collection1   x:collection1] o.a.s.s.IndexSchema Loaded schema test/1.6 with uniqueid field id
   [junit4]   2> 907987 INFO  (coreLoadExecutor-6760-thread-1-processing-n:127.0.0.1:47442_y_dy%2Fb) [n:127.0.0.1:47442_y_dy%2Fb c:collection1   x:collection1] o.a.s.c.CoreContainer Creating SolrCore 'collection1' using configuration from collection collection1
   [junit4]   2> 907988 INFO  (coreLoadExecutor-6760-thread-1-processing-n:127.0.0.1:47442_y_dy%2Fb) [n:127.0.0.1:47442_y_dy%2Fb c:collection1 s:shard1 r:core_node1 x:collection1] o.a.s.c.SolrCore [[collection1] ] Opening new SolrCore at [/x1/jenkins/jenkins-slave/workspace/Lucene-Solr-Tests-master/solr/build/solr-core/test/J0/temp/solr.cloud.RecoveryZkTest_7E7F568F98BD8F6D-001/shard-1-001/cores/collection1], dataDir=[/x1/jenkins/jenkins-slave/workspace/Lucene-Solr-Tests-master/solr/build/solr-core/test/J0/../../../../../../../../../../x1/jenkins/jenkins-slave/workspace/Lucene-Solr-Tests-master/solr/build/solr-core/test/J0/temp/solr.cloud.RecoveryZkTest_7E7F568F98BD8F6D-001/shard-1-001/cores/collection1/data/]
   [junit4]   2> 907988 INFO  (coreLoadExecutor-6760-thread-1-processing-n:127.0.0.1:47442_y_dy%2Fb) [n:127.0.0.1:47442_y_dy%2Fb c:collection1 s:shard1 r:core_node1 x:collection1] o.a.s.c.JmxMonitoredMap JMX monitoring is enabled. Adding Solr mbeans to JMX Server: com.sun.jmx.mbeanserver.JmxMBeanServer@28350b32
   [junit4]   2> 907988 INFO  (coreLoadExecutor-6760-thread-1-processing-n:127.0.0.1:47442_y_dy%2Fb) [n:127.0.0.1:47442_y_dy%2Fb c:collection1 s:shard1 r:core_node1 x:collection1] o.a.s.u.RandomMergePolicy RandomMergePolicy wrapping class org.apache.lucene.index.TieredMergePolicy: [TieredMergePolicy: maxMergeAtOnce=38, maxMergeAtOnceExplicit=11, maxMergedSegmentMB=23.482421875, floorSegmentMB=0.6025390625, forceMergeDeletesPctAllowed=20.046041689821777, segmentsPerTier=40.0, maxCFSSegmentSizeMB=8.796093022207999E12, noCFSRatio=0.655467893355304
   [junit4]   2> 907991 WARN  (coreLoadExecutor-6760-thread-1-processing-n:127.0.0.1:47442_y_dy%2Fb) [n:127.0.0.1:47442_y_dy%2Fb c:collection1 s:shard1 r:core_node1 x:collection1] o.a.s.c.RequestHandlers INVALID paramSet a in requestHandler {type = requestHandler,name = /dump,class = DumpRequestHandler,args = {defaults={a=A,b=B}}}
   [junit4]   2> 907997 INFO  (coreLoadExecutor-6760-thread-1-processing-n:127.0.0.1:47442_y_dy%2Fb) [n:127.0.0.1:47442_y_dy%2Fb c:collection1 s:shard1 r:core_node1 x:collection1] o.a.s.u.UpdateHandler Using UpdateLog implementation: org.apache.solr.update.UpdateLog
   [junit4]   2> 907997 INFO  (coreLoadExecutor-6760-thread-1-processing-n:127.0.0.1:47442_y_dy%2Fb) [n:127.0.0.1:47442_y_dy%2Fb c:collection1 s:shard1 r:core_node1 x:collection1] o.a.s.u.UpdateLog Initializing UpdateLog: dataDir= defaultSyncLevel=FLUSH numRecordsToKeep=100 maxNumLogsToKeep=10 numVersionBuckets=65536
   [junit4]   2> 907998 INFO  (coreLoadExecutor-6760-thread-1-processing-n:127.0.0.1:47442_y_dy%2Fb) [n:127.0.0.1:47442_y_dy%2Fb c:collection1 s:shard1 r:core_node1 x:collection1] o.a.s.u.CommitTracker Hard AutoCommit: disabled
   [junit4]   2> 907998 INFO  (coreLoadExecutor-6760-thread-1-processing-n:127.0.0.1:47442_y_dy%2Fb) [n:127.0.0.1:47442_y_dy%2Fb c:collection1 s:shard1 r:core_node1 x:collection1] o.a.s.u.CommitTracker Soft AutoCommit: disabled
   [junit4]   2> 907998 INFO  (coreLoadExecutor-6760-thread-1-processing-n:127.0.0.1:47442_y_dy%2Fb) [n:127.0.0.1:47442_y_dy%2Fb c:collection1 s:shard1 r:core_node1 x:collection1] o.a.s.u.RandomMergePolicy RandomMergePolicy wrapping class org.apache.lucene.index.TieredMergePolicy: [TieredMergePolicy: maxMergeAtOnce=20, maxMergeAtOnceExplicit=32, maxMergedSegmentMB=28.068359375, floorSegmentMB=1.9287109375, forceMergeDeletesPctAllowed=11.84038114255454, segmentsPerTier=20.0, maxCFSSegmentSizeMB=8.796093022207999E12, noCFSRatio=1.0
   [junit4]   2> 907999 INFO  (coreLoadExecutor-6760-thread-1-processing-n:127.0.0.1:47442_y_dy%2Fb) [n:127.0.0.1:47442_y_dy%2Fb c:collection1 s:shard1 r:core_node1 x:collection1] o.a.s.s.SolrIndexSearcher Opening [Searcher@4f3cbc3c[collection1] main]
   [junit4]   2> 907999 INFO  (coreLoadExecutor-6760-thread-1-processing-n:127.0.0.1:47442_y_dy%2Fb) [n:127.0.0.1:47442_y_dy%2Fb c:collection1 s:shard1 r:core_node1 x:collection1] o.a.s.r.ManagedResourceStorage Configured ZooKeeperStorageIO with znodeBase: /configs/conf1
   [junit4]   2> 908002 INFO  (coreLoadExecutor-6760-thread-1-processing-n:127.0.0.1:47442_y_dy%2Fb) [n:127.0.0.1:47442_y_dy%2Fb c:collection1 s:shard1 r:core_node1 x:collection1] o.a.s.r.ManagedResourceStorage Loaded null at path _rest_managed.json using ZooKeeperStorageIO:path=/configs/conf1
   [junit4]   2> 908002 INFO  (coreLoadExecutor-6760-thread-1-processing-n:127.0.0.1:47442_y_dy%2Fb) [n:127.0.0.1:47442_y_dy%2Fb c:collection1 s:shard1 r:core_node1 x:collection1] o.a.s.h.ReplicationHandler Commits will be reserved for  10000
   [junit4]   2> 908002 INFO  (searcherExecutor-6761-thread-1-processing-n:127.0.0.1:47442_y_dy%2Fb x:collection1 s:shard1 c:collection1 r:core_node1) [n:127.0.0.1:47442_y_dy%2Fb c:collection1 s:shard1 r:core_node1 x:collection1] o.a.s.c.SolrCore [collection1] Registered new searcher Searcher@4f3cbc3c[collection1] main{ExitableDirectoryReader(UninvertingDirectoryReader())}
   [junit4]   2> 908003 INFO  (coreLoadExecutor-6760-thread-1-processing-n:127.0.0.1:47442_y_dy%2Fb) [n:127.0.0.1:47442_y_dy%2Fb c:collection1 s:shard1 r:core_node1 x:collection1] o.a.s.u.UpdateLog Could not find max version in index or recent updates, using new clock 1547859978764681216
   [junit4]   2> 908009 INFO  (coreZkRegister-6755-thread-1-processing-n:127.0.0.1:47442_y_dy%2Fb x:collection1 s:shard1 c:collection1 r:core_node1) [n:127.0.0.1:47442_y_dy%2Fb c:collection1 s:shard1 r:core_node1 x:collection1] o.a.s.c.ShardLeaderElectionContext Enough replicas found to continue.
   [junit4]   2> 908009 INFO  (coreZkRegister-6755-thread-1-processing-n:127.0.0.1:47442_y_dy%2Fb x:collection1 s:shard1 c:collection1 r:core_node1) [n:127.0.0.1:47442_y_dy%2Fb c:collection1 s:shard1 r:core_node1 x:collection1] o.a.s.c.ShardLeaderElectionContext I may be the new leader - try and sync
   [junit4]   2> 908009 INFO  (coreZkRegister-6755-thread-1-processing-n:127.0.0.1:47442_y_dy%2Fb x:collection1 s:shard1 c:collection1 r:core_node1) [n:127.0.0.1:47442_y_dy%2Fb c:collection1 s:shard1 r:core_node1 x:collection1] o.a.s.c.SyncStrategy Sync replicas to https://127.0.0.1:47442/y_dy/b/collection1/
   [junit4]   2> 908009 INFO  (coreZkRegister-6755-thread-1-processing-n:127.0.0.1:47442_y_dy%2Fb x:collection1 s:shard1 c:collection1 r:core_node1) [n:127.0.0.1:47442_y_dy%2Fb c:collection1 s:shard1 r:core_node1 x:collection1] o.a.s.c.SyncStrategy Sync Success - now sync replicas to me
   [junit4]   2> 908009 INFO  (coreZkRegister-6755-thread-1-processing-n:127.0.0.1:47442_y_dy%2Fb x:collection1 s:shard1 c:collection1 r:core_node1) [n:127.0.0.1:47442_y_dy%2Fb c:collection1 s:shard1 r:core_node1 x:collection1] o.a.s.c.SyncStrategy https://127.0.0.1:47442/y_dy/b/collection1/ has no replicas
   [junit4]   2> 908012 INFO  (coreZkRegister-6755-thread-1-processing-n:127.0.0.1:47442_y_dy%2Fb x:collection1 s:shard1 c:collection1 r:core_node1) [n:127.0.0.1:47442_y_dy%2Fb c:collection1 s:shard1 r:core_node1 x:collection1] o.a.s.c.ShardLeaderElectionContext I am the new leader: https://127.0.0.1:47442/y_dy/b/collection1/ shard1
   [junit4]   2> 908162 INFO  (coreZkRegister-6755-thread-1-processing-n:127.0.0.1:47442_y_dy%2Fb x:collection1 s:shard1 c:collection1 r:core_node1) [n:127.0.0.1:47442_y_dy%2Fb c:collection1 s:shard1 r:core_node1 x:collection1] o.a.s.c.ZkController I am the leader, no recovery necessary
   [junit4]   2> 908468 INFO  (TEST-RecoveryZkTest.test-seed#[7E7F568F98BD8F6D]) [    ] o.a.s.SolrTestCaseJ4 Writing core.properties file to /x1/jenkins/jenkins-slave/workspace/Lucene-Solr-Tests-master/solr/build/solr-core/test/J0/temp/solr.cloud.RecoveryZkTest_7E7F568F98BD8F6D-001/shard-2-001/cores/collection1
   [junit4]   2> 908469 INFO  (TEST-RecoveryZkTest.test-seed#[7E7F568F98BD8F6D]) [    ] o.a.s.c.AbstractFullDistribZkTestBase create jetty 2 in directory /x1/jenkins/jenkins-slave/workspace/Lucene-Solr-Tests-master/solr/build/solr-core/test/J0/temp/solr.cloud.RecoveryZkTest_7E7F568F98BD8F6D-001/shard-2-001
   [junit4]   2> 908470 INFO  (TEST-RecoveryZkTest.test-seed#[7E7F568F98BD8F6D]) [    ] o.e.j.s.Server jetty-9.3.8.v20160314
   [junit4]   2> 908471 INFO  (TEST-RecoveryZkTest.test-seed#[7E7F568F98BD8F6D]) [    ] o.e.j.s.h.ContextHandler Started o.e.j.s.ServletContextHandler@512d71d2{/y_dy/b,null,AVAILABLE}
   [junit4]   2> 908472 INFO  (TEST-RecoveryZkTest.test-seed#[7E7F568F98BD8F6D]) [    ] o.e.j.s.ServerConnector Started ServerConnector@5cf7b7{SSL,[ssl, http/1.1]}{127.0.0.1:34156}
   [junit4]   2> 908472 INFO  (TEST-RecoveryZkTest.test-seed#[7E7F568F98BD8F6D]) [    ] o.e.j.s.Server Started @910979ms
   [junit4]   2> 908472 INFO  (TEST-RecoveryZkTest.test-seed#[7E7F568F98BD8F6D]) [    ] o.a.s.c.s.e.JettySolrRunner Jetty properties: {solr.data.dir=/x1/jenkins/jenkins-slave/workspace/Lucene-Solr-Tests-master/solr/build/solr-core/test/J0/temp/solr.cloud.RecoveryZkTest_7E7F568F98BD8F6D-001/tempDir-001/jetty2, solrconfig=solrconfig.xml, hostContext=/y_dy/b, hostPort=34156, coreRootDirectory=/x1/jenkins/jenkins-slave/workspace/Lucene-Solr-Tests-master/solr/build/solr-core/test/J0/../../../../../../../../../../x1/jenkins/jenkins-slave/workspace/Lucene-Solr-Tests-master/solr/build/solr-core/test/J0/temp/solr.cloud.RecoveryZkTest_7E7F568F98BD8F6D-001/shard-2-001/cores}
   [junit4]   2> 908473 INFO  (TEST-RecoveryZkTest.test-seed#[7E7F568F98BD8F6D]) [    ] o.a.s.s.SolrDispatchFilter  ___      _       Welcome to Apache Solr? version 7.0.0
   [junit4]   2> 908473 INFO  (TEST-RecoveryZkTest.test-seed#[7E7F568F98BD8F6D]) [    ] o.a.s.s.SolrDispatchFilter / __| ___| |_ _   Starting in cloud mode on port null
   [junit4]   2> 908473 INFO  (TEST-RecoveryZkTest.test-seed#[7E7F568F98BD8F6D]) [    ] o.a.s.s.SolrDispatchFilter \__ \/ _ \ | '_|  Install dir: null
   [junit4]   2> 908473 INFO  (TEST-RecoveryZkTest.test-seed#[7E7F568F98BD8F6D]) [    ] o.a.s.s.SolrDispatchFilter |___/\___/_|_|    Start time: 2016-10-11T02:51:47.611Z
   [junit4]   2> 908475 INFO  (TEST-RecoveryZkTest.test-seed#[7E7F568F98BD8F6D]) [    ] o.a.s.s.SolrDispatchFilter Loading solr.xml from SolrHome (not found in ZooKeeper)
   [junit4]   2> 908475 INFO  (TEST-RecoveryZkTest.test-seed#[7E7F568F98BD8F6D]) [    ] o.a.s.c.SolrXmlConfig Loading container configuration from /x1/jenkins/jenkins-slave/workspace/Lucene-Solr-Tests-master/solr/build/solr-core/test/J0/temp/solr.cloud.RecoveryZkTest_7E7F568F98BD8F6D-001/shard-2-001/solr.xml
   [junit4]   2> 908480 INFO  (TEST-RecoveryZkTest.test-seed#[7E7F568F98BD8F6D]) [    ] o.a.s.c.ZkContainer Zookeeper client=127.0.0.1:38805/solr
   [junit4]   2> 908489 INFO  (TEST-RecoveryZkTest.test-seed#[7E7F568F98BD8F6D]) [n:127.0.0.1:34156_y_dy%2Fb    ] o.a.s.c.c.ZkStateReader Updated live nodes from ZooKeeper... (0) -> (2)
   [junit4]   2> 908491 INFO  (TEST-RecoveryZkTest.test-seed#[7E7F568F98BD8F6D]) [n:127.0.0.1:34156_y_dy%2Fb    ] o.a.s.c.ZkController Register node as live in ZooKeeper:/live_nodes/127.0.0.1:34156_y_dy%2Fb
   [junit4]   2> 908492 INFO  (zkCallback-16670-thread-1) [    ] o.a.s.c.c.ZkStateReader Updated live nodes from ZooKeeper... (2) -> (3)
   [junit4]   2> 908493 INFO  (zkCallback-16675-thread-1-processing-n:127.0.0.1:47442_y_dy%2Fb) [n:127.0.0.1:47442_y_dy%2Fb    ] o.a.s.c.c.ZkStateReader Updated live nodes from ZooKeeper... (2) -> (3)
   [junit4]   2> 908493 INFO  (zkCallback-16681-thread-1-processing-n:127.0.0.1:34156_y_dy%2Fb) [n:127.0.0.1:34156_y_dy%2Fb    ] o.a.s.c.c.ZkStateReader Updated live nodes from ZooKeeper... (2) -> (3)
   [junit4]   2> 908493 INFO  (zkCallback-16666-thread-3-processing-n:127.0.0.1:54440_y_dy%2Fb) [n:127.0.0.1:54440_y_dy%2Fb    ] o.a.s.c.c.ZkStateReader Updated live nodes from ZooKeeper... (2) -> (3)
   [junit4]   2> 908503 INFO  (TEST-RecoveryZkTest.test-seed#[7E7F568F98BD8F6D]) [n:127.0.0.1:34156_y_dy%2Fb    ] o.a.s.c.CorePropertiesLocator Found 1 core definitions underneath /x1/jenkins/jenkins-slave/workspace/Lucene-Solr-Tests-master/solr/build/solr-core/test/J0/../../../../../../../../../../x1/jenkins/jenkins-slave/workspace/Lucene-Solr-Tests-master/solr/build/solr-core/test/J0/temp/solr.cloud.RecoveryZkTest_7E7F568F98BD8F6D-001/shard-2-001/cores
   [junit4]   2> 908503 INFO  (TEST-RecoveryZkTest.test-seed#[7E7F568F98BD8F6D]) [n:127.0.0.1:34156_y_dy%2Fb    ] o.a.s.c.CorePropertiesLocator Cores are: [collection1]
   [junit4]   2> 908505 INFO  (OverseerStateUpdate-96741248478150661-127.0.0.1:54440_y_dy%2Fb-n_0000000000) [n:127.0.0.1:54440_y_dy%2Fb    ] o.a.s.c.o.ReplicaMutator Assigning new node to shard shard=shard1
   [junit4]   2> 909513 INFO  (coreLoadExecutor-6771-thread-1-processing-n:127.0.0.1:34156_y_dy%2Fb) [n:127.0.0.1:34156_y_dy%2Fb c:collection1   x:collection1] o.a.s.c.SolrConfig Using Lucene MatchVersion: 7.0.0
   [junit4]   2> 909523 INFO  (coreLoadExecutor-6771-thread-1-processing-n:127.0.0.1:34156_y_dy%2Fb) [n:127.0.0.1:34156_y_dy%2Fb c:collection1   x:collection1] o.a.s.s.IndexSchema [collection1] Schema name=test
   [junit4]   2> 909579 WARN  (coreLoadExecutor-6771-thread-1-processing-n:127.0.0.1:34156_y_dy%2Fb) [n:127.0.0.1:34156_y_dy%2Fb c:collection1   x:collection1] o.a.s.s.IndexSchema [collection1] default search field in schema is text. WARNING: Deprecated, please use 'df' on request instead.
   [junit4]   2> 909581 INFO  (coreLoadExecutor-6771-thread-1-processing-n:127.0.0.1:34156_y_dy%2Fb) [n:127.0.0.1:34156_y_dy%2Fb c:collection1   x:collection1] o.a.s.s.IndexSchema Loaded schema test/1.6 with uniqueid field id
   [junit4]   2> 909595 INFO  (coreLoadExecutor-6771-thread-1-processing-n:127.0.0.1:34156_y_dy%2Fb) [n:127.0.0.1:34156_y_dy%2Fb c:collection1   x:collection1] o.a.s.c.CoreContainer Creating SolrCore 'collection1' using configuration from collection collection1
   [junit4]   2> 909595 INFO  (coreLoadExecutor-6771-thread-1-processing-n:127.0.0.1:34156_y_dy%2Fb) [n:127.0.0.1:34156_y_dy%2Fb c:collection1 s:shard1 r:core_node2 x:collection1] o.a.s.c.SolrCore [[collection1] ] Opening new SolrCore at [/x1/jenkins/jenkins-slave/workspace/Lucene-Solr-Tests-master/solr/build/solr-core/test/J0/temp/solr.cloud.RecoveryZkTest_7E7F568F98BD8F6D-001/shard-2-001/cores/collection1], dataDir=[/x1/jenkins/jenkins-slave/workspace/Lucene-Solr-Tests-master/solr/build/solr-core/test/J0/../../../../../../../../../../x1/jenkins/jenkins-slave/workspace/Lucene-Solr-Tests-master/solr/build/solr-core/test/J0/temp/solr.cloud.RecoveryZkTest_7E7F568F98BD8F6D-001/shard-2-001/cores/collection1/data/]
   [junit4]   2> 909595 INFO  (coreLoadExecutor-6771-thread-1-processing-n:127.0.0.1:34156_y_dy%2Fb) [n:127.0.0.1:34156_y_dy%2Fb c:collection1 s:shard1 r:core_node2 x:collection1] o.a.s.c.JmxMonitoredMap JMX monitoring is enabled. Adding Solr mbeans to JMX Server: com.sun.jmx.mbeanserver.JmxMBeanServer@28350b32
   [junit4]   2> 909596 INFO  (coreLoadExecutor-6771-thread-1-processing-n:127.0.0.1:34156_y_dy%2Fb) [n:127.0.0.1:34156_y_dy%2Fb c:collection1 s:shard1 r:core_node2 x:collection1] o.a.s.u.RandomMergePolicy RandomMergePolicy wrapping class org.apache.lucene.index.TieredMergePolicy: [TieredMergePolicy: maxMergeAtOnce=38, maxMergeAtOnceExplicit=11, maxMergedSegmentMB=23.482421875, floorSegmentMB=0.6025390625, forceMergeDeletesPctAllowed=20.046041689821777, segmentsPerTier=40.0, maxCFSSegmentSizeMB=8.796093022207999E12, noCFSRatio=0.655467893355304
   [junit4]   2> 909599 WARN  (coreLoadExecutor-6771-thread-1-processing-n:127.0.0.1:34156_y_dy%2Fb) [n:127.0.0.1:34156_y_dy%2Fb c:collection1 s:shard1 r:core_node2 x:collection1] o.a.s.c.RequestHandlers INVALID paramSet a in requestHandler {type = requestHandler,name = /dump,class = DumpRequestHandler,args = {defaults={a=A,b=B}}}
   [junit4]   2> 909605 INFO  (coreLoadExecutor-6771-thread-1-processing-n:127.0.0.1:34156_y_dy%2Fb) [n:127.0.0.1:34156_y_dy%2Fb c:collection1 s:shard1 r:core_node2 x:collection1] o.a.s.u.UpdateHandler Using UpdateLog implementation: org.apache.solr.update.UpdateLog
   [junit4]   2> 909606 INFO  (coreLoadExecutor-6771-thread-1-processing-n:127.0.0.1:34156_y_dy%2Fb) [n:127.0.0.1:34156_y_dy%2Fb c:collection1 s:shard1 r:core_node2 x:collection1] o.a.s.u.UpdateLog Initializing UpdateLog: dataDir= defaultSyncLevel=FLUSH numRecordsToKeep=100 maxNumLogsToKeep=10 numVersionBuckets=65536
   [junit4]   2> 909606 INFO  (coreLoadExecutor-6771-thread-1-processing-n:127.0.0.1:34156_y_dy%2Fb) [n:127.0.0.1:34156_y_dy%2Fb c:collection1 s:shard1 r:core_node2 x:collection1] o.a.s.u.CommitTracker Hard AutoCommit: disabled
   [junit4]   2> 909606 INFO  (coreLoadExecutor-6771-thread-1-processing-n:127.0.0.1:34156_y_dy%2Fb) [n:127.0.0.1:34156_y_dy%2Fb c:collection1 s:shard1 r:core_node2 x:collection1] o.a.s.u.CommitTracker Soft AutoCommit: disabled
   [junit4]   2> 909607 INFO  (coreLoadExecutor-6771-thread-1-processing-n:127.0.0.1:34156_y_dy%2Fb) [n:127.0.0.1:34156_y_dy%2Fb c:collection1 s:shard1 r:core_node2 x:collection1] o.a.s.u.RandomMergePolicy RandomMergePolicy wrapping class org.apache.lucene.index.TieredMergePolicy: [TieredMergePolicy: maxMergeAtOnce=20, maxMergeAtOnceExplicit=32, maxMergedSegmentMB=28.068359375, floorSegmentMB=1.9287109375, forceMergeDeletesPctAllowed=11.84038114255454, segmentsPerTier=20.0, maxCFSSegmentSizeMB=8.796093022207999E12, noCFSRatio=1.0
   [junit4]   2> 909607 INFO  (coreLoadExecutor-6771-thread-1-processing-n:127.0.0.1:34156_y_dy%2Fb) [n:127.0.0.1:34156_y_dy%2Fb c:collection1 s:shard1 r:core_node2 x:collection1] o.a.s.s.SolrIndexSearcher Opening [Searcher@27a5407c[collection1] main]
   [junit4]   2> 909608 INFO  (coreLoadExecutor-6771-thread-1-processing-n:127.0.0.1:34156_y_dy%2Fb) [n:127.0.0.1:34156_y_dy%2Fb c:collection1 s:shard1 r:core_node2 x:collection1] o.a.s.r.ManagedResourceStorage Configured ZooKeeperStorageIO with znodeBase: /configs/conf1
   [junit4]   2> 909608 INFO  (coreLoadExecutor-6771-thread-1-processing-n:127.0.0.1:34156_y_dy%2Fb) [n:127.0.0.1:34156_y_dy%2Fb c:collection1 s:shard1 r:core_node2 x:collection1] o.a.s.r.ManagedResourceStorage Loaded null at path _rest_managed.json using ZooKeeperStorageIO:path=/configs/conf1
   [junit4]   2> 909608 INFO  (coreLoadExecutor-6771-thread-1-processing-n:127.0.0.1:34156_y_dy%2Fb) [n:127.0.0.1:34156_y_dy%2Fb c:collection1 s:shard1 r:core_node2 x:collection1] o.a.s.h.ReplicationHandler Commits will be reserved for  10000
   [junit4]   2> 909609 INFO  (searcherExecutor-6772-thread-1-processing-n:127.0.0.1:34156_y_dy%2Fb x:collection1 s:shard1 c:collection1 r:core_node2) [n:127.0.0.1:34156_y_dy%2Fb c:collection1 s:shard1 r:core_node2 x:collection1] o.a.s.c.SolrCore [collection1] Registered new searcher Searcher@27a5407c[collection1] main{ExitableDirectoryReader(UninvertingDirectoryReader())}
   [junit4]   2> 909609 INFO  (coreLoadExecutor-6771-thread-1-processing-n:127.0.0.1:34156_y_dy%2Fb) [n:127.0.0.1:34156_y_dy%2Fb c:collection1 s:shard1 r:core_node2 x:collection1] o.a.s.u.UpdateLog Could not find max version in index or recent updates, using new clock 1547859980448694272
   [junit4]   2> 909612 INFO  (coreZkRegister-6766-thread-1-processing-n:127.0.0.1:34156_y_dy%2Fb x:collection1 s:shard1 c:collection1 r:core_node2) [n:127.0.0.1:34156_y_dy%2Fb c:collection1 s:shard1 r:core_node2 x:collection1] o.a.s.c.ZkController Core needs to recover:collection1
   [junit4]   2> 909613 INFO  (updateExecutor-16678-thread-1-processing-n:127.0.0.1:34156_y_dy%2Fb x:collection1 s:shard1 c:collection1 r:core_node2) [n:127.0.0.1:34156_y_dy%2Fb c:collection1 s:shard1 r:core_node2 x:collection1] o.a.s.u.DefaultSolrCoreState Running recovery
   [junit4]   2> 909613 INFO  (recoveryExecutor-16679-thread-1-processing-n:127.0.0.1:34156_y_dy%2Fb x:collection1 s:shard1 c:collection1 r:core_node2) [n:127.0.0.1:34156_y_dy%2Fb c:collection1 s:shard1 r:core_node2 x:collection1] o.a.s.c.RecoveryStrategy Starting recovery process. recoveringAfterStartup=true
   [junit4]   2> 909613 INFO  (recoveryExecutor-16679-thread-1-processing-n:127.0.0.1:34156_y_dy%2Fb x:collection1 s:shard1 c:collection1 r:core_node2) [n:127.0.0.1:34156_y_dy%2Fb c:collection1 s:shard1 r:core_node2 x:collection1] o.a.s.c.RecoveryStrategy ###### startupVersions=[[]]
   [junit4]   2> 909613 INFO  (recoveryExecutor-16679-thread-1-processing-n:127.0.0.1:34156_y_dy%2Fb x:collection1 s:shard1 c:collection1 r:core_node2) [n:127.0.0.1:34156_y_dy%2Fb c:collection1 s:shard1 r:core_node2 x:collection1] o.a.s.c.RecoveryStrategy Begin buffering updates. core=[collection1]
   [junit4]   2> 909613 INFO  (recoveryExecutor-16679-thread-1-processing-n:127.0.0.1:34156_y_dy%2Fb x:collection1 s:shard1 c:collection1 r:core_node2) [n:127.0.0.1:34156_y_dy%2Fb c:collection1 s:shard1 r:core_node2 x:collection1] o.a.s.u.UpdateLog Starting to buffer updates. FSUpdateLog{state=ACTIVE, tlog=null}
   [junit4]   2> 909613 INFO  (recoveryExecutor-16679-thread-1-processing-n:127.0.0.1:34156_y_dy%2Fb x:collection1 s:shard1 c:collection1 r:core_node2) [n:127.0.0.1:34156_y_dy%2Fb c:collection1 s:shard1 r:core_node2 x:collection1] o.a.s.c.RecoveryStrategy Publishing state of core [collection1] as recovering, leader is [https://127.0.0.1:47442/y_dy/b/collection1/] and I am [https://127.0.0.1:34156/y_dy/b/collection1/]
   [junit4]   2> 909614 INFO  (recoveryExecutor-16679-thread-1-processing-n:127.0.0.1:34156_y_dy%2Fb x:collection1 s:shard1 c:collection1 r:core_node2) [n:127.0.0.1:34156_y_dy%2Fb c:collection1 s:shard1 r:core_node2 x:collection1] o.a.s.c.RecoveryStrategy Sending prep recovery command to [https://127.0.0.1:47442/y_dy/b]; [WaitForState: action=PREPRECOVERY&core=collection1&nodeName=127.0.0.1:34156_y_dy%252Fb&coreNodeName=core_node2&state=recovering&checkLive=true&onlyIfLeader=true&onlyIfLeaderActive=true]
   [junit4]   2> 909641 INFO  (qtp469166410-69648) [n:127.0.0.1:47442_y_dy%2Fb    ] o.a.s.h.a.PrepRecoveryOp Going to wait for coreNodeName: core_node2, state: recovering, checkLive: true, onlyIfLeader: true, onlyIfLeaderActive: true
   [junit4]   2> 909642 INFO  (qtp469166410-69648) [n:127.0.0.1:47442_y_dy%2Fb    ] o.a.s.h.a.PrepRecoveryOp Will wait a max of 183 seconds to see collection1 (shard1 of collection1) have state: recovering
   [junit4]   2> 909642 INFO  (qtp469166410-69648) [n:127.0.0.1:47442_y_dy%2Fb    ] o.a.s.h.a.PrepRecoveryOp In WaitForState(recovering): collection=collection1, shard=shard1, thisCore=collection1, leaderDoesNotNeedRecovery=false, isLeader? true, live=true, checkLive=true, currentState=down, localState=active, nodeName=127.0.0.1:34156_y_dy%2Fb, coreNodeName=core_node2, onlyIfActiveCheckResult=false, nodeProps: core_node2:{"core":"collection1","base_url":"https://127.0.0.1:34156/y_dy/b","node_name":"127.0.0.1:34156_y_dy%2Fb","state":"down"}
   [junit4]   2> 910006 INFO  (TEST-RecoveryZkTest.test-seed#[7E7F568F98BD8F6D]) [    ] o.a.s.SolrTestCaseJ4 ###Starting test
   [junit4]   2> 910039 INFO  (qtp662220242-69605) [n:127.0.0.1:54440_y_dy%2Fb c:control_collection s:shard1 r:core_node1 x:collection1] o.a.s.u.p.LogUpdateProcessorFactory [collection1]  webapp=/y_dy/b path=/update params={wt=javabin&version=2&CONTROL=TRUE}{add=[1-0 (1547859980897484800)]} 0 1
   [junit4]   2> 910044 INFO  (qtp662220242-69609) [n:127.0.0.1:54440_y_dy%2Fb c:control_collection s:shard1 r:core_node1 x:collection1] o.a.s.u.p.LogUpdateProcessorFactory [collection1]  webapp=/y_dy/b path=/update params={wt=javabin&version=2&CONTROL=TRUE}{add=[2-0 (1547859980903776256)]} 0 0
   [junit4]   2> 910071 INFO  (qtp1498716135-69675) [n:127.0.0.1:34156_y_dy%2Fb c:collection1 s:shard1 r:core_node2 x:collection1] o.a.s.u.p.LogUpdateProcessorFactory [collection1]  webapp=/y_dy/b path=/update params={update.distrib=FROMLEADER&distrib.from=https://127.0.0.1:47442/y_dy/b/collection1/&wt=javabin&version=2}{add=[1-0 (1547859980903776256)]} 0 1
   [junit4]   2> 910072 INFO  (qtp469166410-69645) [n:127.0.0.1:47442_y_dy%2Fb c:collection1 s:shard1 r:core_node1 x:collection1] o.a.s.u.p.LogUpdateProcessorFactory [collection1]  webapp=/y_dy/b path=/update params={wt=javabin&version=2}{add=[1-0 (1547859980903776256)]} 0 30
   [junit4]   2> 910073 INFO  (qtp662220242-69611) [n:127.0.0.1:54440_y_dy%2Fb c:control_collection s:shard1 r:core_node1 x:collection1] o.a.s.u.p.LogUpdateProcessorFactory [collection1]  webapp=/y_dy/b path=/update params={wt=javabin&version=2&CONTROL=TRUE}{add=[1-1 (1547859980935233536)]} 0 0
   [junit4]   2> 910078 INFO  (qtp1498716135-69674) [n:127.0.0.1:34156_y_dy%2Fb c:collection1 s:shard1 r:core_node2 x:collection1] o.a.s.u.p.LogUpdateProcessorFactory [collection1]  webapp=/y_dy/b path=/update params={update.distrib=FROMLEADER&distrib.from=https://127.0.0.1:47442/y_dy/b/collection1/&wt=javabin&version=2}{add=[1-1 (1547859980936282112)]} 0 0
   [junit4]   2> 910079 INFO  (qtp469166410-69646) [n:127.0.0.1:47442_y_dy%2Fb c:collection1 s:shard1 r:core_node1 x:collection1] o.a.s.u.p.LogUpdateProcessorFactory [collection1]  webapp=/y_dy/b path=/update params={wt=javabin&version=2}{add=[1-1 (1547859980936282112)]} 0 4
   [junit4]   2> 910079 INFO  (qtp1498716135-69671) [n:127.0.0.1:34156_y_dy%2Fb c:collection1 s:shard1 r:core_node2 x:collection1] o.a.s.u.p.LogUpdateProcessorFactory [collection1]  webapp=/y_dy/b path=/update params={update.distrib=FROMLEADER&distrib.from=https://127.0.0.1:47442/y_dy/b/collection1/&wt=javabin&version=2}{add=[2-0 (1547859980912164864)]} 0 0
   [junit4]   2> 910079 INFO  (qtp469166410-69642) [n:127.0.0.1:47442_y_dy%2Fb c:collection1 s:shard1 r:core_node1 x:collection1] o.a.s.u.p.LogUpdateProcessorFactory [collection1]  webapp=/y_dy/b path=/update params={wt=javabin&version=2}{add=[2-0 (1547859980912164864)]} 0 28
   [junit4]   2> 910080 INFO  (qtp662220242-69610) [n:127.0.0.1:54440_y_dy%2Fb c:control_collection s:shard1 r:core_node1 x:collection1] o.a.s.u.p.LogUpdateProcessorFactory [collection1]  webapp=/y_dy/b path=/update params={wt=javabin&version=2&CONTROL=TRUE}{add=[1-2 (1547859980941524992)]} 0 1
   [junit4]   2> 910081 INFO  (qtp662220242-69608) [n:127.0.0.1:54440_y_dy%2Fb c:control_collection s:shard1 r:core_node1 x:collection1] o.a.s.u.p.LogUpdateProcessorFactory [collection1]  webapp=/y_dy/b path=/update params={wt=javabin&version=2&CONTROL=TRUE}{add=[2-1 (1547859980943622144)]} 0 0
   [junit4]   2> 910083 INFO  (qtp1498716135-69677) [n:127.0.0.1:34156_y_dy%2Fb c:collection1 s:shard1 r:core_node2 x:collection1] o.a.s.u.p.LogUpdateProcessorFactory [collection1]  webapp=/y_dy/b path=/update params={update.distrib=FROMLEADER&distrib.from=https://127.0.0.1:47442/y_dy/b/collection1/&wt=javabin&version=2}{add=[2-1 (1547859980944670720)]} 0 0
   [junit4]   2> 910083 INFO  (qtp1498716135-69676) [n:127.0.0.1:34156_y_dy%2Fb c:collection1 s:shard1 r:core_node2 x:collection1] o.a.s.u.p.LogUpdateProcessorFactory [collection1]  webapp=/y_dy/b path=/update params={update.distrib=FROMLEADER&distrib.from=https://127.0.0.1:47442/y_dy/b/collection1/&wt=javabin&version=2}{add=[1-2 (1547859980944670721)]} 0 0
   [junit4]   2> 910083 INFO  (qtp469166410-69643) [n:127.0.0.1:47442_y_dy%2Fb c:collection1 s:shard1 r:core_node1 x:collection1] o.a.s.u.p.LogUpdateProcessorFactory [collection1]  webapp=/y_dy/b path=/update params={wt=javabin&version=2}{add=[2-1 (1547859980944670720)]} 0 1
   [junit4]   2> 910083 INFO  (qtp469166410-69647) [n:127.0.0.1:47442_y_dy%2Fb c:collection1 s:shard1 r:core_node1 x:collection1] o.a.s.u.p.LogUpdateProcessorFactory [collection1]  webapp=/y_dy/b path=/update params={wt=javabin&version=2}{add=[1-2 (1547859980944670721)]} 0 1
   [junit4]   2> 910084 INFO  (qtp662220242-69605) [n:127.0.0.1:54440_y_dy%2Fb c:control_collection s:shard1 r:core_node1 x:collection1] o.a.s.u.p.LogUpdateProcessorFactory [collection1]  webapp=/y_dy/b path=/update params={wt=javabin&version=2&CONTROL=TRUE}{delete=[1-1 (-1547859980946767873)]} 0 0
   [junit4]   2> 910084 INFO  (qtp662220242-69612) [n:127.0.0.1:54440_y_dy%2Fb c:control_collection s:shard1 r:core_node1 x:collection1] o.a.s.u.p.LogUpdateProcessorFactory [collection1]  webapp=/y_dy/b path=/update params={wt=javabin&version=2&CONTROL=TRUE}{add=[2-2 (1547859980946767872)]} 0 0
   [junit4]   2> 910085 INFO  (qtp1498716135-69675) [n:127.0.0.1:34156_y_dy%2Fb c:collection1 s:shard1 r:core_node2 x:collection1] o.a.s.u.p.LogUpdateProcessorFactory [collection1]  webapp=/y_dy/b path=/update params={update.distrib=FROMLEADER&distrib.from=https://127.0.0.1:47442/y_dy/b/collection1/&wt=javabin&version=2}{delete=[1-1 (-1547859980946767872)]} 0 0
   [junit4]   2> 910085 INFO  (qtp469166410-69645) [n:127.0.0.1:47442_y_dy%2Fb c:collection1 s:shard1 r:core_node1 x:collection1] o.a.s.u.p.LogUpdateProcessorFactory [collection1]  webapp=/y_dy/b path=/update params={wt=javabin&version=2}{delete=[1-1 (-1547859980946767872)]} 0 0
   [junit4]   2> 910085 INFO  (qtp1498716135-69673) [n:127.0.0.1:34156_y_dy%2Fb c:collection1 s:shard1 r:core_node2 x:collection1] o.a.s.u.p.LogUpdateProcessorFactory [collection1]  webapp=/y_dy/b path=/update params={update.distrib=FROMLEADER&distrib.from=https://127.0.0.1:47442/y_dy/b/collection1/&wt=javabin&version=2}{add=[2-2 (1547859980947816448)]} 0 0
   [junit4]   2> 910086 INFO  (qtp662220242-69606) [n:127.0.0.1:54440_y_dy%2Fb c:control_collection s:shard1 r:core_node1 x:collection1] o.a.s.u.p.LogUpdateProcessorFactory [collection1]  webapp=/y_dy/b path=/update params={wt=javabin&version=2&CONTROL=TRUE}{add=[1-3 (1547859980948865024)]} 0 0
   [junit4]   2> 910087 INFO  (qtp469166410-69646) [n:127.0.0.1:47442_y_dy%2Fb c:collection1 s:shard1 r:core_node1 x:collection1] o.a.s.u.p.LogUpdateProcessorFactory [collection1]  webapp=/y_dy/b path=/update params={wt=javabin&version=2}{add=[2-2 (1547859980947816448)]} 0 1
   [junit4]   2> 910087 INFO  (qtp1498716135-69674) [n:127.0.0.1:34156_y_dy%2Fb c:collection1 s:shard1 r:core_node2 x:collection1] o.a.s.u.p.LogUpdateProcessorFactory [collection1]  webapp=/y_dy/b path=/update params={update.distrib=FROMLEADER&distrib.from=https://127.0.0.1:47442/y_dy/b/collection1/&wt=javabin&version=2}{add=[1-3 (1547859980948865024)]} 0 0
   [junit4]   2> 910087 INFO  (qtp469166410-69642) [n:127.0.0.1:47442_y_dy%2Fb c:collection1 s:shard1 r:core_node1 x:collection1] o.a.s.u.p.LogUpdateProcessorFactory [collection1]  webapp=/y_dy/b path=/update params={wt=javabin&version=2}{add=[1-3 (1547859980948865024)]} 0 0
   [junit4]   2> 910087 INFO  (qtp662220242-69611) [n:127.0.0.1:54440_y_dy%2Fb c:control_collection s:shard1 r:core_node1 x:collection1] o.a.s.u.p.LogUpdateProcessorFactory [collection1]  webapp=/y_dy/b path=/update params={wt=javabin&version=2&CONTROL=TRUE}{delete=[2-1 (-1547859980949913600)]} 0 0
   [junit4]   2> 910088 INFO  (qtp662220242-69611) [n:127.0.0.1:54440_y_dy%2Fb c:control_collection s:shard1 r:core_node1 x:collection1] o.a.s.u.p.LogUpdateProcessorFactory [collection1]  webapp=/y_dy/b path=/update params={wt=javabin&version=2&CONTROL=TRUE}{add=[1-4 (1547859980950962176)]} 0 0
   [junit4]   2> 910088 INFO  (qtp1498716135-69674) [n:127.0.0.1:34156_y_dy%2Fb c:collection1 s:shard1 r:core_node2 x:collection1] o.a.s.u.p.LogUpdateProcessorFactory [collection1]  webapp=/y_dy/b path=/update params={update.distrib=FROMLEADER&distrib.from=https://127.0.0.1:47442/y_dy/b/collection1/&wt=javabin&version=2}{delete=[2-1 (-1547859980950962176)]} 0 0
   [junit4]   2> 910088 INFO  (qtp469166410-69643) [n:127.0.0.1:47442_y_dy%2Fb c:collection1 s:shard1 r:core_node1 x:collection1] o.a.s.u.p.LogUpdateProcessorFactory [collection1]  webapp=/y_dy/b path=/update params={wt=javabin&version=2}{delete=[2-1 (-1547859980950962176)]} 0 0
   [junit4]   2> 910089 INFO  (qtp1498716135-69674) [n:127.0.0.1:34156_y_dy%2Fb c:collection1 s:shard1 r:core_node2 x:collection1] o.a.s.u.p.LogUpdateProcessorFactory [collection1]  webapp=/y_dy/b path=/update params={update.distrib=FROMLEADER&distrib.from=https://127.0.0.1:47442/y_dy/b/collection1/&wt=javabin&version=2}{add=[1-4 (1547859980952010752)]} 0 0
   [junit4]   2> 910089 INFO  (qtp662220242-69611) [n:127.0.0.1:54440_y_dy%2Fb c:control_collection s:shard1 r:core_node1 x:collection1] o.a.s.u.p.LogUpdateProcessorFactory [collection1]  webapp=/y_dy/b path=/update params={wt=javabin&version=2&CONTROL=TRUE}{add=[2-3 (1547859980952010752)]} 0 0
   [junit4]   2> 910089 INFO  (qtp469166410-69643) [n:127.0.0.1:47442_y_dy%2Fb c:collection1 s:shard1 r:core_node1 x:collection1] o.a.s.u.p.LogUpdateProcessorFactory [collection1]  webapp=/y_dy/b path=/update params={wt=javabin&version=2}{add=[1-4 (1547859980952010752)]} 0 0
   [junit4]   2> 910091 INFO  (qtp662220242-69611) [n:127.0.0.1:54440_y_dy%2Fb c:control_collection s:shard1 r:core_node1 x:collection1] o.a.s.u.p.LogUpdateProcessorFactory [collection1]  webapp=/y_dy/b path=/update params={wt=javabin&version=2&CONTROL=TRUE}{delete=[1-2 (-1547859980954107904)]} 0 0
   [junit4]   2> 910091 INFO  (qtp1498716135-69676) [n:127.0.0.1:34156_y_dy%2Fb c:collection1 s:shard1 r:core_node2 x:collection1] o.a.s.u.p.LogUpdateProcessorFactory [collection1]  webapp=/y_dy/b path=/update params={update.distrib=FROMLEADER&distrib.from=https://127.0.0.1:47442/y_dy/b/collection1/&wt=javabin&version=2}{add=[2-3 (1547859980954107904)]} 0 0
   [junit4]   2> 910091 INFO  (qtp469166410-69647) [n:127.0.0.1:47442_y_dy%2Fb c:collection1 s:shard1 r:core_node1 x:collection1] o.a.s.u.p.LogUpdateProcessorFactory [collection1]  webapp=/y_dy/b path=/update params={wt=javabin&version=2}{add=[2-3 (1547859980954107904)]} 0 0
   [junit4]   2> 910093 INFO  (qtp1498716135-69676) [n:127.0.0.1:34156_y_dy%2Fb c:collection1 s:shard1 r:core_node2 x:collection1] o.a.s.u.p.LogUpdateProcessorFactory [collection1]  webapp=/y_dy/b path=/update params={update.distrib=FROMLEADER&distrib.from=https://127.0.0.1:47442/y_dy/b/collection1/&wt=javabin&version=2}{delete=[1-2 (-1547859980956205056)]} 0 0
   [junit4]   2> 910093 INFO  (qtp662220242-69609) [n:127.0.0.1:54440_y_dy%2Fb c:control_collection s:shard1 r:core_node1 x:collection1] o.a.s.u.p.LogUpdateProcessorFactory [collection1]  webapp=/y_dy/b path=/update params={wt=javabin&version=2&CONTROL=TRUE}{add=[2-4 (1547859980956205056)]} 0 0
   [junit4]   2> 910093 INFO  (qtp469166410-69645) [n:127.0.0.1:47442_y_dy%2Fb c:collection1 s:shard1 r:core_node1 x:collection1] o.a.s.u.p.LogUpdateProcessorFactory [collection1]  webapp=/y_dy/b path=/update params={wt=javabin&version=2}{delete=[1-2 (-1547859980956205056)]} 0 0
   [junit4]   2> 910094 INFO  (qtp662220242-69606) [n:127.0.0.1:54440_y_dy%2Fb c:control_collection s:shard1 r:core_node1 x:collection1] o.a.s.u.p.LogUpdateProcessorFactory [collection1]  webapp=/y_dy/b path=/update params={wt=javabin&version=2&CONTROL=TRUE}{add=[1-5 (1547859980957253632)]} 0 0
   [junit4]   2> 910094 INFO  (qtp1498716135-69676) [n:127.0.0.1:34156_y_dy%2Fb c:collection1 s:shard1 r:core_node2 x:collection1] o.a.s.u.p.LogUpdateProcessorFactory [collection1]  webapp=/y_dy/b path=/update params={update.distrib=FROMLEADER&distrib.from=https://127.0.0.1:47442/y_dy/b/collection1/&wt=javabin&version=2}{add=[2-4 (1547859980957253632)]} 0 0
   [junit4]   2> 910094 INFO  (qtp469166410-69647) [n:127.0.0.1:47442_y_dy%2Fb c:collection1 s:shard1 r:core_node1 x:collection1] o.a.s.u.p.LogUpdateProcessorFactory [collection1]  webapp=/y_dy/b path=/update params={wt=javabin&version=2}{add=[2-4 (1547859980957253632)]} 0 0
   [junit4]   2> 910096 INFO  (qtp1498716135-69677) [n:127.0.0.1:34156_y_dy%2Fb c:collection1 s:shard1 r:core_node2 x:collection1] o.a.s.u.p.LogUpdateProcessorFactory [collection1]  webapp=/y_dy/b path=/update params={update.distrib=FROMLEADER&distrib.from=https://127.0.0.1:47442/y_dy/b/collection1/&wt=javabin&version=2}{add=[1-5 (1547859980957253633)]} 0 0
   [junit4]   2> 910096 INFO  (qtp662220242-69610) [n:127.0.0.1:54440_y_dy%2Fb c:control_collection s:shard1 r:core_node1 x:collection1] o.a.s.u.p.LogUpdateProcessorFactory [collection1]  webapp=/y_dy/b path=/update params={wt=javabin&version=2&CONTROL=TRUE}{delete=[2-2 (-1547859980959350784)]} 0 0
   [junit4]   2> 910096 INFO  (qtp469166410-69642) [n:127.0.0.1:47442_y_dy%2Fb c:collection1 s:shard1 r:core_node1 x:collection1] o.a.s.u.p.LogUpdateProcessorFactory [collection1]  webapp=/y_dy/b path=/update params={wt=javabin&version=2}{add=[1-5 (1547859980957253633)]} 0 1
   [junit4]   2> 910097 INFO  (qtp662220242-69610) [n:127.0.0.1:54440_y_dy%2Fb c:control_collection s:shard1 r:core_node1 x:collection1] o.a.s.u.p.LogUpdateProcessorFactory [collection1]  webapp=/y_dy/b path=/update params={wt=javabin&version=2&CONTROL=TRUE}{delete=[1-3 (-1547859980959350785)]} 0 0
   [junit4]   2> 910097 INFO  (qtp1498716135-69677) [n:127.0.0.1:34156_y_dy%2Fb c:collection1 s:shard1 r:core_node2 x:collection1] o.a.s.u.p.LogUpdateProcessorFactory [collection1]  webapp=/y_dy/b path=/update params={update.distrib=FROMLEADER&distrib.from=https://127.0.0.1:47442/y_dy/b/collection1/&wt=javabin&version=2}{delete=[2-2 (-1547859980959350784)]} 0 0
   [junit4]   2> 910097 INFO  (qtp469166410-69643) [n:127.0.0.1:47442_y_dy%2Fb c:collection1 s:shard1 r:core_node1 x:collection1] o.a.s.u.p.LogUpdateProcessorFactory [collection1]  webapp=/y_dy/b path=/update params={wt=javabin&version=2}{delete=[2-2 (-1547859980959350784)]} 0 0
   [junit4]   2> 910097 INFO  (qtp1498716135-69677) [n:127.0.0.1:34156_y_dy%2Fb c:collection1 s:shard1 r:core_node2 x:collection1] o.a.s.u.p.LogUpdateProcessorFactory [collection1]  webapp=/y_dy/b path=/update params={update.distrib=FROMLEADER&distrib.from=https://127.0.0.1:47442/y_dy/b/collection1/&wt=javabin&version=2}{delete=[1-3 (-1547859980960399360)]} 0 0
   [junit4]   2> 910097 INFO  (qtp469166410-69646) [n:127.0.0.1:47442_y_dy%2Fb c:collection1 s:shard1 r:core_node1 x:collection1] o.a.s.u.p.LogUpdateProcessorFactory [collection1]  webapp=/y_dy/b path=/update params={wt=javabin&version=2}{delete=[1-3 (-1547859980960399360)]} 0 0
   [junit4]   2> 910098 INFO  (qtp662220242-69612) [n:127.0.0.1:54440_y_dy%2Fb c:control_collection s:shard1 r:core_node1 x:collection1] o.a.s.u.p.LogUpdateProcessorFactory [collection1]  webapp=/y_dy/b path=/update params={wt=javabin&version=2&CONTROL=TRUE}{add=[2-5 (1547859980961447936)]} 0 0
   [junit4]   2> 910098 INFO  (qtp662220242-69605) [n:127.0.0.1:54440_y_dy%2Fb c:control_collection s:shard1 r:core_node1 x:collection1] o.a.s.u.p.LogUpdateProcessorFactory [collection1]  webapp=/y_dy/b path=/update params={wt=javabin&version=2&CONTROL=TRUE}{add=[1-6 (1547859980961447937)]} 0 0
   [junit4]   2> 910099 INFO  (qtp1498716135-69677) [n:127.0.0.1:34156_y_dy%2Fb c:collection1 s:shard1 r:core_node2 x:collection1] o.a.s.u.p.LogUpdateProcessorFactory [collection1]  webapp=/y_dy/b path=/update params={update.distrib=FROMLEADER&distrib.from=https://127.0.0.1:47442/y_dy/b/collection1/&wt=javabin&version=2}{add=[2-5 (1547859980961447936)]} 0 0
   [junit4]   2> 910099 INFO  (qtp469166410-69645) [n:127.0.0.1:47442_y_dy%2Fb c:collection1 s:shard1 r:core_node1 x:collection1] o.a.s.u.p.LogUpdateProcessorFactory [collection1]  webapp=/y_dy/b path=/update params={wt=javabin&version=2}{add=[2-5 (1547859980961447936)]} 0 1
   [junit4]   2> 910100 INFO  (qtp1498716135-69675) [n:127.0.0.1:34156_y_dy%2Fb c:collection1 s:shard1 r:core_node2 x:collection1] o.a.s.u.p.LogUpdateProcessorFactory [collection1]  webapp=/y_dy/b path=/update params={update.distrib=FROMLEADER&distrib.from=https://127.0.0.1:47442/y_dy/b/collection1/&wt=javabin&version=2}{add=[1-6 (1547859980962496512)]} 0 0
   [junit4]   2> 910100 INFO  (qtp662220242-69609) [n:127.0.0.1:54440_y_dy%2Fb c:control_collection s:shard1 r:core_node1 x:collection1] o.a.s.u.p.LogUpdateProcessorFactory [collection1]  webapp=/y_dy/b path=/update params={wt=javabin&version=2&CONTROL=TRUE}{delete=[2-3 (-1547859980963545088)]} 0 0
   [junit4]   2> 910101 INFO  (qtp469166410-69647) [n:127.0.0.1:47442_y_dy%2Fb c:collection1 s:shard1 r:core_node1 x:collection1] o.a.s.u.p.LogUpdateProcessorFactory [collection1]  webapp=/y_dy/b path=/update params={wt=javabin&version=2}{add=[1-6 (1547859980962496512)]} 0 2
   [junit4]   2> 910101 INFO  (qtp1498716135-69675) [n:127.0.0.1:34156_y_dy%2Fb c:collection1 s:shard1 r:core_node2 x:collection1] o.a.s.u.p.LogUpdateProcessorFactory [collection1]  webapp=/y_dy/b path=/update params={update.distrib=FROMLEADER&distrib.from=https://127.0.0.1:47442/y_dy/b/collection1/&wt=javabin&version=2}{delete=[2-3 (-1547859980964593664)]} 0 0
   [junit4]   2> 910101 INFO  (qtp662220242-69606) [n:127.0.0.1:54440_y_dy%2Fb c:control_collection s:shard1 r:core_node1 x:collection1] o.a.s.u.p.LogUpdateProcessorFactory [collection1]  webapp=/y_dy/b path=/update params={wt=javabin&version=2&CONTROL=TRUE}{delete=[1-4 (-1547859980964593664)]} 0 0
   [junit4]   2> 910101 INFO  (qtp469166410-69642) [n:127.0.0.1:47442_y_dy%2Fb c:collection1 s:shard1 r:core_node1 x:collection1] o.a.s.u.p.LogUpdateProcessorFactory [collection1]  webapp=/y_dy/b path=/update params={wt=javabin&version=2}{delete=[2-3 (-1547859980964593664)]} 0 0
   [junit4]   2> 910102 INFO  (qtp662220242-69608) [n:127.0.0.1:54440_y_dy%2Fb c:control_collection s:shard1 r:core_node1 x:collection1] o.a.s.u.p.LogUpdateProcessorFactory [collection1]  webapp=/y_dy/b path=/update params={wt=javabin&version=2&CONTROL=TRUE}{add=[2-6 (1547859980965642240)]} 0 0
   [junit4]   2> 910102 INFO  (qtp1498716135-69675) [n:127.0.0.1:34156_y_dy%2Fb c:collection1 s:shard1 r:core_node2 x:collection1] o.a.s.u.p.LogUpdateProcessorFactory [collection1]  webapp=/y_dy/b path=/update params={update.distrib=FROMLEADER&distrib.from=https://127.0.0.1:47442/y_dy/b/collection1/&wt=javabin&version=2}{delete=[1-4 (-1547859980965642240)]} 0 0
   [junit4]   2> 910102 INFO  (qtp469166410-69643) [n:127.0.0.1:47442_y_dy%2Fb c:collection1 s:shard1 r:core_node1 x:collection1] o.a.s.u.p.LogUpdateProcessorFactory [collection1]  webapp=/y_dy/b path=/update params={wt=javabin&version=2}{delete=[1-4 (-1547859980965642240)]} 0 0
   [junit4]   2> 910103 INFO  (qtp1498716135-69675) [n:127.0.0.1:34156_y_dy%2Fb c:collection1 s:shard1 r:core_node2 x:collection1] o.a.s.u.p.LogUpdateProcessorFactory [collection1]  webapp=/y_dy/b path=/update params={update.distrib=FROMLEADER&distrib.from=https://127.0.0.1:47442/y_dy/b/collection1/&wt=javabin&version=2}{add=[2-6 (1547859980965642241)]} 0 0
   [junit4]   2> 910103 INFO  (qtp662220242-69608) [n:127.0.0.1:54440_y_dy%2Fb c:control_collection s:shard1 r:core_node1 x:collection1] o.a.s.u.p.LogUpdateProcessorFactory [collection1]  webapp=/y_dy/b path=/update params={wt=javabin&version=2&CONTROL=TRUE}{add=[1-7 (1547859980966690816)]} 0 0
   [junit4]   2> 910103 INFO  (qtp469166410-69646) [n:127.0.0.1:47442_y_dy%2Fb c:collection1 s:shard1 r:core_node1 x:collection1] o.a.s.u.p.LogUpdateProcessorFactory [collection1]  webapp=/y_dy/b path=/update params={wt=javabin&version=2}{add=[2-6 (1547859980965642241)]} 0 0
   [junit4]   2> 910103 INFO  (qtp662220242-69612) [n:127.0.0.1:54440_y_dy%2Fb c:control_collection s:shard1 r:core_node1 x:collection1] o.a.s.u.p.LogUpdateProcessorFactory [collection1]  webapp=/y_dy/b path=/update params={wt=javabin&version=2&CONTROL=TRUE}{delete=[2-4 (-1547859980966690817)]} 0 0
   [junit4]   2> 910104 INFO  (qtp1498716135-69673) [n:127.0.0.1:34156_y_dy%2Fb c:collection1 s:shard1 r:core_node2 x:collection1] o.a.s.u.p.LogUpdateProcessorFactory [collection1]  webapp=/y_dy/b path=/update params={update.distrib=FROMLEADER&distrib.from=https://127.0.0.1:47442/y_dy/b/collection1/&wt=javabin&version=2}{add=[1-7 (1547859980966690816)]} 0 0
   [junit4]   2> 910104 INFO  (qtp469166410-69643) [n:127.0.0.1:47442_y_dy%2Fb c:collection1 s:shard1 r:core_node1 x:collection1] o.a.s.u.p.LogUpdateProcessorFactory [collection1]  webapp=/y_dy/b path=/update params={wt=javabin&version=2}{add=[1-7 (1547859980966690816)]} 0 0
   [junit4]   2> 910105 INFO  (qtp662220242-69605) [n:127.0.0.1:54440_y_dy%2Fb c:control_collection s:shard1 r:core_node1 x:collection1] o.a.s.u.p.LogUpdateProcessorFactory [collection1]  webapp=/y_dy/b path=/update params={wt=javabin&version=2&CONTROL=TRUE}{add=[1-8 (1547859980967739392)]} 0 0
   [junit4]   2> 910105 INFO  (qtp1498716135-69677) [n:127.0.0.1:34156_y_dy%2Fb c:collection1 s:shard1 r:core_node2 x:collection1] o.a.s.u.p.LogUpdateProcessorFactory [collection1]  webapp=/y_dy/b path=/update params={update.distrib=FROMLEADER&distrib.from=https://127.0.0.1:47442/y_dy/b/collection1/&wt=javabin&version=2}{delete=[2-4 (-1547859980967739392)]} 0 0
   [junit4]   2> 910105 INFO  (qtp469166410-69647) [n:127.0.0.1:47442_y_dy%2Fb c:collection1 s:shard1 r:core_node1 x:collection1] o.a.s.u.p.LogUpdateProcessorFactory [collection1]  webapp=/y_dy/b path=/update params={wt=javabin&version=2}{delete=[2-4 (-1547859980967739392)]} 0 1
   [junit4]   2> 910106 INFO  (qtp662220242-69609) [n:127.0.0.1:54440_y_dy%2Fb c:control_collection s:shard1 r:core_node1 x:collection1] o.a.s.u.p.LogUpdateProcessorFactory [collection1]  webapp=/y_dy/b path=/update params={wt=javabin&version=2&CONTROL=TRUE}{add=[2-7 (1547859980969836544)]} 0 0
   [junit4]   2> 910107 INFO  (qtp1498716135-69676) [n:127.0.0.1:34156_y_dy%2Fb c:collection1 s:shard1 r:core_node2 x:collection1] o.a.s.u.p.LogUpdateProcessorFactory [collection1]  webapp=/y_dy/b path=/update params={update.distrib=FROMLEADER&distrib.from=https://127.0.0.1:47442/y_dy/b/collection1/&wt=javabin&version=2}{add=[2-7 (1547859980969836544)]} 0 0
   [junit4]   2> 910107 INFO  (qtp469166410-69645) [n:127.0.0.1:47442_y_dy%2Fb c:collection1 s:shard1 r:core_node1 x:collection1] o.a.s.u.p.LogUpdateProcessorFactory [collection1]  webapp=/y_dy/b path=/update params={wt=javabin&version=2}{add=[2-7 (1547859980969836544)]} 0 0
   [junit4]   2> 910107 INFO  (qtp1498716135-69670) [n:127.0.0.1:34156_y_dy%2Fb c:collection1 s:shard1 r:core_node2 x:collection1] o.a.s.u.p.LogUpdateProcessorFactory [collection1]  webapp=/y_dy/b path=/update params={update.distrib=FROMLEADER&distrib.from=https://127.0.0.1:47442/y_dy/b/collection1/&wt=javabin&version=2}{add=[1-8 (1547859980968787968)]} 0 0
   [junit4]   2> 910107 INFO  (qtp469166410-69642) [n:127.0.0.1:47442_y_dy%2Fb c:collection1 s:shard1 r:core_node1 x:collection1] o.a.s.u.p.LogUpdateProcessorFactory [collection1]  webapp=/y_dy/b path=/update params={wt=javabin&version=2}{add=[1-8 (1547859980968787968)]} 0 2
   [junit4]   2> 910107 INFO  (qtp662220242-69606) [n:127.0.0.1:54440_y_dy%2Fb c:control_collection s:shard1 r:core_node1 x:collection1] o.a.s.u.p.LogUpdateProcessorFactory [collection1]  webapp=/y_dy/b path=/update params={wt=javabin&version=2&CONTROL=TRUE}{add=[2-8 (1547859980970885120)]} 0 0
   [junit4]   2> 910108 INFO  (qtp662220242-69611) [n:127.0.0.1:54440_y_dy%2Fb c:control_collection s:shard1 r:core_node1 x:collection1] o.a.s.u.p.LogUpdateProcessorFactory [collection1]  webapp=/y_dy/b path=/update params={wt=javabin&version=2&CONTROL=TRUE}{add=[1-9 (1547859980971933696)]} 0 0
   [junit4]   2> 910109 INFO  (qtp1498716135-69670) [n:127.0.0.1:34156_y_dy%2Fb c:collection1 s:shard1 r:core_node2 x:collection1] o.a.s.u.p.LogUpdateProcessorFactory [collection1]  webapp=/y_dy/b path=/update params={update.distrib=FROMLEADER&distrib.from=https://127.0.0.1:47442/y_dy/b/collection1/&wt=javabin&version=2}{add=[1-9 (1547859980971933696)]} 0 0
   [junit4]   2> 910109 INFO  (qtp469166410-69646) [n:127.0.0.1:47442_y_dy%2Fb c:collection1 s:shard1 r:core_node1 x:collection1] o.a.s.u.p.LogUpdateProcessorFactory [collection1]  webapp=/y_dy/b path=/update params={wt=javabin&version=2}{add=[1-9 (1547859980971933696)]} 0 0
   [junit4]   2> 910109 INFO  (qtp1498716135-69671) [n:127.0.0.1:34156_y_dy%2Fb c:collection1 s:shard1 r:core_node2 x:collection1] o.a.s.u.p.LogUpdateProcessorFactory [collection1]  webapp=/y_dy/b path=/update params={update.distrib=FROMLEADER&distrib.from=https://127.0.0.1:47442/y_dy/b/collection1/&wt=javabin&version=2}{add=[2-8 (1547859980971933697)]} 0 0
   [junit4]   2> 910109 INFO  (qtp469166410-69643) [n:127.0.0.1:47442_y_dy%2Fb c:collection1 s:shard1 r:core_node1 x:collection1] o.a.s.u.p.LogUpdateProcessorFactory [collection1]  webapp=/y_dy/b path=/update params={wt=javabin&version=2}{add=[2-8 (1547859980971933697)]} 0 1
   [junit4]   2> 910109 INFO  (qtp662220242-69611) [n:127.0.0.1:54440_y_dy%2Fb c:control_collection s:shard1 r:core_node1 x:collection1] o.a.s.u.p.LogUpdateProcessorFactory [collection1]  webapp=/y_dy/b path=/update params={wt=javabin&version=2&CONTROL=TRUE}{delete=[1-6 (-1547859980972982272)]} 0 0
   [junit4]   2> 910110 INFO  (qtp662220242-69611) [n:127.0.0.1:54440_y_dy%2Fb c:control_collection s:shard1 r:core_node1 x:collection1] o.a.s.u.p.LogUpdateProcessorFactory [collection1]  webapp=/y_dy/b path=/update params={wt=javabin&version=2&CONTROL=TRUE}{add=[2-9 (1547859980974030848)]} 0 0
   [junit4]   2> 910111 INFO  (qtp1498716135-69674) [n:127.0.0.1:34156_y_dy%2Fb c:collection1 s:shard1 r:core_node2 x:collection1] o.a.s.u.p.LogUpdateProcessorFactory [collection1]  webapp=/y_dy/b path=/update params={update.distrib=FROMLEADER&distrib.from=https://127.0.0.1:47442/y_dy/b/collection1/&wt=javabin&version=2}{delete=[1-6 (-1547859980974030848)]} 0 0
   [junit4]   2> 910111 INFO  (qtp469166410-69647) [n:127.0.0.1:47442_y_dy%2Fb c:collection1 s:shard1 r:core_node1 x:collection1] o.a.s.u.p.LogUpdateProcessorFactory [collection1]  webapp=/y_dy/b path=/update params={wt=javabin&version=2}{delete=[1-6 (-1547859980974030848)]} 0 0
   [junit4]   2> 910111 INFO  (qtp1498716135-69670) [n:127.0.0.1:34156_y_dy%2Fb c:collection1 s:shard1 r:core_node2 x:collection1] o.a.s.u.p.LogUpdateProcessorFactory [collection1]  webapp=/y_dy/b path=/update params={update.distrib=FROMLEADER&distrib.from=https://127.0.0.1:47442/y_dy/b/collection1/&wt=javabin&version=2}{add=[2-9 (1547859980974030849)]} 0 0
   [junit4]   2> 910111 INFO  (qtp469166410-69645) [n:127.0.0.1:47442_y_dy%2Fb c:collection1 s:shard1 r:core_node1 x:collection1] o.a.s.u.p.LogUpdateProcessorFactory [collection1]  webapp=/y_dy/b path=/update params={wt=javabin&version=2}{add=[2-9 (1547859980974030849)]} 0 0
   [junit4]   2> 910111 INFO  (qtp662220242-69605) [n:127.0.0.1:54440_y_dy%2Fb c:control_collection s:shard1 r:core_node1 x:collection1] o.a.s.u.p.LogUpdateProcessorFactory [collection1]  webapp=/y_dy/b path=/update params={wt=javabin&version=2&CONTROL=TRUE}{add=[1-10 (1547859980975079424)]} 0 0
   [junit4]   2> 910112 INFO  (qtp662220242-69610) [n:127.0.0.1:54440_y_dy%2Fb c:control_collection s:shard1 r:core_node1 x:collection1] o.a.s.u.p.LogUpdateProcessorFactory [collection1]  webapp=/y_dy/b path=/update params={wt=javabin&version=2&CONTROL=TRUE}{delete=[2-6 (-1547859980976128000)]} 0 0
   [junit4]   2> 910112 INFO  (qtp1498716135-69675) [n:127.0.0.1:34156_y_dy%2Fb c:collection1 s:shard1 r:core_node2 x:collection1] o.a.s.u.p.LogUpdateProcessorFactory [collection1]  webapp=/y_dy/b path=/update params={update.distrib=FROMLEADER&distrib.from=https://127.0.0.1:47442/y_dy/b/collection1/&wt=javabin&version=2}{add=[1-10 (1547859980976128000)]} 0 0
   [junit4]   2> 910113 INFO  (qtp1498716135-69674) [n:127.0.0.1:34156_y_dy%2Fb c:collection1 s:shard1 r:core_node2 x:collection1] o.a.s.u.p.LogUpdateProcessorFactory [collection1]  webapp=/y_dy/b path=/update params={update.distrib=FROMLEADER&distrib.from=https://127.0.0.1:47442/y_dy/b/collection1/&wt=javabin&version=2}{delete=[2-6 (-1547859980976128001)]} 0 0
   [junit4]   2> 910113 INFO  (qtp469166410-69646) [n:127.0.0.1:47442_y_dy%2Fb c:collection1 s:shard1 r:core_node1 x:collection1] o.a.s.u.p.LogUpdateProcessorFactory [collection1]  webapp=/y_dy/b path=/update params={wt=javabin&version=2}{delete=[2-6 (-1547859980976128001)]} 0 0
   [junit4]   2> 910113 INFO  (qtp469166410-69642) [n:127.0.0.1:47442_y_dy%2Fb c:collection1 s:shard1 r:core_node1 x:collection1] o.a.s.u.p.LogUpdateProcessorFactory [collection1]  webapp=/y_dy/b path=/update params={wt=javabin&version=2}{add=[1-10 (1547859980976128000)]} 0 1
   [junit4]   2> 910113 INFO  (qtp662220242-69610) [n:127.0.0.1:54440_y_dy%2Fb c:control_collection s:shard1 r:core_node1 x:collection1] o.a.s.u.p.LogUpdateProcessorFactory [collection1]  webapp=/y_dy/b path=/update params={wt=javabin&version=2&CONTROL=TRUE}{add=[2-10 (1547859980977176576)]} 0 0
   [junit4]   2> 910113 INFO  (qtp662220242-69609) [n:127.0.0.1:54440_y_dy%2Fb c:control_collection s:shard1 r:core_node1 x:collection1] o.a.s.u.p.LogUpdateProcessorFactory [collection1]  webapp=/y_dy/b path=/update params={wt=javabin&version=2&CONTROL=TRUE}{add=[1-11 (1547859980977176577)]} 0 0
   [junit4]   2> 910115 INFO  (qtp1498716135-69675) [n:127.0.0.1:34156_y_dy%2Fb c:collection1 s:shard1 r:core_node2 x:collection1] o.a.s.u.p.LogUpdateProcessorFactory [collection1]  webapp=/y_dy/b path=/update params={update.distrib=FROMLEADER&distrib.from=https://127.0.0.1:47442/y_dy/b/collection1/&wt=javabin&version=2}{add=[1-11 (1547859980978225153)]} 0 0
   [junit4]   2> 910115 INFO  (qtp469166410-69647) [n:127.0.0.1:47442_y_dy%2Fb c:collection1 s:shard1 r:core_node1 x:collection1] o.a.s.u.p.LogUpdateProcessorFactory [collection1]  webapp=/y_dy/b path=/update params={wt=javabin&version=2}{add=[1-11 (1547859980978225153)]} 0 1
   [junit4]   2> 910116 INFO  (qtp662220242-69610) [n:127.0.0.1:54440_y_dy%2Fb c:control_collection s:shard1 r:core_node1 x:collection1] o.a.s.u.p.LogUpdateProcessorFactory [collection1]  webapp=/y_dy/b path=/update params={wt=javabin&version=2&CONTROL=TRUE}{add=[1-12 (1547859980979273728)]} 0 0
   [junit4]   2> 910116 INFO  (qtp1498716135-69677) [n:127.0.0.1:34156_y_dy%2Fb c:collection1 s:shard1 r:core_node2 x:collection1] o.a.s.u.p.LogUpdateProcessorFactory [collection1]  webapp=/y_dy/b path=/update params={update.distrib=FROMLEADER&distrib.from=https://127.0.0.1:47442/y_dy/b/collection1/&wt=javabin&version=2}{add=[2-10 (1547859980978225152)]} 0 0
   [junit4]   2> 910117 INFO  (qtp1498716135-69676) [n:127.0.0.1:34156_y_dy%2Fb c:collection1 s:shard1 r:core_node2 x:collection1] o.a.s.u.p.LogUpdateProcessorFactory [collection1]  webapp=/y_dy/b path=/update params={update.distrib=FROMLEADER&distrib.from=https://127.0.0.1:47442/y_dy/b/collection1/&wt=javabin&version=2}{add=[1-12 (1547859980980322304)]} 0 0
   [junit4]   2> 910117 INFO  (qtp469166410-69645) [n:127.0.0.1:47442_y_dy%2Fb c:collection1 s:shard1 r:core_node1 x:collection1] o.a.s.u.p.LogUpdateProcessorFactory [collection1]  webapp=/y_dy/b path=/update params={wt=javabin&version=2}{add=[1-12 (1547859980980322304)]} 0 0
   [junit4]   2> 910117 INFO  (qtp662220242-69611) [n:127.0.0.1:54440_y_dy%2Fb c:control_collection s:shard1 r:core_node1 x:collection1] o.a.s.u.p.LogUpdateProcessorFactory [collection1]  webapp=/y_dy/b path=/update params={wt=javabin&version=2&CONTROL=TRUE}{delete=[1-7 (-1547859980981370880)]} 0 0
   [junit4]   2> 910118 INFO  (qtp469166410-69643) [n:127.0.0.1:47442_y_dy%2Fb c:collection1 s:shard1 r:core_node1 x:collection1] o.a.s.u.p.LogUpdateProcessorFactory [collection1]  webapp=/y_dy/b path=/update params={wt=javabin&version=2}{add=[2-10 (1547859980978225152)]} 0 3
   [junit4]   2> 910118 INFO  (qtp1498716135-69677) [n:127.0.0.1:34156_y_dy%2Fb c:collection1 s:shard1 r:core_node2 x:collection1] o.a.s.u.p.LogUpdateProcessorFactory [collection1]  webapp=/y_dy/b path=/update params={update.distrib=FROMLEADER&distrib.from=https://127.0.0.1:47442/y_dy/b/collection1/&wt=javabin&version=2}{delete=[1-7 (-1547859980982419456)]} 0 0
   [junit4]   2> 910118 INFO  (qtp469166410-69646) [n:127.0.0.1:47442_y_dy%2Fb c:collection1 s:shard1 r:core_node1 x:collection1] o.a.s.u.p.LogUpdateProcessorFactory [collection1]  webapp=/y_dy/b path=/update params={wt=javabin&version=2}{delete=[1-7 (-1547859980982419456)]} 0 0
   [junit4]   2> 910119 INFO  (qtp662220242-69605) [n:127.0.0.1:54440_y_dy%2Fb c:control_collection s:shard1 r:core_node1 x:collection1] o.a.s.u.p.LogUpdateProcessorFactory [collection1]  webapp=/y_dy/b path=/update params={wt=javabin&version=2&CONTROL=TRUE}{add=[1-13 (1547859980983468032)]} 0 0
   [junit4]   2> 910120 INFO  (qtp1498716135-69674) [n:127.0.0.1:34156_y_dy%2Fb c:collection1 s:shard1 r:core_node2 x:collection1] o.a.s.u.p.LogUpdateProcessorFactory [collection1]  webapp=/y_dy/b path=/update params={update.distrib=FROMLEADER&distrib.from=https://127.0.0.1:47442/y_dy/b/collection1/&wt=javabin&version=2}{add=[1-13 (1547859980983468032)]} 0 0
   [junit4]   2> 910120 INFO  (qtp469166410-69642) [n:127.0.0.1:47442_y_dy%2Fb c:collection1 s:shard1 r:core_node1 x:collection1] o.a.s.u.p.LogUpdateProcessorFactory [collection1]  webapp=/y_dy/b path=/update params={wt=javabin&version=2}{add=[1-13 (1547859980983468032)]} 0 0
   [junit4]   2> 910120 INFO  (qtp662220242-69605) [n:127.0.0.1:54440_y_dy%2Fb c:control_collection s:shard1 r:core_node1 x:collection1] o.a.s.u.p.LogUpdateProcessorFactory [collection1]  webapp=/y_dy/b path=/update params={wt=javabin&version=2&CONTROL=TRUE}{delete=[1-10 (-1547859980984516608)]} 0 0
   [junit4]   2> 910121 INFO  (qtp1498716135-69675) [n:127.0.0.1:34156_y_dy%2Fb c:collection1 s:shard1 r:core_node2 x:collection1] o.a.s.u.p.LogUpdateProcessorFactory [collection1]  webapp=/y_dy/b path=/update params={update.distrib=FROMLEADER&distrib.from=https://127.0.0.1:47442/y_dy/b/collection1/&wt=javabin&version=2}{delete=[1-10 (-1547859980985565184)]} 0 0
   [junit4]   2> 910122 INFO  (qtp469166410-69647) [n:127.0.0.1:47442_y_dy%2Fb c:collection1 s:shard1 r:core_node1 x:collection1] o.a.s.u.p.LogUpdateProcessorFactory [collection1]  webapp=/y_dy/b path=/update params={wt=javabin&version=2}{delete=[1-10 (-1547859980985565184)]} 0 0
   [junit4]   2> 910122 INFO  (qtp662220242-69605) [n:127.0.0.1:54440_y_dy%2Fb c:control_collection s:shard1 r:core_node1 x:collection1] o.a.s.u.p.LogUpdateProcessorFactory [collection1]  webapp=/y_dy/b path=/update params={wt=javabin&version=2&CONTROL=TRUE}{add=[1-14 (1547859980986613760)]} 0 0
   [junit4]   2> 910123 INFO  (qtp662220242-69609) [n:127.0.0.1:54440_y_dy%2Fb c:control_collection s:shard1 r:core_node1 x:collection1] o.a.s.u.p.LogUpdateProcessorFactory [collection1]  webapp=/y_dy/b path=/update params={wt=javabin&version=2&CONTROL=TRUE}{add=[2-11 (1547859980987662336)]} 0 0
   [junit4]   2> 910123 INFO  (qtp1498716135-69673) [n:127.0.0.1:34156_y_dy%2Fb c:collection1 s:shard1 r:core_node2 x:collection1] o.a.s.u.p.LogUpdateProcessorFactory [collection1]  webapp=/y_dy/b path=/update params={update.distrib=FROMLEADER&distrib.from=https://127.0.0.1:47442/y_dy/b/collection1/&wt=javabin&version=2}{add=[1-14 (1547859980987662336)]} 0 0
   [junit4]   2> 910123 INFO  (qtp469166410-69645) [n:127.0.0.1:47442_y_dy%2Fb c:collection1 s:shard1 r:core_node1 x:collection1] o.a.s.u.p.LogUpdateProcessorFactory [collection1]  webapp=/y_dy/b path=/update params={wt=javabin&version=2}{add=[1-14 (1547859980987662336)]} 0 0
   [junit4]   2> 910124 INFO  (qtp662220242-69610) [n:127.0.0.1:54440_y_dy%2Fb c:control_collection s:shard1 r:core_node1 x:collection1] o.a.s.u.p.LogUpdateProcessorFactory [collection1]  webapp=/y_dy/b path=/update params={wt=javabin&version=2&CONTROL=TRUE}{add=[1-15 (1547859980988710912)]} 0 0
   [junit4]   2> 910125 INFO  (qtp1498716135-69677) [n:127.0.0.1:34156_y_dy%2Fb c:collection1 s:shard1 r:core_node2 x:collection1] o.a.s.u.p.LogUpdateProcessorFactory [collection1]  webapp=/y_dy/b path=/update params={update.distrib=FROMLEADER&distrib.from=https://127.0.0.1:47442/y_dy/b/collection1/&wt=javabin&version=2}{add=[1-15 (1547859980988710912)]} 0 0
   [junit4]   2> 910125 INFO  (qtp469166410-69646) [n:127.0.0.1:47442_y_dy%2Fb c:collection1 s:shard1 r:core_node1 x:collection1] o.a.s.u.p.LogUpdateProcessorFactory [collection1]  webapp=/y_dy/b path=/update params={wt=javabin&version=2}{add=[1-15 (1547859980988710912)]} 0 0
   [junit4]   2> 910125 INFO  (qtp662220242-69610) [n:127.0.0.1:54440_y_dy%2Fb c:control_collection s:shard1 r:core_node1 x:collection1] o.a.s.u.p.LogUpdateProcessorFactory [collection1]  webapp=/y_dy/b path=/update params={wt=javabin&version=2&CONTROL=TRUE}{delete=[1-12 (-1547859980989759488)]} 0 0
   [junit4]   2> 910126 INFO  (qtp1498716135-69677) [n:127.0.0.1:34156_y_dy%2Fb c:collection1 s:shard1 r:core_node2 x:collection1] o.a.s.u.p.LogUpdateProcessorFactory [collection1]  webapp=/y_dy/b path=/update params={update.distrib=FROMLEADER&distrib.from=https://127.0.0.1:47442/y_dy/b/collection1/&wt=javabin&version=2}{delete=[1-12 (-1547859980990808064)]} 0 0
   [junit4]   2> 910126 INFO  (qtp469166410-69642) [n:127.0.0.1:47442_y_dy%2Fb c:collection1 s:shard1 r:core_node1 x:collection1] o.a.s.u.p.LogUpdateProcessorFactory [collection1]  webapp=/y_dy/b path=/update params={wt=javabin&version=

[...truncated too long message...]

.run(QueuedThreadPool.java:572)
   [junit4]   2> 	at java.lang.Thread.run(Thread.java:745)
   [junit4]   2> 
   [junit4]   2> 1036833 INFO  (qtp469166410-69646) [n:127.0.0.1:47442_y_dy%2Fb    ] o.a.s.s.HttpSolrCall [admin] webapp=null path=/admin/cores params={nodeName=127.0.0.1:34156_y_dy%252Fb&onlyIfLeaderActive=true&core=collection1&coreNodeName=core_node2&action=PREPRECOVERY&checkLive=true&state=recovering&onlyIfLeader=true&wt=javabin&version=2} status=400 QTime=126037
   [junit4]   2> 1036833 INFO  (TEST-RecoveryZkTest.test-seed#[7E7F568F98BD8F6D]) [    ] o.a.s.c.ChaosMonkey monkey: stop shard! 34156
   [junit4]   2> 1036833 INFO  (TEST-RecoveryZkTest.test-seed#[7E7F568F98BD8F6D]) [    ] o.a.s.c.CoreContainer Shutting down CoreContainer instance=1566226235
   [junit4]   2> 1036834 WARN  (TEST-RecoveryZkTest.test-seed#[7E7F568F98BD8F6D]) [    ] o.a.s.c.RecoveryStrategy Stopping recovery for core=[collection1] coreNodeName=[core_node2]
   [junit4]   2> 1036854 WARN  (updateExecutor-16685-thread-2-processing-n:127.0.0.1:34156_y_dy%2Fb) [n:127.0.0.1:34156_y_dy%2Fb c:collection1 s:shard1 r:core_node2 x:collection1] o.a.s.u.DefaultSolrCoreState Skipping recovery because Solr is shutdown
   [junit4]   2> 1041788 INFO  (recoveryExecutor-16686-thread-1-processing-n:127.0.0.1:34156_y_dy%2Fb x:collection1 s:shard1 c:collection1 r:core_node2) [n:127.0.0.1:34156_y_dy%2Fb c:collection1 s:shard1 r:core_node2 x:collection1] o.a.s.c.RecoveryStrategy RecoveryStrategy has been closed
   [junit4]   2> 1041788 INFO  (recoveryExecutor-16686-thread-1-processing-n:127.0.0.1:34156_y_dy%2Fb x:collection1 s:shard1 c:collection1 r:core_node2) [n:127.0.0.1:34156_y_dy%2Fb c:collection1 s:shard1 r:core_node2 x:collection1] o.a.s.c.RecoveryStrategy Finished recovery process, successful=[false]
   [junit4]   2> 1041788 INFO  (recoveryExecutor-16686-thread-1-processing-n:127.0.0.1:34156_y_dy%2Fb x:collection1 s:shard1 c:collection1 r:core_node2) [n:127.0.0.1:34156_y_dy%2Fb c:collection1 s:shard1 r:core_node2 x:collection1] o.a.s.c.SolrCore [collection1]  CLOSING SolrCore org.apache.solr.core.SolrCore@3dece243
   [junit4]   2> 1041788 WARN  (recoveryExecutor-16686-thread-1-processing-n:127.0.0.1:34156_y_dy%2Fb x:collection1 s:shard1 c:collection1 r:core_node2) [n:127.0.0.1:34156_y_dy%2Fb c:collection1 s:shard1 r:core_node2 x:collection1] o.a.s.c.RecoveryStrategy Stopping recovery for core=[collection1] coreNodeName=[core_node2]
   [junit4]   2> 1041795 INFO  (TEST-RecoveryZkTest.test-seed#[7E7F568F98BD8F6D]) [    ] o.a.s.c.Overseer Overseer (id=96741248478150671-127.0.0.1:34156_y_dy%2Fb-n_0000000003) closing
   [junit4]   2> 1041797 INFO  (OverseerStateUpdate-96741248478150671-127.0.0.1:34156_y_dy%2Fb-n_0000000003) [n:127.0.0.1:34156_y_dy%2Fb    ] o.a.s.c.Overseer Overseer Loop exiting : 127.0.0.1:34156_y_dy%2Fb
   [junit4]   2> 1043303 WARN  (zkCallback-16688-thread-4-processing-n:127.0.0.1:34156_y_dy%2Fb) [n:127.0.0.1:34156_y_dy%2Fb    ] o.a.s.c.c.ZkStateReader ZooKeeper watch triggered, but Solr cannot talk to ZK: [KeeperErrorCode = Session expired for /live_nodes]
   [junit4]   2> 1043304 INFO  (TEST-RecoveryZkTest.test-seed#[7E7F568F98BD8F6D]) [    ] o.e.j.s.ServerConnector Stopped ServerConnector@5612409a{SSL,[ssl, http/1.1]}{127.0.0.1:34156}
   [junit4]   2> 1043304 INFO  (TEST-RecoveryZkTest.test-seed#[7E7F568F98BD8F6D]) [    ] o.e.j.s.h.ContextHandler Stopped o.e.j.s.ServletContextHandler@6bd54120{/y_dy/b,null,UNAVAILABLE}
   [junit4]   2> 1043305 INFO  (TEST-RecoveryZkTest.test-seed#[7E7F568F98BD8F6D]) [    ] o.a.s.c.ZkTestServer connecting to 127.0.0.1:38805 38805
   [junit4]   2> 1043407 INFO  (Thread-7587) [    ] o.a.s.c.ZkTestServer connecting to 127.0.0.1:38805 38805
   [junit4]   2> 1043408 WARN  (Thread-7587) [    ] o.a.s.c.ZkTestServer Watch limit violations: 
   [junit4]   2> Maximum concurrent create/delete watches above limit:
   [junit4]   2> 
   [junit4]   2> 	5	/solr/aliases.json
   [junit4]   2> 	4	/solr/security.json
   [junit4]   2> 	4	/solr/configs/conf1
   [junit4]   2> 	3	/solr/collections/collection1/state.json
   [junit4]   2> 
   [junit4]   2> Maximum concurrent data watches above limit:
   [junit4]   2> 
   [junit4]   2> 	5	/solr/clusterstate.json
   [junit4]   2> 	5	/solr/clusterprops.json
   [junit4]   2> 	2	/solr/overseer_elect/election/96741248478150665-127.0.0.1:47442_y_dy%2Fb-n_0000000001
   [junit4]   2> 	2	/solr/collections/collection1/leader_elect/shard1/election/96741248478150665-core_node1-n_0000000000
   [junit4]   2> 
   [junit4]   2> Maximum concurrent children watches above limit:
   [junit4]   2> 
   [junit4]   2> 	135	/solr/overseer/collection-queue-work
   [junit4]   2> 	32	/solr/overseer/queue
   [junit4]   2> 	5	/solr/collections
   [junit4]   2> 	4	/solr/live_nodes
   [junit4]   2> 	2	/solr/overseer/queue-work
   [junit4]   2> 
   [junit4]   2> NOTE: reproduce with: ant test  -Dtestcase=RecoveryZkTest -Dtests.method=test -Dtests.seed=7E7F568F98BD8F6D -Dtests.multiplier=2 -Dtests.slow=true -Dtests.locale=es-VE -Dtests.timezone=SST -Dtests.asserts=true -Dtests.file.encoding=ISO-8859-1
   [junit4] FAILURE  138s J0 | RecoveryZkTest.test <<<
   [junit4]    > Throwable #1: java.lang.AssertionError: There are still nodes recoverying - waited for 120 seconds
   [junit4]    > 	at __randomizedtesting.SeedInfo.seed([7E7F568F98BD8F6D:F62B69553641E295]:0)
   [junit4]    > 	at org.apache.solr.cloud.AbstractDistribZkTestBase.waitForRecoveriesToFinish(AbstractDistribZkTestBase.java:181)
   [junit4]    > 	at org.apache.solr.cloud.AbstractFullDistribZkTestBase.waitForRecoveriesToFinish(AbstractFullDistribZkTestBase.java:862)
   [junit4]    > 	at org.apache.solr.cloud.AbstractFullDistribZkTestBase.waitForThingsToLevelOut(AbstractFullDistribZkTestBase.java:1418)
   [junit4]    > 	at org.apache.solr.cloud.RecoveryZkTest.test(RecoveryZkTest.java:105)
   [junit4]    > 	at org.apache.solr.BaseDistributedSearchTestCase$ShardsRepeatRule$ShardsFixedStatement.callStatement(BaseDistributedSearchTestCase.java:985)
   [junit4]    > 	at org.apache.solr.BaseDistributedSearchTestCase$ShardsRepeatRule$ShardsStatement.evaluate(BaseDistributedSearchTestCase.java:960)
   [junit4]    > 	at java.lang.Thread.run(Thread.java:745)
   [junit4]   2> 1043416 INFO  (SUITE-RecoveryZkTest-seed#[7E7F568F98BD8F6D]-worker) [    ] o.a.s.SolrTestCaseJ4 ###deleteCore
   [junit4]   2> NOTE: leaving temporary files on disk at: /x1/jenkins/jenkins-slave/workspace/Lucene-Solr-Tests-master/solr/build/solr-core/test/J0/temp/solr.cloud.RecoveryZkTest_7E7F568F98BD8F6D-001
   [junit4]   2> Oct 11, 2016 2:54:02 AM com.carrotsearch.randomizedtesting.ThreadLeakControl checkThreadLeaks
   [junit4]   2> WARNING: Will linger awaiting termination of 1 leaked thread(s).
   [junit4]   2> NOTE: test params are: codec=DummyCompressingStoredFields(storedFieldsFormat=CompressingStoredFieldsFormat(compressionMode=DUMMY, chunkSize=22925, maxDocsPerChunk=4, blockSize=9), termVectorsFormat=CompressingTermVectorsFormat(compressionMode=DUMMY, chunkSize=22925, blockSize=9)), sim=RandomSimilarity(queryNorm=false): {}, locale=es-VE, timezone=SST
   [junit4]   2> NOTE: Linux 3.13.0-85-generic amd64/Oracle Corporation 1.8.0_102 (64-bit)/cpus=4,threads=1,free=236628192,total=528482304
   [junit4]   2> NOTE: All tests run in this JVM: [TestSimpleQParserPlugin, TestReplicationHandler, ReturnFieldsTest, PolyFieldTest, TestRangeQuery, AnalysisAfterCoreReloadTest, TestAnalyzedSuggestions, TestHighFrequencyDictionaryFactory, TestMacros, CloudMLTQParserTest, AtomicUpdatesTest, TestManagedStopFilterFactory, XsltUpdateRequestHandlerTest, TestSortByMinMaxFunction, TestBulkSchemaAPI, TestGraphTermsQParserPlugin, CurrencyFieldOpenExchangeTest, TestSubQueryTransformer, TestStressLiveNodes, TestTrieFacet, UUIDFieldTest, MinimalSchemaTest, PingRequestHandlerTest, TestLeaderInitiatedRecoveryThread, TestSolrDeletionPolicy2, CdcrVersionReplicationTest, BigEndianAscendingWordDeserializerTest, TestGraphMLResponseWriter, NumericFieldsTest, TestLFUCache, TestJmxMonitoredMap, TestSolrDynamicMBean, TestEmbeddedSolrServerConstructors, SolrCloudExampleTest, TestPKIAuthenticationPlugin, LeaderElectionIntegrationTest, TestRealTimeGet, BooleanFieldTest, AnalyticsQueryTest, TestReloadAndDeleteDocs, AddBlockUpdateTest, TestConfigSets, ConcurrentDeleteAndCreateCollectionTest, TestCustomSort, OutOfBoxZkACLAndCredentialsProvidersTest, TestFieldCacheVsDocValues, TestSolrQueryParserDefaultOperatorResource, HdfsBasicDistributedZk2Test, TestRandomDVFaceting, TestCSVLoader, LeaderInitiatedRecoveryOnShardRestartTest, TestCrossCoreJoin, TestSchemaSimilarityResource, TestRestoreCore, CacheHeaderTest, SaslZkACLProviderTest, PathHierarchyTokenizerFactoryTest, TestManagedResource, HdfsSyncSliceTest, DateMathParserTest, PeerSyncTest, TestDistributedSearch, TestBlendedInfixSuggestions, TestDefaultSearchFieldResource, TestDistribDocBasedVersion, TestNumericTerms32, TestJsonFacets, TestHighlightDedupGrouping, TestInfoStreamLogging, TestRequestForwarding, DeleteLastCustomShardedReplicaTest, TestNoOpRegenerator, TestLRUCache, TestBadConfig, CollectionTooManyReplicasTest, RequestLoggingTest, TestSolrCloudWithKerberosAlt, TestHdfsCloudBackupRestore, TestRTGBase, DistributedExpandComponentTest, TestConfigSetsAPIExclusivity, LeaderFailoverAfterPartitionTest, PluginInfoTest, TestHdfsUpdateLog, TestRandomFaceting, DistributedFacetPivotWhiteBoxTest, DistributedSpellCheckComponentTest, TestCloudPseudoReturnFields, FileBasedSpellCheckerTest, TestMiniSolrCloudClusterSSL, TlogReplayBufferedWhileIndexingTest, TestFastWriter, TestScoreJoinQPNoScore, HdfsDirectoryFactoryTest, SolrRequestParserTest, ScriptEngineTest, RankQueryTest, TestClusterStateMutator, TestRecoveryHdfs, SolrCoreTest, SegmentsInfoRequestHandlerTest, TestSuggestSpellingConverter, OpenCloseCoreStressTest, ShardRoutingTest, BasicZkTest, RecoveryZkTest]
   [junit4] Completed [301/635 (1!)] on J0 in 138.92s, 1 test, 1 failure <<< FAILURES!

[...truncated 61381 lines...]