You are viewing a plain text version of this content. The canonical link for it is here.
Posted to builds@cassandra.apache.org by Apache Jenkins Server <je...@builds.apache.org> on 2021/10/03 23:14:39 UTC

Build complete: Cassandra-4.0 #245 [FAILURE] 01080613789961c7e7f7655dd6d0065f4ef8ff21

-------------------------------------------------------------------------------
Build Cassandra-4.0 #245 Failure
URL: https://ci-cassandra.apache.org/job/Cassandra-4.0/245/
-------------------------------------------------------------------------------
Changes:
No changes

-------------------------------------------------------------------------------
Failed Tests:
2 tests failed.
FAILED:  org.apache.cassandra.net.ConnectionTest.testMessageDeliveryOnReconnect-compression
FAILED:  org.apache.cassandra.cql3.validation.entities.SecondaryIndexTest.testWriteOnlyIndex

-------------------------------------------------------------------------------
For complete test report and logs see https://nightlies.apache.org/cassandra/Cassandra-4.0/245/