You are viewing a plain text version of this content. The canonical link for it is here.
Posted to dev@royale.apache.org by ap...@gmail.com on 2019/11/04 00:34:57 UTC
Build failed in Jenkins: royale-compiler-integration-tests #14
See <http://apacheroyaleci2.westus2.cloudapp.azure.com:8080/job/royale-compiler-integration-tests/14/display/redirect>
Changes:
------------------------------------------
[...truncated 155.03 KB...]
[junit] scanning for overrides: IFlexInfo
[junit] scanning for overrides: ApplicationBase
[junit] scanning for overrides: IEventDispatcher
[junit] scanning for overrides: IInitialViewApplication
[junit] scanning for overrides: IParent
[junit] scanning for overrides: IPopUpHost
[junit] scanning for overrides: IPopUpHostParent
[junit] scanning for overrides: IRenderedObject
[junit] scanning for overrides: IStrand
[junit] scanning for overrides: Application
[junit] scanning for overrides: RoyaleTest_again_Flash
[junit] scanning for overrides: IDocument
[junit] scanning for overrides: MyController
[junit] scanning for overrides: HTMLElementWrapper
[junit] scanning for overrides: IId
[junit] scanning for overrides: IChild
[junit] scanning for overrides: IUIBase
[junit] scanning for overrides: ILayoutChild
[junit] scanning for overrides: IParentIUIBase
[junit] scanning for overrides: IRoyaleElement
[junit] scanning for overrides: IStrandWithModel
[junit] scanning for overrides: IStrandWithModelView
[junit] scanning for overrides: IStyleableObject
[junit] scanning for overrides: UIBase
[junit] scanning for overrides: IContainer
[junit] scanning for overrides: IContentViewHost
[junit] scanning for overrides: ILayoutParent
[junit] scanning for overrides: ILayoutView
[junit] scanning for overrides: IStatesObject
[junit] scanning for overrides: GroupBase
[junit] scanning for overrides: IApplicationView
[junit] scanning for overrides: ViewBase
[junit] scanning for overrides: IMXMLDocument
[junit] scanning for overrides: View
[junit] scanning for overrides: MyInitialView
[junit] scanning for overrides: IItemConverter
[junit] scanning for overrides: JSONItemConverter
[junit] scanning for overrides: StockDataJSONItemConverter
[junit] scanning for overrides: EventDispatcher
[junit] scanning for overrides: MyModel
[junit] scanning for overrides: IBead
[junit] scanning for overrides: IBeadController
[junit] scanning for overrides: ComboBoxController
[junit] scanning for overrides: DropDownListController
[junit] scanning for overrides: EditableTextKeyboardController
[junit] scanning for overrides: ScrollBarMouseControllerBase
[junit] scanning for overrides: HScrollBarMouseController
[junit] scanning for overrides: ItemRendererMouseController
[junit] scanning for overrides: ListSingleSelectionMouseController
[junit] scanning for overrides: VScrollBarMouseController
[junit] scanning for overrides: IBeadLayout
[junit] scanning for overrides: LayoutBase
[junit] scanning for overrides: BasicLayout
[junit] scanning for overrides: HScrollBarLayout
[junit] scanning for overrides: VScrollBarLayout
[junit] scanning for overrides: VerticalLayout
[junit] scanning for overrides: IBeadModel
[junit] scanning for overrides: IRollOverModel
[junit] scanning for overrides: IDataProviderModel
[junit] scanning for overrides: ISelectionModel
[junit] scanning for overrides: ArraySelectionModel
[junit] scanning for overrides: IComboBoxModel
[junit] scanning for overrides: ComboBoxModel
[junit] scanning for overrides: DataProviderModel
[junit] scanning for overrides: IRangeModel
[junit] scanning for overrides: RangeModel
[junit] scanning for overrides: IScrollBarModel
[junit] scanning for overrides: ScrollBarModel
[junit] scanning for overrides: IBorderModel
[junit] scanning for overrides: SingleLineBorderModel
[junit] scanning for overrides: ITextModel
[junit] scanning for overrides: TextModel
[junit] scanning for overrides: IToggleButtonModel
[junit] scanning for overrides: ToggleButtonModel
[junit] scanning for overrides: IValueToggleButtonModel
[junit] scanning for overrides: ValueToggleButtonModel
[junit] scanning for overrides: IViewportModel
[junit] scanning for overrides: ViewportModel
[junit] scanning for overrides: IBeadView
[junit] scanning for overrides: BeadViewBase
[junit] scanning for overrides: CSSButtonView
[junit] scanning for overrides: CSSTextButtonView
[junit] scanning for overrides: CheckBoxView
[junit] scanning for overrides: IViewWithPopUp
[junit] scanning for overrides: IComboBoxView
[junit] scanning for overrides: ComboBoxView
[junit] scanning for overrides: ILayoutHost
[junit] scanning for overrides: GroupView
[junit] scanning for overrides: ContainerView
[junit] scanning for overrides: IItemRendererParent
[junit] scanning for overrides: IListView
[junit] scanning for overrides: DataContainerView
[junit] scanning for overrides: IDataProviderItemRendererMapper
[junit] scanning for overrides: DataItemRendererFactoryForArrayData
[junit] scanning for overrides: IDropDownListView
[junit] scanning for overrides: DropDownListView
[junit] scanning for overrides: IScrollBarView
[junit] scanning for overrides: Strand
[junit] scanning for overrides: ScrollBarView
[junit] scanning for overrides: HScrollBarView
[junit] scanning for overrides: ListView
[junit] scanning for overrides: RadioButtonView
[junit] scanning for overrides: IGraphicsDrawing
[junit] scanning for overrides: IBorderBead
[junit] scanning for overrides: SingleLineBorderBead
[junit] scanning for overrides: IBackgroundBead
[junit] scanning for overrides: SolidBackgroundBead
[junit] scanning for overrides: ITextFieldView
[junit] scanning for overrides: TextFieldViewBase
[junit] scanning for overrides: TextAreaView
[junit] scanning for overrides: IMeasurementBead
[junit] scanning for overrides: TextButtonMeasurementBead
[junit] scanning for overrides: TextFieldLabelMeasurementBead
[junit] scanning for overrides: TextFieldView
[junit] scanning for overrides: TextInputView
[junit] scanning for overrides: TextInputWithBorderView
[junit] scanning for overrides: TextItemRendererFactoryForArrayData
[junit] scanning for overrides: VScrollBarView
[junit] scanning for overrides: IContainerBaseStrandChildrenHost
[junit] scanning for overrides: ContainerBase
[junit] scanning for overrides: IItemRendererProvider
[junit] scanning for overrides: DataContainerBase
[junit] scanning for overrides: IStrandWithPresentationModel
[junit] scanning for overrides: DataContainer
[junit] scanning for overrides: List
[junit] scanning for overrides: IPopUp
[junit] scanning for overrides: ComboBoxList
[junit] scanning for overrides: ContainerContentArea
[junit] scanning for overrides: DataGroup
[junit] scanning for overrides: SimpleList
[junit] scanning for overrides: DropDownListList
[junit] scanning for overrides: IViewport
[junit] scanning for overrides: Viewport
[junit] scanning for overrides: IScrollingViewport
[junit] scanning for overrides: ScrollingViewport
[junit] scanning for overrides: IItemRenderer
[junit] scanning for overrides: ISelectableItemRenderer
[junit] scanning for overrides: ITextItemRenderer
[junit] scanning for overrides: UIItemRendererBase
[junit] scanning for overrides: DataItemRenderer
[junit] scanning for overrides: StringItemRenderer
[junit] scanning for overrides: IInputParser
[junit] scanning for overrides: JSONInputParser
[junit] scanning for overrides: ICollection
[junit] scanning for overrides: LazyCollection
[junit] scanning for overrides: IValuesImpl
[junit] scanning for overrides: IItemRendererClassFactory
[junit] scanning for overrides: ItemRendererClassFactory
[junit] scanning for overrides: IBorderPaddingMarginValuesImpl
[junit] scanning for overrides: ICSSImpl
[junit] scanning for overrides: SimpleCSSValuesImpl
[junit] scanning for overrides: CSSClass
[junit] scanning for overrides: CSSFactory
[junit] scanning for overrides: CSSDataType
[junit] scanning for overrides: ValuesManager
[junit] scanning for overrides: MouseEventConverter
[junit] scanning for overrides: IRoyaleEvent
[junit] scanning for overrides: Event
[junit] scanning for overrides: MXMLDataInterpreter
[junit] scanning for overrides: HTTPServiceBase
[junit] scanning for overrides: HTTPService
[junit] scanning for overrides: RoyaleTest_again
[junit] scanning for overrides: ButtonAutoRepeatController
[junit] scanning for overrides: IListPresentationModel
[junit] scanning for overrides: ListPresentationModel
[junit] scanning for overrides: DataFieldProviderBead
[junit] scanning for overrides: DownArrowButtonView
[junit] scanning for overrides: HScrollBarThumbView
[junit] scanning for overrides: HScrollBarTrackView
[junit] scanning for overrides: LeftArrowButtonView
[junit] scanning for overrides: RightArrowButtonView
[junit] scanning for overrides: TextButtonView
[junit] scanning for overrides: UpArrowButtonView
[junit] scanning for overrides: VScrollBarThumbView
[junit] scanning for overrides: VScrollBarTrackView
[junit] scanning for overrides: Border
[junit] scanning for overrides: IChrome
[junit] scanning for overrides: IViewportScroller
[junit] scanning for overrides: ScrollBar
[junit] scanning for overrides: HScrollBar
[junit] scanning for overrides: VScrollBar
[junit] scanning for overrides: UIButtonBase
[junit] scanning for overrides: ButtonBase
[junit] scanning for overrides: Button
[junit] scanning for overrides: ISelectable
[junit] scanning for overrides: CheckBox
[junit] scanning for overrides: ComboBox
[junit] scanning for overrides: DropDownList
[junit] scanning for overrides: Label
[junit] scanning for overrides: RadioButton
[junit] scanning for overrides: TextArea
[junit] scanning for overrides: TextButton
[junit] scanning for overrides: ITextInput
[junit] scanning for overrides: TextInput
[junit] scanning for overrides: IBinding
[junit] scanning for overrides: ConstantBinding
[junit] scanning for overrides: SimpleBinding
[junit] scanning for overrides: EdgeData
[junit] scanning for overrides: LayoutData
[junit] scanning for overrides: MarginData
[junit] scanning for overrides: BorderStyles
[junit] scanning for overrides: CSSTextField
[junit] scanning for overrides: IFactory
[junit] scanning for overrides: ClassFactory
[junit] scanning for overrides: ContainerBaseStrandChildren
[junit] scanning for overrides: IState
[junit] scanning for overrides: IStatesImpl
[junit] scanning for overrides: IStyleObject
[junit] scanning for overrides: SimpleCSSStyles
[junit] scanning for overrides: StageProxy
[junit] scanning for overrides: IHandlesOriginalEvent
[junit] scanning for overrides: CustomEvent
[junit] scanning for overrides: ItemAddedEvent
[junit] scanning for overrides: ItemClickedEvent
[junit] scanning for overrides: ItemRemovedEvent
[junit] scanning for overrides: ItemRendererEvent
[junit] scanning for overrides: MouseEvent
[junit] scanning for overrides: ValueChangeEvent
[junit] scanning for overrides: ValueEvent
[junit] scanning for overrides: Point
[junit] scanning for overrides: Size
[junit] scanning for overrides: CSSBorderUtils
[junit] scanning for overrides: CSSUtils
[junit] scanning for overrides: PointUtils
[junit] scanning for overrides: SolidBorderUtil
[junit] scanning for overrides: StringTrimmer
[junit] scanning for overrides: StringUtil
[junit] scanning for overrides: Timer
[junit] scanning for overrides: UIUtils
[junit] scanning for overrides: HTTPConstants
[junit] scanning for overrides: HTTPHeader
[junit] scanning for overrides: StringPadder
[junit] 52355 bytes written to C:\jenkins\workspace\royale-compiler-integration-tests\compiler-jx\target\junit-temp\bin-debug\RoyaleTest_again_Flash.swf in 0.931 seconds
[junit] <http://apacheroyaleci2.westus2.cloudapp.azure.com:8080/job/royale-compiler-integration-tests/ws/compiler-jx/target/test-classes/royale/files/RoyaleTest_again_Flash.mxml(25)>: col: 59 Error: Access of possibly undefined property scrollRect.
[junit]
[junit] initialize="MyModel(model).labelText='Hello World'; scrollRect = null"
[junit] ^
[junit]
[junit] Tests run: 19, Failures: 1, Errors: 0, Skipped: 0, Time elapsed: 54.311 sec
[junit] Picked up JAVA_TOOL_OPTIONS: -Dfile.encoding=UTF-8 -Xms384m -Xmx2g
BUILD FAILED
<http://apacheroyaleci2.westus2.cloudapp.azure.com:8080/job/royale-compiler-integration-tests/ws/build.xml>:785: The following error occurred while executing this line:
<http://apacheroyaleci2.westus2.cloudapp.azure.com:8080/job/royale-compiler-integration-tests/ws/compiler-jx/src/test/build.xml>:126: Tests failed
Total time: 1 minute 37 seconds
Picked up JAVA_TOOL_OPTIONS: -Dfile.encoding=UTF-8 -Xms384m -Xmx2g
Build step 'Invoke Ant' marked build as failure
Recording test results
Jenkins build is back to normal : royale-compiler-integration-tests
#17
Posted by ap...@gmail.com.
See <http://apacheroyaleci2.westus2.cloudapp.azure.com:8080/job/royale-compiler-integration-tests/17/display/redirect>
Build failed in Jenkins: royale-compiler-integration-tests #16
Posted by ap...@gmail.com.
See <http://apacheroyaleci2.westus2.cloudapp.azure.com:8080/job/royale-compiler-integration-tests/16/display/redirect>
Changes:
------------------------------------------
[...truncated 55.57 KB...]
download-dependency:
[echo] basedir is <http://apacheroyaleci2.westus2.cloudapp.azure.com:8080/job/royale-compiler-integration-tests/ws/compiler/src/main/resources>
[echo] ROYALE_COMPILER_HOME is <http://apacheroyaleci2.westus2.cloudapp.azure.com:8080/job/royale-compiler-integration-tests/ws/compiler>
[echo] ROYALE_COMPILER_HOME is <http://apacheroyaleci2.westus2.cloudapp.azure.com:8080/job/royale-compiler-integration-tests/ws/compiler>
check-dependency:
[echo] checking for <http://apacheroyaleci2.westus2.cloudapp.azure.com:8080/job/royale-compiler-integration-tests/ws/compiler/lib/external//guava.jar>
download-dependency:
[echo] basedir is <http://apacheroyaleci2.westus2.cloudapp.azure.com:8080/job/royale-compiler-integration-tests/ws/compiler/src/main/resources>
[echo] ROYALE_COMPILER_HOME is <http://apacheroyaleci2.westus2.cloudapp.azure.com:8080/job/royale-compiler-integration-tests/ws/compiler>
[echo] ROYALE_COMPILER_HOME is <http://apacheroyaleci2.westus2.cloudapp.azure.com:8080/job/royale-compiler-integration-tests/ws/compiler>
check-dependency:
[echo] checking for <http://apacheroyaleci2.westus2.cloudapp.azure.com:8080/job/royale-compiler-integration-tests/ws/compiler/lib/external//jburg.jar>
download-dependency:
[echo] basedir is <http://apacheroyaleci2.westus2.cloudapp.azure.com:8080/job/royale-compiler-integration-tests/ws/compiler/src/main/resources>
[echo] ROYALE_COMPILER_HOME is <http://apacheroyaleci2.westus2.cloudapp.azure.com:8080/job/royale-compiler-integration-tests/ws/compiler>
[echo] ROYALE_COMPILER_HOME is <http://apacheroyaleci2.westus2.cloudapp.azure.com:8080/job/royale-compiler-integration-tests/ws/compiler>
check-dependency:
[echo] checking for <http://apacheroyaleci2.westus2.cloudapp.azure.com:8080/job/royale-compiler-integration-tests/ws/compiler/lib/external//jflex.jar>
download-dependency:
[copy] Warning: <http://apacheroyaleci2.westus2.cloudapp.azure.com:8080/job/royale-compiler-integration-tests/ws/compiler/in/temp/jflex-1.6.0> does not exist.
[echo] basedir is <http://apacheroyaleci2.westus2.cloudapp.azure.com:8080/job/royale-compiler-integration-tests/ws/compiler/src/main/resources>
[echo] ROYALE_COMPILER_HOME is <http://apacheroyaleci2.westus2.cloudapp.azure.com:8080/job/royale-compiler-integration-tests/ws/compiler>
[echo] ROYALE_COMPILER_HOME is <http://apacheroyaleci2.westus2.cloudapp.azure.com:8080/job/royale-compiler-integration-tests/ws/compiler>
check-dependency:
[echo] checking for <http://apacheroyaleci2.westus2.cloudapp.azure.com:8080/job/royale-compiler-integration-tests/ws/compiler/lib/external//lzma-sdk.jar>
download-dependency:
[echo] basedir is <http://apacheroyaleci2.westus2.cloudapp.azure.com:8080/job/royale-compiler-integration-tests/ws/compiler/src/main/resources>
[echo] ROYALE_COMPILER_HOME is <http://apacheroyaleci2.westus2.cloudapp.azure.com:8080/job/royale-compiler-integration-tests/ws/compiler>
[echo] ROYALE_COMPILER_HOME is <http://apacheroyaleci2.westus2.cloudapp.azure.com:8080/job/royale-compiler-integration-tests/ws/compiler>
check-dependency:
[echo] checking for <http://apacheroyaleci2.westus2.cloudapp.azure.com:8080/job/royale-compiler-integration-tests/ws/compiler/lib/external//flex-tool-api.jar>
download-dependency:
main:
setup:
set.raw.as.tokenizer.uptodate:
raw.as.tokenizer:
set.raw.asdoc.tokenizer.uptodate:
raw.asdoc.tokenizer:
set.raw.mxml.tokenizer.uptodate:
raw.mxml.tokenizer:
jflex:
set.as.parser.uptodate:
as.parser:
set.metadata.parser.uptodate:
metadata.parser:
set.css.lexer.and.parser.uptodate:
css.lexer.and.parser:
[echo] Generating CSSLexer and CSSParser
[java] Picked up JAVA_TOOL_OPTIONS: -Dfile.encoding=UTF-8 -Xms384m -Xmx2g
[java] searching for generated date line starting with: 'CSS.g'
[java] and comment starting with: '// $ANTLR 3.5.2 '
[java] Annotation @SuppressWarnings("all") already added to class: <http://apacheroyaleci2.westus2.cloudapp.azure.com:8080/job/royale-compiler-integration-tests/ws/compiler/target/generated-sources/antlr3/org/apache/royale/compiler/internal/css/CSSLexer.java>
[java] searching for generated date line starting with: 'CSS.g'
[java] and comment starting with: '// $ANTLR 3.5.2 '
[java] Annotation @SuppressWarnings("all") already added to class: <http://apacheroyaleci2.westus2.cloudapp.azure.com:8080/job/royale-compiler-integration-tests/ws/compiler/target/generated-sources/antlr3/org/apache/royale/compiler/internal/css/CSSParser.java>
set.css.tree.uptodate:
css.tree:
antlr:
set.unknown.tree.handler.patterns.uptodate:
unknown.tree.handler.patterns:
set.cmc.emitter.uptodate:
cmc.emitter:
set.css.emitter.uptodate:
css.emitter:
jburg:
eclipse:
src.depend:
[depend] Deleted 27 out of date files in 0 seconds
compile:
[javac] Compiling 3 source files to <http://apacheroyaleci2.westus2.cloudapp.azure.com:8080/job/royale-compiler-integration-tests/ws/compiler/target/classes>
[javac] warning: [options] bootstrap class path not set in conjunction with -source 1.6
[javac] 1 warning
version-info:
set.compiler.jar.uptodate:
compiler.jar:
[jar] Building jar: <http://apacheroyaleci2.westus2.cloudapp.azure.com:8080/job/royale-compiler-integration-tests/ws/compiler/lib/compiler.jar>
set.royale.asc.jar.uptodate:
royale.asc.jar:
[jar] Building jar: <http://apacheroyaleci2.westus2.cloudapp.azure.com:8080/job/royale-compiler-integration-tests/ws/compiler/lib/compiler-asc.jar>
set.royale.mxmlc.jar.uptodate:
royale.mxmlc.jar:
[jar] Building jar: <http://apacheroyaleci2.westus2.cloudapp.azure.com:8080/job/royale-compiler-integration-tests/ws/compiler/lib/compiler-mxmlc.jar>
set.royale.compc.jar.uptodate:
royale.compc.jar:
[jar] Building jar: <http://apacheroyaleci2.westus2.cloudapp.azure.com:8080/job/royale-compiler-integration-tests/ws/compiler/lib/compiler-compc.jar>
set.royale.optimizer.jar.uptodate:
royale.optimizer.jar:
[jar] Building jar: <http://apacheroyaleci2.westus2.cloudapp.azure.com:8080/job/royale-compiler-integration-tests/ws/compiler/lib/compiler-optimizer.jar>
set.royale.swfdump.jar.uptodate:
royale.swfdump.jar:
[jar] Building jar: <http://apacheroyaleci2.westus2.cloudapp.azure.com:8080/job/royale-compiler-integration-tests/ws/compiler/lib/compiler-swfdump.jar>
jar:
sdk:
main:
[echo] compiler main completed on 11/04/2019 02:37:40 AM
compiler.jx:
prebuild:
[echo] basedir is <http://apacheroyaleci2.westus2.cloudapp.azure.com:8080/job/royale-compiler-integration-tests/ws/compiler-jx/src/main/resources>
[echo] ROYALE_COMPILER_HOME is ${ROYALE_COMPILER_HOME}
[echo] ROYALE_COMPILER_HOME is <http://apacheroyaleci2.westus2.cloudapp.azure.com:8080/job/royale-compiler-integration-tests/ws/compiler-jx>
prepare:
[echo] Making lib directory <http://apacheroyaleci2.westus2.cloudapp.azure.com:8080/job/royale-compiler-integration-tests/ws/compiler-jx/lib>
all:
[echo] basedir is <http://apacheroyaleci2.westus2.cloudapp.azure.com:8080/job/royale-compiler-integration-tests/ws/compiler-jx/src/main/resources>
[echo] ROYALE_COMPILER_HOME is <http://apacheroyaleci2.westus2.cloudapp.azure.com:8080/job/royale-compiler-integration-tests/ws/compiler-jx>
[echo] ROYALE_COMPILER_HOME is <http://apacheroyaleci2.westus2.cloudapp.azure.com:8080/job/royale-compiler-integration-tests/ws/compiler-jx>
check-dependency:
download-dependency:
[get] Getting: https://raw.githubusercontent.com/kohsuke/args4j/master/LICENSE
[get] To: <http://apacheroyaleci2.westus2.cloudapp.azure.com:8080/job/royale-compiler-integration-tests/ws/compiler-jx/lib/args4j-LICENSE.txt>
[echo] basedir is <http://apacheroyaleci2.westus2.cloudapp.azure.com:8080/job/royale-compiler-integration-tests/ws/compiler-jx/src/main/resources>
[echo] ROYALE_COMPILER_HOME is <http://apacheroyaleci2.westus2.cloudapp.azure.com:8080/job/royale-compiler-integration-tests/ws/compiler-jx>
[echo] ROYALE_COMPILER_HOME is <http://apacheroyaleci2.westus2.cloudapp.azure.com:8080/job/royale-compiler-integration-tests/ws/compiler-jx>
check-dependency-closure:
download-dependency-closure:
[echo] basedir is <http://apacheroyaleci2.westus2.cloudapp.azure.com:8080/job/royale-compiler-integration-tests/ws/compiler-jx/src/main/resources>
[echo] ROYALE_COMPILER_HOME is <http://apacheroyaleci2.westus2.cloudapp.azure.com:8080/job/royale-compiler-integration-tests/ws/compiler-jx>
[echo] ROYALE_COMPILER_HOME is <http://apacheroyaleci2.westus2.cloudapp.azure.com:8080/job/royale-compiler-integration-tests/ws/compiler-jx>
check-dependency:
download-dependency:
[echo] basedir is <http://apacheroyaleci2.westus2.cloudapp.azure.com:8080/job/royale-compiler-integration-tests/ws/compiler-jx/src/main/resources>
[echo] ROYALE_COMPILER_HOME is <http://apacheroyaleci2.westus2.cloudapp.azure.com:8080/job/royale-compiler-integration-tests/ws/compiler-jx>
[echo] ROYALE_COMPILER_HOME is <http://apacheroyaleci2.westus2.cloudapp.azure.com:8080/job/royale-compiler-integration-tests/ws/compiler-jx>
check-dependency:
download-dependency:
[echo] basedir is <http://apacheroyaleci2.westus2.cloudapp.azure.com:8080/job/royale-compiler-integration-tests/ws/compiler-jx/src/main/resources>
[echo] ROYALE_COMPILER_HOME is <http://apacheroyaleci2.westus2.cloudapp.azure.com:8080/job/royale-compiler-integration-tests/ws/compiler-jx>
[echo] ROYALE_COMPILER_HOME is <http://apacheroyaleci2.westus2.cloudapp.azure.com:8080/job/royale-compiler-integration-tests/ws/compiler-jx>
check-dependency:
download-dependency:
main:
compile:
[javac] <http://apacheroyaleci2.westus2.cloudapp.azure.com:8080/job/royale-compiler-integration-tests/ws/compiler-jx/build.xml>:91: warning: 'includeantruntime' was not set, defaulting to build.sysclasspath=last; set to false for repeatable builds
main:
[echo] Building c:/jenkins/workspace/royale-compiler-integration-tests/compiler-jx/lib/jsc.jar
[jar] Building jar: <http://apacheroyaleci2.westus2.cloudapp.azure.com:8080/job/royale-compiler-integration-tests/ws/compiler-jx/lib/jsc.jar>
[echo] Building c:/jenkins/workspace/royale-compiler-integration-tests/compiler-jx/lib/mxmlc.jar
[jar] Building jar: <http://apacheroyaleci2.westus2.cloudapp.azure.com:8080/job/royale-compiler-integration-tests/ws/compiler-jx/lib/mxmlc.jar>
[echo] Building c:/jenkins/workspace/royale-compiler-integration-tests/compiler-jx/lib/compc.jar
[jar] Building jar: <http://apacheroyaleci2.westus2.cloudapp.azure.com:8080/job/royale-compiler-integration-tests/ws/compiler-jx/lib/compc.jar>
[echo] Building c:/jenkins/workspace/royale-compiler-integration-tests/compiler-jx/lib/asdoc.jar
[jar] Building jar: <http://apacheroyaleci2.westus2.cloudapp.azure.com:8080/job/royale-compiler-integration-tests/ws/compiler-jx/lib/asdoc.jar>
anttasks:
compile:
set.royale.royaletasks.jar.uptodate:
royale.royaletasks.jar:
jar:
BUILD SUCCESSFUL
Total time: 33 seconds
Picked up JAVA_TOOL_OPTIONS: -Dfile.encoding=UTF-8 -Xms384m -Xmx2g
[test] $ cmd.exe /C "C:\apache\apache-ant-1.9.9\bin\ant.bat -file build.xml -Denv.FLASHPLAYER_DEBUGGER=C:\adobe\flash\11.7\flashplayerdebugger.exe -Denv.PLAYERGLOBAL_HOME=C:\adobe\flash -Dbuild.number=16 -Denv.AIR_HOME=C:\adobe\air\4.0\AdobeAIRSDK -Denv.PLAYERGLOBAL_VERSION=11.7 -Denv.ASJS_HOME=C:\jenkins\workspace\royale-asjs custom.swc && exit %%ERRORLEVEL%%"
Buildfile: <http://apacheroyaleci2.westus2.cloudapp.azure.com:8080/job/royale-compiler-integration-tests/ws/compiler/src/test/build.xml>
custom.swc:
[copy] Copying 1 file to <http://apacheroyaleci2.westus2.cloudapp.azure.com:8080/job/royale-compiler-integration-tests/ws/compiler/target>
[java] Loading configuration: <http://apacheroyaleci2.westus2.cloudapp.azure.com:8080/job/royale-compiler-integration-tests/ws/compiler/target/compile-as-config.xml>
[java]
[java] <http://apacheroyaleci2.westus2.cloudapp.azure.com:8080/job/royale-compiler-integration-tests/ws/compiler/target/compile-as-config.xml(30)>: col: 0 Error: unable to open '<http://apacheroyaleci2.westus2.cloudapp.azure.com:8080/job/royale-compiler-integration-tests/ws/compiler-externc/target/js.swc'.>
[java] <http://apacheroyaleci2.westus2.cloudapp.azure.com:8080/job/royale-compiler-integration-tests/ws/compiler/target/compile-as-config.xml> (line: 30)
[java]
[java] </external-library-path>
[java]
[java]
[java] Picked up JAVA_TOOL_OPTIONS: -Dfile.encoding=UTF-8 -Xms384m -Xmx2g
BUILD FAILED
<http://apacheroyaleci2.westus2.cloudapp.azure.com:8080/job/royale-compiler-integration-tests/ws/compiler/src/test/build.xml>:86: Java returned: 5
Total time: 0 seconds
Picked up JAVA_TOOL_OPTIONS: -Dfile.encoding=UTF-8 -Xms384m -Xmx2g
Build step 'Invoke Ant' marked build as failure
Recording test results
Build failed in Jenkins: royale-compiler-integration-tests #15
Posted by ap...@gmail.com.
See <http://apacheroyaleci2.westus2.cloudapp.azure.com:8080/job/royale-compiler-integration-tests/15/display/redirect?page=changes>
Changes:
[aharui] some tests change the default bnding event (stored in a static) so force
------------------------------------------
[...truncated 157.33 KB...]
[junit] scanning for overrides: IEventDispatcher
[junit] scanning for overrides: IInitialViewApplication
[junit] scanning for overrides: IParent
[junit] scanning for overrides: IPopUpHost
[junit] scanning for overrides: IPopUpHostParent
[junit] scanning for overrides: IRenderedObject
[junit] scanning for overrides: IStrand
[junit] scanning for overrides: Application
[junit] scanning for overrides: RoyaleTest_again_Flash
[junit] scanning for overrides: IDocument
[junit] scanning for overrides: MyController
[junit] scanning for overrides: HTMLElementWrapper
[junit] scanning for overrides: IId
[junit] scanning for overrides: IChild
[junit] scanning for overrides: IUIBase
[junit] scanning for overrides: ILayoutChild
[junit] scanning for overrides: IParentIUIBase
[junit] scanning for overrides: IRoyaleElement
[junit] scanning for overrides: IStrandWithModel
[junit] scanning for overrides: IStrandWithModelView
[junit] scanning for overrides: IStyleableObject
[junit] scanning for overrides: UIBase
[junit] scanning for overrides: IContainer
[junit] scanning for overrides: IContentViewHost
[junit] scanning for overrides: ILayoutParent
[junit] scanning for overrides: ILayoutView
[junit] scanning for overrides: IStatesObject
[junit] scanning for overrides: GroupBase
[junit] scanning for overrides: IApplicationView
[junit] scanning for overrides: ViewBase
[junit] scanning for overrides: IMXMLDocument
[junit] scanning for overrides: View
[junit] scanning for overrides: MyInitialView
[junit] scanning for overrides: IItemConverter
[junit] scanning for overrides: JSONItemConverter
[junit] scanning for overrides: StockDataJSONItemConverter
[junit] scanning for overrides: EventDispatcher
[junit] scanning for overrides: MyModel
[junit] scanning for overrides: IBead
[junit] scanning for overrides: IBeadController
[junit] scanning for overrides: ComboBoxController
[junit] scanning for overrides: DropDownListController
[junit] scanning for overrides: EditableTextKeyboardController
[junit] scanning for overrides: ScrollBarMouseControllerBase
[junit] scanning for overrides: HScrollBarMouseController
[junit] scanning for overrides: ItemRendererMouseController
[junit] scanning for overrides: ListSingleSelectionMouseController
[junit] scanning for overrides: VScrollBarMouseController
[junit] scanning for overrides: IBeadLayout
[junit] scanning for overrides: LayoutBase
[junit] scanning for overrides: BasicLayout
[junit] scanning for overrides: HScrollBarLayout
[junit] scanning for overrides: VScrollBarLayout
[junit] scanning for overrides: VerticalLayout
[junit] scanning for overrides: IBeadModel
[junit] scanning for overrides: IRollOverModel
[junit] scanning for overrides: IDataProviderModel
[junit] scanning for overrides: ISelectionModel
[junit] scanning for overrides: ArraySelectionModel
[junit] scanning for overrides: IComboBoxModel
[junit] scanning for overrides: ComboBoxModel
[junit] scanning for overrides: DataProviderModel
[junit] scanning for overrides: IRangeModel
[junit] scanning for overrides: RangeModel
[junit] scanning for overrides: IScrollBarModel
[junit] scanning for overrides: ScrollBarModel
[junit] scanning for overrides: IBorderModel
[junit] scanning for overrides: SingleLineBorderModel
[junit] scanning for overrides: ITextModel
[junit] scanning for overrides: TextModel
[junit] scanning for overrides: IToggleButtonModel
[junit] scanning for overrides: ToggleButtonModel
[junit] scanning for overrides: IValueToggleButtonModel
[junit] scanning for overrides: ValueToggleButtonModel
[junit] scanning for overrides: IViewportModel
[junit] scanning for overrides: ViewportModel
[junit] scanning for overrides: IBeadView
[junit] scanning for overrides: BeadViewBase
[junit] scanning for overrides: CSSButtonView
[junit] scanning for overrides: CSSTextButtonView
[junit] scanning for overrides: CheckBoxView
[junit] scanning for overrides: IViewWithPopUp
[junit] scanning for overrides: IComboBoxView
[junit] scanning for overrides: ComboBoxView
[junit] scanning for overrides: ILayoutHost
[junit] scanning for overrides: GroupView
[junit] scanning for overrides: ContainerView
[junit] scanning for overrides: IItemRendererParent
[junit] scanning for overrides: IListView
[junit] scanning for overrides: DataContainerView
[junit] scanning for overrides: IDataProviderItemRendererMapper
[junit] scanning for overrides: DataItemRendererFactoryForArrayData
[junit] scanning for overrides: IDropDownListView
[junit] scanning for overrides: DropDownListView
[junit] scanning for overrides: IScrollBarView
[junit] scanning for overrides: Strand
[junit] scanning for overrides: ScrollBarView
[junit] scanning for overrides: HScrollBarView
[junit] scanning for overrides: ListView
[junit] scanning for overrides: RadioButtonView
[junit] scanning for overrides: IGraphicsDrawing
[junit] scanning for overrides: IBorderBead
[junit] scanning for overrides: SingleLineBorderBead
[junit] scanning for overrides: IBackgroundBead
[junit] scanning for overrides: SolidBackgroundBead
[junit] scanning for overrides: ITextFieldView
[junit] scanning for overrides: TextFieldViewBase
[junit] scanning for overrides: TextAreaView
[junit] scanning for overrides: IMeasurementBead
[junit] scanning for overrides: TextButtonMeasurementBead
[junit] scanning for overrides: TextFieldLabelMeasurementBead
[junit] scanning for overrides: TextFieldView
[junit] scanning for overrides: TextInputView
[junit] scanning for overrides: TextInputWithBorderView
[junit] scanning for overrides: TextItemRendererFactoryForArrayData
[junit] scanning for overrides: VScrollBarView
[junit] scanning for overrides: IContainerBaseStrandChildrenHost
[junit] scanning for overrides: ContainerBase
[junit] scanning for overrides: IItemRendererProvider
[junit] scanning for overrides: DataContainerBase
[junit] scanning for overrides: IStrandWithPresentationModel
[junit] scanning for overrides: DataContainer
[junit] scanning for overrides: List
[junit] scanning for overrides: IPopUp
[junit] scanning for overrides: ComboBoxList
[junit] scanning for overrides: ContainerContentArea
[junit] scanning for overrides: DataGroup
[junit] scanning for overrides: SimpleList
[junit] scanning for overrides: DropDownListList
[junit] scanning for overrides: IViewport
[junit] scanning for overrides: Viewport
[junit] scanning for overrides: IScrollingViewport
[junit] scanning for overrides: ScrollingViewport
[junit] scanning for overrides: IItemRenderer
[junit] scanning for overrides: ISelectableItemRenderer
[junit] scanning for overrides: ITextItemRenderer
[junit] scanning for overrides: UIItemRendererBase
[junit] scanning for overrides: DataItemRenderer
[junit] scanning for overrides: StringItemRenderer
[junit] scanning for overrides: IInputParser
[junit] scanning for overrides: JSONInputParser
[junit] scanning for overrides: ICollection
[junit] scanning for overrides: LazyCollection
[junit] scanning for overrides: IValuesImpl
[junit] scanning for overrides: IItemRendererClassFactory
[junit] scanning for overrides: ItemRendererClassFactory
[junit] scanning for overrides: IBorderPaddingMarginValuesImpl
[junit] scanning for overrides: ICSSImpl
[junit] scanning for overrides: SimpleCSSValuesImpl
[junit] scanning for overrides: CSSClass
[junit] scanning for overrides: CSSFactory
[junit] scanning for overrides: CSSDataType
[junit] scanning for overrides: ValuesManager
[junit] scanning for overrides: MouseEventConverter
[junit] scanning for overrides: IRoyaleEvent
[junit] scanning for overrides: Event
[junit] scanning for overrides: MXMLDataInterpreter
[junit] scanning for overrides: HTTPServiceBase
[junit] scanning for overrides: HTTPService
[junit] scanning for overrides: RoyaleTest_again
[junit] scanning for overrides: ButtonAutoRepeatController
[junit] scanning for overrides: IListPresentationModel
[junit] scanning for overrides: ListPresentationModel
[junit] scanning for overrides: DataFieldProviderBead
[junit] scanning for overrides: DownArrowButtonView
[junit] scanning for overrides: HScrollBarThumbView
[junit] scanning for overrides: HScrollBarTrackView
[junit] scanning for overrides: LeftArrowButtonView
[junit] scanning for overrides: RightArrowButtonView
[junit] scanning for overrides: TextButtonView
[junit] scanning for overrides: UpArrowButtonView
[junit] scanning for overrides: VScrollBarThumbView
[junit] scanning for overrides: VScrollBarTrackView
[junit] scanning for overrides: Border
[junit] scanning for overrides: IChrome
[junit] scanning for overrides: IViewportScroller
[junit] scanning for overrides: ScrollBar
[junit] scanning for overrides: HScrollBar
[junit] scanning for overrides: VScrollBar
[junit] scanning for overrides: UIButtonBase
[junit] scanning for overrides: ButtonBase
[junit] scanning for overrides: Button
[junit] scanning for overrides: ISelectable
[junit] scanning for overrides: CheckBox
[junit] scanning for overrides: ComboBox
[junit] scanning for overrides: DropDownList
[junit] scanning for overrides: Label
[junit] scanning for overrides: RadioButton
[junit] scanning for overrides: TextArea
[junit] scanning for overrides: TextButton
[junit] scanning for overrides: ITextInput
[junit] scanning for overrides: TextInput
[junit] scanning for overrides: IBinding
[junit] scanning for overrides: ConstantBinding
[junit] scanning for overrides: SimpleBinding
[junit] scanning for overrides: EdgeData
[junit] scanning for overrides: LayoutData
[junit] scanning for overrides: MarginData
[junit] scanning for overrides: BorderStyles
[junit] scanning for overrides: CSSTextField
[junit] scanning for overrides: IFactory
[junit] scanning for overrides: ClassFactory
[junit] scanning for overrides: ContainerBaseStrandChildren
[junit] scanning for overrides: IState
[junit] scanning for overrides: IStatesImpl
[junit] scanning for overrides: IStyleObject
[junit] scanning for overrides: SimpleCSSStyles
[junit] scanning for overrides: StageProxy
[junit] scanning for overrides: IHandlesOriginalEvent
[junit] scanning for overrides: CustomEvent
[junit] scanning for overrides: ItemAddedEvent
[junit] scanning for overrides: ItemClickedEvent
[junit] scanning for overrides: ItemRemovedEvent
[junit] scanning for overrides: ItemRendererEvent
[junit] scanning for overrides: MouseEvent
[junit] scanning for overrides: ValueChangeEvent
[junit] scanning for overrides: ValueEvent
[junit] scanning for overrides: Point
[junit] scanning for overrides: Size
[junit] scanning for overrides: CSSBorderUtils
[junit] scanning for overrides: CSSUtils
[junit] scanning for overrides: PointUtils
[junit] scanning for overrides: SolidBorderUtil
[junit] scanning for overrides: StringTrimmer
[junit] scanning for overrides: StringUtil
[junit] scanning for overrides: Timer
[junit] scanning for overrides: UIUtils
[junit] scanning for overrides: HTTPConstants
[junit] scanning for overrides: HTTPHeader
[junit] scanning for overrides: StringPadder
[junit] 52306 bytes written to C:\jenkins\workspace\royale-compiler-integration-tests\compiler-jx\target\junit-temp\bin-debug\RoyaleTest_again_Flash.swf in 0.978 seconds
[junit] <http://apacheroyaleci2.westus2.cloudapp.azure.com:8080/job/royale-compiler-integration-tests/ws/compiler-jx/target/test-classes/royale/files/RoyaleTest_again_Flash.mxml(25)>: col: 59 Error: Access of possibly undefined property scrollRect.
[junit]
[junit] initialize="MyModel(model).labelText='Hello World'; scrollRect = null"
[junit] ^
[junit]
[junit] Tests run: 19, Failures: 0, Errors: 0, Skipped: 0, Time elapsed: 52.765 sec
[junit] Running org.apache.royale.compiler.internal.codegen.mxml.royale.TestRoyaleMXMLScript
[junit] Tests run: 4, Failures: 0, Errors: 1, Skipped: 0, Time elapsed: 0.533 sec
[junit] Picked up JAVA_TOOL_OPTIONS: -Dfile.encoding=UTF-8 -Xms384m -Xmx2g
BUILD FAILED
<http://apacheroyaleci2.westus2.cloudapp.azure.com:8080/job/royale-compiler-integration-tests/ws/build.xml>:785: The following error occurred while executing this line:
<http://apacheroyaleci2.westus2.cloudapp.azure.com:8080/job/royale-compiler-integration-tests/ws/compiler-jx/src/test/build.xml>:126: Tests failed
Total time: 1 minute 35 seconds
Picked up JAVA_TOOL_OPTIONS: -Dfile.encoding=UTF-8 -Xms384m -Xmx2g
Build step 'Invoke Ant' marked build as failure
Recording test results